##TITLE=Luva latex $$ Begin of the data block
##JCAMP-DX=5.00 $$ ACD/SpecManager v 10.08
##SPECTROMETER/DATA SYSTEM=Alpha
##DATE=23 Dec 2014 14:28:26
##DATA TYPE=INFRARED SPECTRUM
##DATA CLASS=XYDATA
##ORIGIN=
##OWNER=
##NPOINTS=1765
##FIRSTX=399.76428223
##LASTX=3997.64306641
##MAXX=3997.64306641
##MINX=399.76428223
##MAXY=0.82063663
##MINY=0.00446878
##XFACTOR=1.0000000000
##YFACTOR=1.000000000000000e-9
##FIRSTY=0.75256139
##DELTAX=2.03961372
##XUNITS=1/CM
##YUNITS=ARBITRARY UNITS
##XYDATA=(X++(Y..Y))
399.8G52561390P509947N523265L834784K332985J344204J159906Q38101j256704m007101
418.1G69840777j293182K614319K213538K075553K165257J449049O57976K48730J057327
436.5G81029344J716494K66791p51615L75569J389801J253009K82824l97265p09891
454.8G84455061j020610N94556K076626J249194n0306q04603r65000j233816q34346
473.2G83466756k65658j621961l288269m037619m546523l983200k388060j740455j392246
491.5G60202765J7643R59516N28216n18083j073957l99172K96414N59509J115083J696170
511.9G63384104J863718J592517J990914L313124L736794L001154K768159L228485
528.3G84878969L073394K419770J555085O88553K98679j46389j141131k318799l249824
$$ plain form
399.8 752561390 760071337 765594602 769429386 771762371 773106575 774266481 775104582 773847878 769840777
418.1 769840777 768547595 771161914 773375452 775451005 777616262 779065311 779723287 779972017 781029344
436.5 781029344 782745838 783012629 782261014 782636583 784026384 785279393 785562217 785164952 784455061
454.8 784455061 783434451 784029007 786105633 787354827 787304521 786499918 785534918 784301102 783466756
473.2 783466756 783201098 781579137 778290868 774253249 769706726 765723526 763335466 761595011 760202765
491.5 760202765 760220408 761179924 761708140 761190057 760116100 759716928 760013342 760572851 761687934 763384104
511.9 763384104 765247822 766840339 768831253 772144377 775881171 778882325 781650484 784878969
528.3 784878969 787952363 790372133 791927218 792615771 792914450 792768061 791626930 789308131 786058307
546.6G86058307m029870m959286o285429q022487j0157525j2749553j4818847j4524341
562.9G10510969j0856330n267382m07159K131164K710402K882182L572345M478276
579.3G09754467N479217O428063O828248O859124O357372N577564N185961M846633
595.6G57316649M271567M380703N466282O531358P224321P409573O835937N582631
611.9H05019021M118264L000259K195478J490295J005828P34746O62983O88135M33803
630.2H19348812P2897j8955K01881M29571M02152K00272l6240n1617J2994n9188k04265
652.7H20298314k94685l10004j94907J013L22223P48515l21567k099455l79145O52492
673.1H18422794N8771l76046m45903m09066m97759n72204o14941p80583q44776r81629
$$ plain form
546.6 786058307 782028437 777069151 770783722 762761235 752603710 739854157 725035310 710510969
562.9 710510969 699654639 694387257 693980098 696111262 698821664 701703846 705276191 709754467
579.3 709754467 715233684 721661747 728489995 735349119 741706491 747284055 752470016 757316649
595.6 757316649 761588216 765968919 771435201 777966559 785190880 792600453 799436390 805019021
611.9 805019021 809137285 812137544 814333022 815823317 816829145 817563891 818226874 818915009 819348812
630.2 819348812 819421709 819402754 819604635 820034206 820436358 820636630 820600390 820548773 820561767 820502579 820298314
652.7 820298314 820003629 819693625 819498718 819499731 819821954 820570469 820248902 818149447 817770302 818422794
673.1 818422794 818481565 818105519 817659616 817250550 816752791 816180587 815565646 814785063 813940287 812958658
693.5H12958658j431465k049864k769351m149198p007242j3261973k7877033m9308360
709.8G05104172m9460470o429494M1222334M9042821L0261517J2558817L076256j376450
726.1G83999503l243924l132164k724111l249288l472864k373755o84858P77960J592517
744.5G67489016J813591J754999J560926J139701P76589M14967m14133r73344n00023
762.8G73062289O59883K030134L223360L827929L831387L216326K104521Q54373l67761
781.2G92442441j249075j692712k263010l074586l740370m292965m625798m628062
797.5G66875863m687011n154371n820692o542385p423460q436263r745002j1421084
813.8G07645595j3348341j5362561j7215907j8544436j9005358j8336773j6809344
$$ plain form
693.5 812958658 811527193 809477329 806707978 802558780 795551538 782289565 754412532 705104172
709.8 705104172 655643702 649214208 690436542 739479363 769740880 782299697 785375953 783999503
726.1 783999503 780755579 777623415 774899304 771650016 768177152 765803397 765118539 765896499 767489016
744.5 767489016 769302607 771057606 772618532 773758233 774534822 774949789 774535656 773562312 773062289
762.8 773062289 773722172 775752306 778975666 782803595 786634982 789851308 791955829 792810202 792442441
781.2 792442441 791193366 789500654 787237644 784163058 780422688 776129723 771503925 766875863
797.5 766875863 762188852 757034481 751213789 744671404 737247944 728811681 719066679 707645595
813.8 707645595 694297254 678934693 661718786 643174350 624168992 605832219 589022875
828.1E89022875j4980197j2834191j0047973o389916k023279K629995P635295J3188839
844.4E66201448J9572199K7425706L1681359K7008712J8610835J2141824P391393L397107
860.7G13430583q97109q108497k6829898p0703805j23066127j28231078o8806589J0847747
877B97635227O7637206Q6604535Q4688634Q3607793P0925891M1051388J8123746J1610031
893.4G61884451J1421502J0558486Q068382N135954K681315P78257p79986j937985
909.7G97810376k696991l131390l385961l596187l713727l572881l105044k405763
926G72202432j654982r28879j62900N55098J082719J298964J169741P86304L36528
944.3G74685025j29342o45161j191437j745343k239585k767503l377676l683746l303886
$$ plain form
828.1 589022875 574042678 561208487 551160514 544770598 542747319 545377314 553012609 566201448
844.4 566201448 585773647 613199353 644880712 671889424 690500259 702642083 710033476 713430583
860.7 713430583 712533474 704424977 677595079 606891274 483825147 355594069 286787480 297635227
877 297635227 365272433 451876968 536565602 620173395 691099286 732150674 750274420 761884451
893.4 761884451 773305953 783864439 791932821 797068775 799750090 800528347 799748361 797810376
909.7 797810376 795113385 791981995 788596034 784999847 781286120 777713239 774608195 772202432
926 772202432 770547450 769618571 769455671 770010769 771093488 772392452 773562193 774348497 774685025
944.3 774685025 774555683 773910522 772719085 770973742 768734157 765966654 762588978 758905232 755601346
962.7G55601346k621054k318204k487003k574206k153277j574099j407087j303434
979G39162982p01905n3167J78873P2599k60234o89685r57370j100481j391649j818597
999.4G32441366k195716k287805k012253j463771o87718K65896J172721J646698J414835
1017.8G28294253O61910l01242j340389k288938l088295l955662n164981o456852o294310
1036.1G00065494k937794K491295O704450Q304715Q386850P876575O691814M803121
1052.4G42386520K529204J44660k393245m997254p386625r084463r385228q227944
1068.8G03585625o740511o019592o022453o138862n842447m999280l733516k380371
1085.1F61708593j497328j283049j222611n79655J222014M508198Q768618J2590170
$$ plain form
962.7 755601346 752980292 750662088 748175085 745600879 743447602 741873503 740466416 739162982
979 739162982 738461077 738407910 738586783 738659382 738399148 737709463 736752093 735651612 734259963 732441366
999.4 732441366 730245650 727957845 725945592 724481821 723794103 724059999 725232720 726879418 728294253
1017.8 728294253 728956163 728654921 727314532 725025594 721937299 717981637 712816656 706359804 700065494
1036.1 700065494 697127700 699618995 706323445 714628160 723015010 730891585 737583399 742386520
1052.4 742386520 744915724 745060384 742667139 737669885 730283260 721198797 711813569 703585625
1068.8 703585625 696845114 690825522 684803069 678664207 672821760 667822480 664088964 661708593
1085.1 661708593 660211265 658928216 657705605 657125950 658347964 662856162 671624780 684214950
1101.4F84214950J4341235J2912750Q742332L955484L18587k295435n244314j0008812
1117.7G06936777j7111361k4176896k5047064j4869511J737177J3677836J6234994
1132F57381952J3463318J0020435P332623N221427L533720K484382K221822K397895
1148.3G04057574K462328K096116J377762N81979o4015m95553o92010n93722m08530
1166.7G08321929m27485n57541n04613j78814K00689L17037P8857l66807q18849j148820
1187.1G04915583j386940j627386j900673k207994k517999k898812l464281m204572
1203.4F84706926m700601m068076j981557K54810Q56757k28166j668513k521157k772093
1221.7F67878330k718032k629518k596498k415776j894116j241505q91448q97884j008153
$$ plain form
1101.4 684214950 698556185 711468935 720211267 724166751 724485338 722189903 716945589 706936777
1117.7 706936777 689825416 665648520 640601456 625731945 627469122 641146958 657381952
1132 657381952 670845270 680865705 688198328 693419755 696953475 699437857 701659679 704057574
1148.3 704057574 706519902 708616018 709993780 710575759 710511744 710016191 709324181 708730459 708321929
1166.7 708321929 707894444 707336903 706832290 706653476 706854165 707171202 707250059 706883252 706064403 704915583
1187.1 704915583 703528643 701901257 700000584 697792590 695274591 692375779 688911498 684706926
1203.4 684706926 680006325 675938249 673956692 674211502 675068259 674840093 673171580 670650423 667878330
1221.7 667878330 665160298 662530780 659934282 657518506 655624390 654382885 653491437 652593553 651585400
1240.1F51585400r38356n41091K17438R88245J406908J352787J072705J052081J339317
1258.4F57535434J740753J760304J056493k08080j448870k009332j760125j629293
1274.8F55037284k323032l463506m604578n358100n389035m374742k693713j490474
1291.1F25340104j919210m113257p432282j0682523j2201548j1252403q811653o487906
1307.4E62439322m658460l446520k641081k031386j647175j326859j391530k077400
1323.7E43218911k744079k835572k678752k424121k628445l738105n540967o512702
1340E14116168o510794p798880j0387183j3185590j5996337j8971622k1513105k1828949
1356.4C97923708j8984169j5414893j2589336j0748774j3728857k4134248l7328631
$$ plain form
1240.1 651585400 650647044 650105953 650323391 651311636 652718544 654071331 655144036 656196117 657535434
1258.4 657535434 659276187 661036491 662092984 661884904 660436034 658426702 656666577 655037284
1274.8 655037284 652714252 649250746 644646168 639288068 633899033 629524291 626830578 625340104
1291.1 625340104 623420894 619307637 611875355 601192832 588991284 577738881 568927228 562439322
1307.4 562439322 557780862 554334342 551693261 549661875 548014700 546687841 545296311 543218911
1323.7 543218911 540474832 537639260 534960508 532536387 529907942 526169837 520628870 514116168
1340 514116168 507605374 499806494 489419311 476233721 460237384 441265762 419752657 397923708
1356.4 397923708 378939539 363524646 350935310 340186536 326457679 302323431 264994800
1370.6B64994800m6812311m1537001j3195053J5017777K1925629R869471n904839j7523080
1386.9A86835393k2445276k1486759k1754042k2418141j8420458j3684615j0548532
1401.2E6077570r228256r687140q744197o798655n235393l754569k547425j912135
1417.5H169800j386331o98638l90242l24140l14133l02988k04696o1678j8176J91235
1437.9D660013K51625J46337P4151J42709L27552N35459O68873O76648J124431K041181
1458.3A0648979K050592J902950K596731L337759L219260L249711M352655N342696
1474.7C6701333N357511N415939N860411O546400O768081P326201R261332J1345692
1491I4582900J0693416J0800437J4138266J6423881J5512362J3252109J4123291K2499398
$$ plain form
1370.6 264994800 218182489 176645488 163450435 178468212 200393841 210263312 204358473 186835393
1386.9 186835393 164390117 142903358 121149316 98731175 80310717 66626102 56077570
1401.2 56077570 46849314 37162174 28417977 21619322 16383929 12629360 10081935 8169800
1417.5 8169800 6783469 6084831 5694589 5370449 5056316 4753328 4548632 4486954 4468778 4660013
1437.9 4660013 4911638 5057975 5132126 5274835 5602387 6137846 6806719 7483367 8607798 10648979
1458.3 10648979 12699571 14602521 17199252 20537011 23756271 27005982 31358637 36701333
1474.7 36701333 42058844 47474783 53335194 59881594 66649675 73975876 83237208 94582900
1491 94582900 105276316 116076753 130215019 146638900 162151262 175403371 189526662 212026060
1507.3B12026060K3205608J8892050J7784655J7742633J8848330J8522322K0426929
1521.6C47448587K1289230J8825739J8681229J6280233J3188988J3304741J1813670
1535.8D60832417P624805R451419J7918408K0184368J8466711J4698029J2176871J0308564
1552.2E71661592P601439L553510J216173R102106J0769606O117940K976775N53549
1568.5F13552690Q24749K055407l09229j12534N297244O910503N551695M283548L391921
1586.8F41445994K971292K851128K586425K309263K185285J666367O95526K94567K7120
1605.2F57032967n84662q41678m51564j281262m013955l766001j26302j207173l222048
1623.5F41538322j607418m91440K17557R5069l261507n416035N73277L487110J198233
$$ plain form
1507.3 212026060 235231668 254123718 271908373 289651006 308499336 327021658 347448587
1521.6 347448587 368737817 387563556 406244785 422525018 435714006 449018747 460832417
1535.8 460832417 468457222 477908641 495827049 516011417 534478128 549176157 561353028 571661592
1552.2 571661592 579263031 582816541 584032714 593134820 603904426 610022366 612999141 613552690
1568.5 613552690 614377439 616432846 616123617 616011083 621308327 628218830 633770525 638054073 641445994
1586.8 641445994 644417286 647268414 649854839 652164102 654349387 656015754 656711280 657005847 657032967
1605.2 657032967 656448305 655606627 655155063 653873801 649859846 646093845 645967543 644760370 641538322
1623.5 641538322 639930904 639439464 639657021 639752090 636490583 631074548 631647825 635134935 636333168
1641.9F36333168k378822o442308m074931l00825o618917j0558188j875937k550423
1658.2F01532817o741703o313383J148164P616162J1377037J6608119J5990674J2013436
1674.5F53231323R890377O911755K840936j112282N05149O375611N799711M161656
1690.9F88604236K353727j036584j632452K44916K666711M197300K434492K205551
1707.2G00037897K771079J070500j722753m373372l302813K921760M317284J640260
1723.5G03359842l2186j347244k991319m484415n648970j359821J162648o01172j70588
1741.9F87886775J301765J149297L27706J011372L781438L967344J556814O05166M22359
1760.2G02010036M63306J686037P47621j549601k962471k299785J106322J821398o99877
$$ plain form
1641.9 636333168 633954346 627512038 623437107 623136282 616517365 605959177 604083240 601532817
1658.2 601532817 594791114 588477731 589625895 597242057 608619094 625227213 641217887 653231323
1674.5 653231323 663121700 670033455 672874391 671762109 672267258 678642869 684442580 688604236
1690.9 688604236 690957963 689921379 688288927 688533843 691200554 695397854 697832346 700037897
1707.2 700037897 702808976 703879476 702156723 697783351 694480538 697402298 701719582 703359842
1723.5 703359842 703327656 701980412 698989093 694504678 688855708 687495887 688658535 688057363 687886775
1741.9 687886775 689188540 690337837 690665543 691676915 695458353 699425697 700982511 701587677 702010036
1760.2 702010036 702473342 704159379 704907000 703357399 700394928 698095143 699201465 701022863 700322986
1778.6G00322986k716482l445864n175590p827163j1278570j6044259j4746249m929780
1794.9F34159029J460909N337716J1352896J5267253J3109386Q231640M171491K517879
1811.2F95608199K484440J798392P22408M23193K38j074433j146078o81698o86825
1829.6F97447836J109064K093256O67929n0783M3511j190006k461434l90589J698017
1847.9F98966801J353622N54919R954k62499m27425l84211k79308o96897k014637k356351
1868.3F94463968L02077K088964J141786J7703k84434k75611k77460l18647o23226
1886.7F96235120j126706m33803L73662o020l040K20775p8618l60668m72724p60734
1907.1F93587244p81656j21236K30611n41687j408816q38756k40147j86622L61383
$$ plain form
1778.6 700322986 697606504 694160640 688985050 681157887 669879317 653835058 639088809 634159029
1794.9 634159029 635619938 640957654 652310550 667577803 680687189 688918829 693090320 695608199
1811.2 695608199 698092639 699891031 700613439 701036632 701036870 699962437 698816359 698134661 697447836
1829.6 697447836 698556900 700650156 701318085 701267302 701310813 700120807 697659373 697268784 698966801
1847.9 698966801 700320423 700875342 700885296 700622797 700195372 699811161 699531853 698834956 696820319 694463968
1868.3 694463968 694766045 696855009 697996795 698014498 697730064 697454453 697176993 696858346 696235120
1886.7 696235120 695108414 694674611 695048273 695042253 695039213 695259988 695181370 694820702 694347978 693587244
1907.1 693587244 692805588 692684352 692914963 692373276 690964460 690125704 689885557 689698935 690060318
1925.4F90060318K93374l32416n48958m85838l84509m21524r00686j407743o44862
1943.8F85227156M16457L57986o7532l78490n29587n06520m88401n00321l97325n00261
1964.2F82633162p72655m07339J20819l3557l44754l96371l70979l82185m36127n37396
1984.6F79072618o75916p74145q91447o05226j4424o9678m39227n40673n24939n56409
2005F73980534o38246o38366n54979o28531r07660r06705n24760m05132o10352p41005
2025.4F67424798p64966p24256o32763n62847n26905n07652n46575m91917k53558j30952
2045.8F62282407j75237k03014j92284j83404j78218j63316j56224k60353m00782l25620
2066.2F60043955k07067k71141l43204l33726l07262k94268k56539j94132k21372l14653
$$ plain form
1925.4 690060318 690353692 690021276 689472318 688986480 688601971 688180447 687279761 685872018 685227156
1943.8 685227156 685643613 686001599 685934067 685555577 685025990 684519470 684031069 683530748 683133423 682633162
1964.2 682633162 681860507 681453168 681573987 681540430 681195676 680799305 680428326 680046141 679610014 679072618
1984.6 679072618 678396702 677622557 676731110 676125884 676111460 676041782 675602555 675061882 674536943 673980534
2005 673980534 673342288 672703922 672148943 671520412 670612752 669706047 669181287 668776155 668165803 667424798
2025.4 667424798 666659832 665935576 665302813 664739966 664213061 663705409 663158834 662666917 662413359 662282407
2045.8 662282407 662107170 661904156 661711872 661528468 661350250 661186934 661030710 660770357 660369575 660043955
2066.2 660043955 659836888 659565747 659222543 658888817 658581555 658287287 658030748 657836616 657615244 657300591
2086.6F57300591l72588l56198l20851l54708l99649l90470l67939l82245m21345m50373
2106.9F53484225m37081m13179m39048m63962m48704m66049n13673n43296n44608n12242
2127.3F48702383m98056m90785m57048m35472m21762l85106l48926l45289l51012l30091
2147.7F44638836l15427l16203l18706l39627l29197l14534l64243m15385m02034l72231
2168.1F41151249l60906l69727m08531m15980l84987l68655l72529l62455l66807m21942
2188.5F37318730m59909m29392l97503m12226m43578m42266l93331l95418m39703m31895
2208.9F33073509m14729m40002m91798n17666m72486m42088m85480m82082m35889m09066
2229.3F28482223l58940l22342l50773l54230l34323l68952l91007l57628l18944l26216
$$ plain form
2086.6 657300591 656928003 656571805 656250954 655896246 655496597 655106127 654738188 654355943 653934598 653484225
2106.9 653484225 653047144 652633965 652194917 651730955 651282251 650816202 650302529 649759233 649214625 648702383
2127.3 648702383 648204327 647713542 647256494 646821022 646399260 646014154 645665228 645319939 644968927 644638836
2147.7 644638836 644323409 644007206 643688500 643348873 643019676 642705142 642340899 641925514 641523480 641151249
2168.1 641151249 640790343 640420616 640012085 639596105 639211118 638842463 638469934 638107479 637740672 637318730
2188.5 637318730 636858821 636429429 636031926 635619700 635176122 634733856 634340525 633945107 633505404 633073509
2208.9 633073509 632658780 632218778 631726980 631209314 630736828 630294740 629809260 629327178 628891289 628482223
2229.3 628482223 628123283 627800941 627450168 627095938 626761615 626392663 626001656 625644028 625325084 624998868
2249.7F24998868l53694l22998k79665l36111l99828l84628l87431m02331l94165m05670
2270.1F21332347m12225l82305l58283l69608m02987l73126l14950l50953l94165l72768
2290.5F17600977l52859l65615m00960m18485l99053l58700l26455l65138m03583m06623
2310.9F13803506m87447m99070l66985l63529n42283o14345m48227l09050m19557n94437
2331.3F09158576n11051l52621l81648m73142o81102j177848j058340L10660J106202
2349.7F05939686M99666n12838r75132j050532j030684j032054r89318q33631o96063
2368E99319100o63459o34849n29945m11272l43025k70545k17915k68697l74556m48048
2388.4E95156789n07116n82338o42359o80089o83487o53922o39439o19769n62847n14209
$$ plain form
2249.7 624998868 624645174 624322176 624042511 623706400 623306572 622921944 622534513 622132182 621738017 621332347
2270.1 621332347 620920122 620537817 620179534 619809926 619406939 619033813 618718863 618367910 617973745 617600977
2290.5 617600977 617248118 616882503 616481543 616063058 615664005 615305305 614978850 614613712 614210129 613803506
2310.9 613803506 613316059 612816989 612450004 612086475 611544192 610929847 610481620 610172570 609753013 609158576
2331.3 609158576 608647525 608294904 607913256 607440114 606759012 605581164 604522824 604833484 605939686
2349.7 605939686 606439352 605926514 604951382 603900850 602870166 601838112 600848794 600015163 599319100
2368 599319100 598655641 598020792 597490847 597079575 596736550 596466005 596248090 595979393 595604837 595156789
2388.4 595156789 594649673 594067335 593424976 592744887 592061400 591407478 590768039 590148270 589585423 589071214
2408.8E89071214m81367m74393m93527m76181m12047l75450m21107n04434n56349n49794
2429.2E84326565n37514n48721n72800o10292o51718o62744o36100o21379o17802o15656
2449.6E78251839n94437n75543o49571p46668p26878o61314o65665p27832q02159q74102
2470E71227670r72092j049877j093983j188815j348555j482070j570165j718819j945793
2488.3E58857501k190114k473056k824843l163159l443420l681480l788352l628612
2504.7E33664465l182411k490759j608193p23124k6643M67360Q39710J217842J665831
2523E29824078K064765K342343K508104K538562K399027K138734J813173J337886P43091
2541.4E47709763K49982j3650j14202j70589k23398k74718l44336l70383k99096k19166
$$ plain form
2408.8 589071214 588589847 588115454 587621927 587145746 586733699 586358249 585937142 585432708 584876359 584326565
2429.2 584326565 583789051 583240330 582667530 582057238 581405520 580742776 580106676 579485297 578867495 578251839
2449.6 578251839 577657402 577081859 576432288 575685620 574958742 574297428 573631763 572903931 572101772 571227670
2470 571227670 570255578 569205701 568111718 566922903 565574348 564092278 562522113 560803294 558857501
2488.3 558857501 556667387 554194331 551369488 548206329 544762909 541081429 537293077 533664465
2504.7 533664465 530482054 527991295 526383102 525659978 525633335 526100695 526940405 528158247 529824078
2523 529824078 531888843 534231186 536739290 539277852 541676879 543815613 545628786 546966672 547709763
2541.4 547709763 547959745 547946095 547831893 547661304 547437906 547163188 546818852 546448469 546149373 545930207
2561.8E45930207j82092j52231j08301j01567j28209j15812j13070j55628j70529j77204
2582.2E44525564k07901k38955k62022k36690k20120k50280k60353k71619k68221k04444
2602.6E42104959j40547j08004q6903j11938j58548j59085j55330j67131j85848k34484
2623E40597141k56777k02060j27494j36256k20716k61069k69770l42846m37618m81069
2643.4E37861466m81486n01394n63681o08087o08563o11842o53446o99460p45416q06391
2663.7E31581700q53539q74459q81792r12129r32992r47952r97901r37581p37727o00576
2684.1E22905052n00143l28660j89662j48713j66297k00212k12729k60950m36365o28710
2704.5E19832611p32839q82983j236260j913011l065408m814147o925285q472354q116871
$$ plain form
2561.8 545930207 545748115 545595884 545487583 545386016 545257807 545141995 545028925 544873297 544702768 544525564
2582.2 544525564 544317663 544078708 543816686 543579996 543359876 543109596 542849243 542577624 542309403 542104959
2602.6 542104959 541964412 541856408 541769505 541657567 541499019 541339934 541184604 541017473 540831625 540597141
2623 540597141 540340364 540138304 540010810 539874554 539653838 539392769 539122999 538780153 538342535 537861466
2643.4 537861466 537379980 536878586 536314905 535706818 535098255 534486413 533832967 533133507 532388091 531581700
2663.7 531581700 530728161 529853702 528971910 528059781 527126789 526178837 525180936 524243355 523505628 522905052
2684.1 522905052 522404909 522076249 521886587 521737874 521571577 521371365 521158636 520897686 520461321 519832611
2704.5 519832611 519099772 518216789 516980529 515067518 512002110 507187963 500262678 491790324 483673453
2722.9D83673453m961043K69443N009919O952047O089688M074067K289772J115381
2739.2E04512727M01438n3466l49879n27382o62148p84695q65579r65714j096934j153767
2759.6D98454601j111955j046389j086474j230061j313448j318812j326531j359523
2775.9D88661408j421451j511246j666397j870513k097547k344936k589613k873719
2792.2D72285986l221393l553658l757596l837944l866374l877938l921091m005939
2808.6D42244053m131228m349798m651606n057037n712241o694197q016616r750933
2824.9C93880397j1968344j4636338j7577410k0426065k2684812k3915589k4050355
2839.1B58621484k3580909k3075595k2337407k0280227j6070754j0170370l932461
$$ plain form
2722.9 483673453 478712410 478981853 483991772 490943819 497033507 501107574 503397346 504512727
2739.2 504512727 504914165 504860699 504510820 503983438 503321290 502536595 501671016 500705302 499608368 498454601
2759.6 498454601 497342646 496296257 495209783 493979722 492666274 491347462 490020931 488661408
2775.9 488661408 487239957 485728711 484062314 482191801 480094254 477749318 475159705 472285986
2792.2 472285986 469064593 465510935 461753339 457915395 454049021 450171083 446249992 442244053
2808.6 442244053 438112825 433763027 429111421 424054384 418342143 411647946 403631330 393880397
2824.9 393880397 381912053 367275715 349698305 329272240 306587428 282671839 258621484
2839.1 258621484 235040575 211964980 189627573 169347346 153276592 143106222 139173761
2853.4A39173761J566917N968526R147376J0870754J0929123R416506O884947M081786
2869.7A98039696J667082J40801m37081m81427m56348n98684j039475j802608k767652
2888.1A92264304l784121m783317n781814o755770p786795q961082j0183781j1209279
2904.4A33018345j1627742j0984480r022280o012090k782010l50982O10315K02693
2920.7I3051769p44090j250699q07307M71860K067335L357991L942691L803030L173008
2939.1A07065588K316833J201778n54539l104493n933300q385963j0238149j1344999
2955.4G1022756j1034812q382984l126953M157789J2561322K0925045K7630135L1176008
2971.7A44928306L1022504K7844578K3203791J8740713J5547291J4016598J3979912
$$ plain form
2853.4 139173761 140740678 146709204 155856580 166727334 177656457 187072963 193957910 198039696
2869.7 198039696 199706778 199847579 199410498 198929071 198472723 197874039 196834564 195031956 192264304
2888.1 192264304 188480183 183696866 177915052 171159282 163372487 154411405 144227624 133018345
2904.4 133018345 121390603 110406123 101383843 95371753 92589743 92238761 92849076 93051769
2920.7 93051769 92307679 91056980 90249673 90721533 92788868 96146859 100089550 103892580 107065588
2939.1 107065588 109382421 110584199 110029660 106925167 100991867 92605904 82367755 71022756
2955.4 71022756 59987944 51604960 48478007 52635796 65197118 86122163 113752298 144928306
2971.7 144928306 175950810 203795388 226999179 245739892 261287183 275303781 289283693
2986B89283693J4860749J5889853J6547829J6604066J5811563J4273166J2411446J0411292
3002.3D06093657Q436024O645471M961222L416598K183944J203001K24143r01431k097666
3020.7D30164963l240466m217178m874289n169570m997611m101634k540648n95093
3037D00428474J529604L648490N601764P072925P712186P543027O798863N659610M416377
3055.3D50411320L375858K549290J810134J169264P20442N08815L93539J96249J5944
3073.7D61150855q2135j86921k11179j44720j73122k98500l87281m25339m44203m46320
3094.1D58351135l96758l40104l80099l90232l14325l01838l24875l14146l21984l44277
3114.5D54922497k90036j76012j46151j38938n9069k6285q5175j91480j94818k6405
$$ plain form
2986 289283693 304144442 320034295 336582124 353186190 368997753 383270919 395682365 406093657
3002.3 406093657 414529681 421175152 426136374 429552972 431736916 432939917 433164060 432262629 430164963
3020.7 430164963 426924497 422707319 417833030 412663460 407665849 403564215 401023567 400428474
3037 400428474 401958078 405606568 411208332 418281257 425993443 433536470 440335333 445994943 450411320
3055.3 450411320 453787178 456336468 458146602 459315866 460036308 460545123 460938662 461134911 461150855
3073.7 461150855 461068720 460881799 460670620 460525900 460352778 460054278 459666997 459241658 458797455 458351135
3094.1 458351135 457954377 457614273 457234174 456843942 456529617 456227779 455902904 455588758 455266774 454922497
3114.5 454922497 454632461 454456449 454310298 454171360 454112291 454086006 454000831 453809351 453614533 453588128
3134.9D53588128M1485j09971k65389l14027l15547k77102k31237k29805k87772l95983
3155.3D51202780m49777m19557l68446l89010n21630n65886m37886l40879l51697m32581
3175.7D46925431n32299n22941m69715m74810m59284m38273m78595n23687n59717n92440
3196.1D41873670n49794m74900m82618n55009n96136n79596n24789n03867n13554m78357
3216.5D36615050n15491o02662n72593n11169n17696n23061m67360m18603n05388o76393
3236.9D31304634p01338n79894n24163n38528n55724o13511o94871p27355o65337o02543
3257.3D25101370o48260p56145p93815p19726n73665m45753n36859p08580o62416n14776
3277.7D18741375m89145n07534m02421l09467l29524l08126k55973k74628l33130l73334
$$ plain form
3134.9 453588128 453629613 453519642 453254253 452940226 452624679 452347577 452116340 451886535 451598763 451202780
3155.3 451202780 450753003 450333446 449965000 449575990 449054360 448488474 448050588 447709709 447358012 446925431
3175.7 446925431 446393132 445870191 445400476 444925666 444466382 444028109 443549514 443025827 442466110 441873670
3196.1 441873670 441323876 440848976 440366358 439811349 439215213 438635617 438110828 437606961 437093407 436615050
3216.5 436615050 436099559 435496897 434924304 434413135 433895439 433372378 432905018 432486415 431981027 431304634
3236.9 431304634 430603296 430023402 429499239 428960711 428404987 427791476 427096605 426369250 425703913 425101370
3257.3 425101370 424453110 423696965 422903150 422183424 421609759 421164006 420627147 419918567 419256151 418741375
3277.7 418741375 418252230 417744696 417342275 417032808 416703284 416395158 416139185 415864557 415531427 415158093
3298D15158093l28392k22564k09748l32982m11927l67731k93344j96279j52915k04146
3318.4D12438065k33263j74463r2923j02759j57386j62095j83284k20269j99526j94520
3338.8D10717577k05636k13892k56091k30163j61529k33173l67552l09080j37270j63734
3359.2D08439457l19182l35008k12521o4254k9325j89662l22312k81483k45422k71082
3379.6D06169206l20047k70754n6804J3918j54406l16202l33399k64287j26362k4140
3400D04316723k02477m20451l56555j69158r5308j37031j81704k70427m21226m35710
3420.4D01626676k11566J7523M7267k8253j49667k30044j82569k12222l80815l93927
3440.8C99902403j73747j87457l41177l9816K12550n543j74075q1867m6402k24293
$$ plain form
3298 415158093 414829701 414607137 414397389 414064407 413652480 413284749 412991405 412795126 412642211 412438065
3318.4 412438065 412204802 412030339 411937416 411834657 411677271 411515176 411331892 411111623 410912097 410717577
3338.8 410717577 410511941 410298049 410041958 409811795 409650266 409417093 409049541 408740461 408603191 408439457
3359.2 408439457 408120275 407785267 407572746 407508492 407479167 407289505 406967193 406685710 406440288 406169206
3379.6 406169206 405849159 405578405 405521601 405535519 405381113 405064911 404731512 404467225 404340863 404316723
3400 404316723 404114246 403693795 403337240 403168082 403072774 402935743 402754039 402483612 402062386 401626676
3420.4 401626676 401415110 401432633 401479900 401451647 401301980 401071936 400889367 400677145 400296330 399902403
3440.8 399902403 399728656 399541199 399200022 399160206 399372756 399367213 399193138 399111271 399064869 398840576
3461.2C98840576k42889j1354Q1658j8984j99616l19958j78873J5437k23189m82083
3481.6C97260725j31011J30386m1545l2246O0529j03236j74254k8103k27809o77795
3502C96035641m23759J36852m1633j74582K13265K35200p4595k02865l05175n05895
3522.4C94892454n22852l98010j94818K87742M95255N9992k08646J39564K91944k71827
3542.8C94570798r49890o03080K76089J20282j62780L13252L91305n7072k16931n91427
3563.2C93090546j931161j820206J025915K091080Q95500J4007o7234N5224K43902
3581.5C93597573j43856j725048k058893N50598J377135j30266n40942N0456K1189
3599.9C90997946K33889M17262p59512j725584r90540m10140k5689J30027p61568J48833
$$ plain form
3461.2 398840576 398597687 398586333 398667991 398649007 398449391 398129433 397950560 397965997 397742808 397260725
3481.6 397260725 397129714 397260100 397218555 397186309 397246838 397143602 396969348 396941245 396713436 396035641
3502 396035641 395611882 395748734 395707101 395532519 395745784 395980984 395906389 395703524 395398349 394892454
3522.4 394892454 394369602 393971592 393776774 394064516 394559771 394619763 394411117 394550681 394842625 394570798
3542.8 394570798 393620908 393017828 393293917 393414199 393251419 393564671 393955976 393898904 393681973 393090546
3563.2 393090546 391159385 389339179 390365094 392456174 393351674 393365681 393298447 393353671 393597573
3581.5 393597573 393453717 391728669 389669776 390220374 391597509 391467243 390926301 390976757 390997946
3599.9 390997946 391231835 391649097 390889585 389164001 388173461 387763321 387737632 387867659 387106091 387254924
3620.3C87254924K198338J785040j111448l740489p02232K307891J482904O36340K88695
3638.7C90399963K9176O0558o98566l256768m579723J39594L458113J430779r0271
3657C86892855R24140R61125L28332N7638j403063l218204j418621n46276k605021
3675.4C79972905r7990K754062K245039J247585k84165k829284l306299K33084K133041
3693.7C82067978J433015M23789q12202j389534P2897P30574r51350l070652k077610
3712.1C76426905J435340K027094L59386j018107j290619r37074j35124P14749k21521
3730.4C77361029k750694l784031q65489K586633K307772j243651l209412k79993l49044
3748.8C69773120k191544P20084K743870J015723m99517M47690Q69751k67923q75562
$$ plain form
3620.3 387254924 389453262 391238302 390126854 386386365 385684133 387992024 389474928 390111268 390399963
3638.7 390399963 390429139 390489697 389791131 386534363 381954640 382094234 385552347 386983126 386892855
3657 386892855 387816995 388778120 389106452 389164090 387761027 384542823 383124202 382577926 379972905
3675.4 379972905 379874915 382628977 384874016 386121601 385837436 383008152 379701853 379934937 382067978
3693.7 382067978 383500993 383924782 383112580 381723046 381795943 382526517 381575167 378504515 376426905
3712.1 376426905 377862245 379889339 380248725 379230618 377939999 377002925 376867801 377582550 377361029
3730.4 377361029 374610335 370826304 369960815 372547448 374855220 373611569 370402157 370122164 369773120
3748.8 369773120 367581576 368301660 371045530 372061253 371561736 372009426 372879177 372611254 371735692
3767.1C71735692r53019K1607J263499P53373q24064j466393l74228N6058j89304K30044
3787.5C70253265L47942O9141n80936j430542j307934j843661j893222M99963L60728
3805.9C64474744o3807J549125J298666j128465k495289j429022j725882p08818J694917
3824.3C61466169J213104L28541k48671p42555q77142j930028k250135j79499J225918
3842.6C58005702J563222J622796O81609k169878n703806k167970L247201K695024
3858.9C57773900K22117j581610r65416r5993j268685j099467M55975J223475R38713
3877.3C55603009q72910j182556l35365n26101L98785K06530j091182P6979J083106
3895.6C53360295l82691k008140k180815j051247J120209K059997J107603J56700m64439
$$ plain form
3767.1 371735692 370782673 370804280 372067779 372821152 371997088 370530695 370156467 370212525 370023221 370253265
3787.5 370253265 370601207 370670348 370089412 368658870 367350936 365507275 363614053 364114016 364474744
3805.9 364474744 364410937 365960062 367258728 366130263 363634974 362205952 360480070 359771252 361466169
3824.3 361466169 362679273 363007814 362759143 362016588 361139446 359209418 356959283 356779784 358005702
3842.6 358005702 359568924 361191720 361873329 359703451 353999645 351831675 355078876 357773900
3858.9 357773900 357996017 356414407 355448991 355352998 354084313 352984846 353440821 354664296 355603009
3877.3 355603009 354730099 353547543 353212178 352686077 353084862 353291392 352200210 352277189 353360295
3895.6 353360295 352977604 350969464 348788649 347737402 348857611 350917608 352025211 352181911 351717472
3914C51717472j223206j121283j94490r0033m96417q1033R0242p58141q78722J20789
3934.4C47085178N65737J56641n89341r31710l68177k03044n05715o0797M11719J66923
3954.8C45727414j56373k44230l76463l58403j60843j34706k54512l35425k84583j44332
3975.2C43277544o8903j62363k44439j83105j09733j40726l09676m82023m28974k12104
3995.6C40935498q5949
3997.6C40849549
$$ plain form
3914 351717472 350494266 349372983 349178493 349088460 348592043 348511010 348601252 347843111 346964389 347085178
3934.4 347085178 347650915 347807556 347218215 346286505 345918328 345715284 345209569 345148772 345560491 345727414
3954.8 345727414 345571041 345326811 344950348 344591945 344431102 344296396 344041884 343706459 343421876 343277544
3975.2 343277544 343208641 343046278 342801839 342618734 342509001 342368275 342058599 341576576 341147602 340935498
3995.6 340935498 340849549
3997.6 340849549
##END=$$ End of the data block
