##TITLE=Luteina Padrao extr $$ Begin of the data block
##JCAMP-DX=5.00 $$ ACD/SpecManager v 10.08
##SPECTROMETER/DATA SYSTEM=Alpha
##DATE=09 Oct 2014 08:27:22
##DATA TYPE=INFRARED SPECTRUM
##DATA CLASS=XYDATA
##ORIGIN=
##OWNER=
##NPOINTS=1765
##FIRSTX=399.76428223
##LASTX=3997.64306641
##MAXX=3997.64306641
##MINX=399.76428223
##MAXY=0.84528029
##MINY=0.18368281
##XFACTOR=1.0000000000
##YFACTOR=1.000000000000000e-9
##FIRSTY=0.76467955
##DELTAX=2.03961372
##XUNITS=1/CM
##YUNITS=ARBITRARY UNITS
##XYDATA=(X++(Y..Y))
399.8G64679551l003716Q62836K409757r02176m315436k543271J739025K497375j399278
418.1G60024667m843593j961052K074837J828790k079010m159450j456976J980781
434.4G51408994J183570k460361l445983k33233K515137N28992l141642l234804M72784
452.8G43593454K791107J26302l710508k718031J106321K211333p96140l657877k247572
471.2G36698389J585543K398670p14719l266096j745046J594067J740634j541733l383458
489.5G33366251j130402K018034J517773j832128l317475q77023J988650R06944k627075
507.9G30013549l647506r34541J469910K59221k739013l284037o74009J448810K62141
526.2G22174525k235174k088785O99520K384543N96822j999319j593709J200259K335131
$$ plain form
399.8 764679551 761675835 762538671 764948428 764046252 759730816 757187545 758926570 761423945 760024667
418.1 760024667 755181074 753220022 755294859 757123649 755044639 750885189 749428213 751408994
434.4 751408994 752592564 750132203 746686220 746452987 748968124 749497116 746355474 743120670 743593454
452.8 743593454 746384561 746510863 742800355 740082324 741188645 743399978 742603838 738945961 736698389
471.2 736698389 738283932 740682602 739967883 736701787 734956741 736550808 738291442 736749709 733366251
489.5 733366251 732235849 734253883 735771656 733939528 730622053 729745030 731733680 732640624 730013549
507.9 730013549 726366043 725431502 726901412 727160633 724421620 721137583 720463574 721912384 722174525
526.2 722174525 719939351 717850566 718550086 720934629 721531451 719532132 717938423 719138682 721473813
544.6G21473813J48118k317548j734078Q08179J508296o69897k542853j344443J329959
562.9G16659546J871049m02450k281487j174987J138270J301408q09729k007484m20750
581.3G13873386J986504K083004p3553j279056L49522K629638K271652k39194j413226
599.6G20188677K21312K212048J830578k44081q98838J016020L134430K848744Q78394
618G31187284M05252K366722M137754L287792Q40664j11043J410424L021598K299071
636.4G48845518K15411k77579J475871K981960K069712p5817m95732J350880K804458
654.7G58894682J894236R8168J789J661896K474070J094699q74639p6115J568198K270401
675.1G69007385J274407k61247J4424J929581K890706J545072l28601l81827J145303
$$ plain form
544.6 721473813 721621931 719304383 717570305 718378484 719886780 719216883 716674030 715329587 716659546
562.9 716659546 718530595 718128145 715846658 714671671 715809941 717111349 716301620 714294136 713873386
581.3 713873386 715859890 717942894 717869341 716590285 716939807 719569445 721841097 721601903 720188677
599.6 720188677 720409989 722622037 724452615 724208534 723309696 724325716 727460146 730308890 731187284
618 731187284 731592536 733959258 738097012 741384804 742225468 742114425 743524849 746546447 748845518
636.4 748845518 749060929 748783350 750259221 753241181 755310893 755235076 754739344 756090224 758894682
654.7 758894682 760788918 760887086 760888875 762550771 765024841 766119540 765244901 765168786 766736984 769007385
675.1 769007385 770281792 770020545 770034969 771964550 774855256 776400328 776071727 775689900 776835203
693.5G76835203J853526M94599j320600j328707Q4162N89072p02679k263486k748549
711.8G71492541m395902j2012840j8699169p704735J0923088J2680411J081884p628977
728.1G45736301j814187J2554825J6594052R967566L534793L87490J81377J632333
744.5G88774550K131283O99401q89301p32005N88000R15051k83182j255751n24998
762.8G89423048J090050J581431L24249j031041p58350N71906Q87573m91142j787126
781.2G89810598j290679L55244J076936J78933p49230k32518R35197R52482l75032
799.5G90661931j358986p07805O55711P53224p32184j890361j298428n4061p7307j425863
819.9G84525871k436340j954376p45952n18442j514852k154827j371801n6445K39312
$$ plain form
693.5 776835203 778688729 779183328 777862728 776534021 776618183 777207255 776504576 774241090 771492541
711.8 771492541 767096639 755083799 736384630 728679895 739602983 752283394 753365278 745736301
728.1 745736301 743922114 756476939 773070991 783038557 786573350 786960840 787142217 788774550
744.5 788774550 790905833 791605234 790715933 789983928 790571928 791486979 791203797 789948046 789423048
762.8 789423048 790513098 792094529 792418778 791387737 790629387 791201293 792088866 791597724 789810598
781.2 789810598 788519919 788875163 789952099 790131032 789381802 789149284 790084481 791036963 790661931
799.5 790661931 789302945 788595140 789250851 790004075 789271891 787381530 786083102 786029041 785951734 784525871
819.9 784525871 782089531 780135155 779389203 778870761 777355909 775201082 773829281 773772836 774012148
838.3G74012148n84781j079380l83258N22911K90633r24707j805723j599967j026213
856.6G67421663j240909k032996k194046j400054o81519j103998k263605k662123j764297
875G52078116p44402q27492j704573k182484j873493j414418j507044k099991k374053
893.4G37350166j953602j589954k018869k895593l208757k523899j607060j387001
909.7G20165431j588642j116932K69235J508414J594365P92563J82331J91092J54317
928G22152174o92547k100527l093183l262758l112734l224492l485441l311634k527356
946.4F97341502j683057j463592j915514k532602l091454l916919n226910o490946
962.7F71020508o941021o668210o582319p175208p792711p496834o235599m814267
$$ plain form
838.3 774012148 773427367 772347987 771964729 772487640 772778273 771853566 770047843 768447876 767421663
856.6 767421663 766180754 764147758 761953712 760553658 759872139 758768141 756504536 753842413 752078116
875 752078116 751333714 750506222 748801649 746619165 744745672 743331254 741824210 739724219 737350166
893.4 737350166 735396564 733806610 731787741 728892148 725683391 723159492 721552432 720165431
909.7 720165431 718576789 717459857 717729092 719237506 720831871 721624434 721806765 721997857 722152174
928 722152174 721459627 719359100 716265917 713003159 709890425 706665933 703180492 699868858 697341502
946.4 697341502 695658445 694194853 692279339 689746737 686655283 682738364 677511454 671020508
962.7 671020508 664079487 657411277 650828958 643653750 635861039 628364205 622128606 617314339
979F17314339l855527l124892k000154l70085J108110J724959J522302J156807R30369
997.4F14406228M02451p94053k215445l084779l282011l440499m050434m898131n443334
1015.7E87599993n417466n120695m950225m818798m378736l491282k384365j530170
1032E55508256j177847j029730p60794m78804l49045j23680N66125J625359K466858
1050.4E56246698K700269K578974K552211K748668K896786K746999K370000J980067
1066.7E76820672J575768R37163J58251j97172K79903J311839K201318K512336K410174
1085.1E88010252K292931K297759K180934J669108R49979N46277O08504O70492L78192
1103.4E99604428j7584r6023J50800L70205K85923j79j51276o0797L1650p9095j50085
$$ plain form
979 617314339 613458812 610333920 608333766 607963681 609071791 610796750 612319052 613475859 614406228
997.4 614406228 614808679 614014626 611799181 608714402 605432391 601991892 597941458 593043327 587599993
1015.7 587599993 582182527 577061832 572111607 567292809 562914073 559422791 557038426 555508256
1032 555508256 554330409 553300679 552539885 552061081 551712036 551588356 552154481 553779840 556246698
1050.4 556246698 558946967 561525941 564078152 566826820 569723606 572470605 574840605 576820672
1066.7 576820672 578396440 579333603 579491854 579294682 579574585 580886424 583087742 585600078 588010252
1085.1 588010252 590303183 592600942 594781876 596450984 597400963 597947240 598555744 599226236 599604428
1103.4 599604428 599586844 599490821 599641621 600011826 600297749 600297570 600146294 600085497 600117147 600038052 599887967
1125.9E99887967K60174J018227J425325J134754M64320j18315m68135q31485j449227
1144.2F01323605k105833k359628k196253k013683k060950k141833j916528j378596
1160.5E85150301q39293m69267j67191J40846M30763O51598Q48054J276494K115488
1178.9E89137793L109335L725946L741980L507435L446639L506958L353835K964377
1195.2F16494298K652705K547443K493322K286016J863718J454592J289964J191795
1211.5F32273853Q02040N3406p41244j068532q81732q55624j300991j684487j591444
1229.9F25005245j237094r95994j070022j417399j748741j901865k111256k511143
1246.2F12011731k671838k120197r80258J95265J038790J658082K387344L298343M015982
$$ plain form
1125.9 599887967 600148141 601166368 602591693 603726447 604190767 604072452 603604317 602772832 601323605
1144.2 601323605 599217772 596858144 594661891 592648208 590587258 588445425 586528897 585150301
1160.5 585150301 584311008 583841741 583674550 583815396 584246159 584897757 585745811 587022305 589137793
1178.9 589137793 592247128 595973074 599715054 603222489 606669128 610176086 613529921 616494298
1195.2 616494298 619147003 621694446 624187768 626473784 628337502 629792094 631082058 632273853
1211.5 632273853 633075893 633129299 632388055 631319523 630437791 629582167 628281176 626596689 625005245
1229.9 625005245 623768151 622772157 621702135 620284736 618535995 616634130 614522874 612011731
1246.2 612011731 609339893 607219696 606239438 606434703 607473493 609131575 611518919 614817262 618833244
1264.6F18833244M195094M018307L960848M095852M072189L731847L329933L166437
1280.9F49403751L188848L042162K583563K092958J863122J842618J732349J372635
1297.2F67122006R41515P98643J050472J379907J508058J549840J739501K039493K110898
1315.6F80240333J750887J190304P70450N39780K27272l24488q21888q51095n01930
1333.9F82219625l28720o41465j153946j444638j745462k552808l953635n649090p206500
1352.3F57543361q425832r220838r560347r684980r308815p114708l771544j078367
1368.6E99377930K78592p7486j203835r18805J450777L976941M907787M788935N260527
1386.9F17841363O374180P287503Q340597Q789360P094026M609585K642929J307905
$$ plain form
1264.6 618833244 623028338 627046645 631007493 635103345 639175534 642907381 646237314 649403751
1280.9 649403751 652592599 655634761 658218324 660311282 662174404 664017022 665749371 667122006
1297.2 667122006 668063521 668862164 669912636 671292543 672800601 674350441 676089942 678129435 680240333
1315.6 680240333 681991220 683181524 683951974 684491754 684719026 684394538 683572650 682721555 682219625
1333.9 682219625 681890905 681249440 680095494 678650856 676905394 674352586 670398951 664749861 657543361
1352.3 657543361 649117529 639896691 630336344 620651364 611342549 604227841 600456297 599377930
1368.6 599377930 599656522 599579036 598375201 597456396 598907173 602884114 607791901 612580836 617841363
1386.9 617841363 624215543 631503046 639843643 648633003 655727029 660336614 662979543 664287448
1403.3F64287448P41959M80830J29998k80738n22435n05209k87652K55764P06613P98106
1423.7F65804684O20544R1612p58647j347781j407325j359343j209796j165032j526296
1442F57742620j869679j948595k199113k756298l431499l597558m138290r696126j7710984
1460.4F10394478j5021145J877188J4730334Q024931l961145p06614K7212322M1832090
1476.7F84382439L2062769K0646631J4947296J1247217R142161Q319079P195950N117238
1493G93060780L804922L715753L452599K617121J675367J097978J305162J513899J216113
1511.4H13459694Q90911O67572P91907R69410J053930Q91208N87404N93185O15657
1529.7H20520878L63231K6881j31249k78950l44336k62976l70621n63324o84380p69675
$$ plain form
1403.3 664287448 665029407 665510237 665640235 665359497 664837062 664331853 664044201 664299965 665006578 665804684
1423.7 665804684 666425228 666516840 665758193 664410412 663003087 661643744 660433948 659268916 657742620
1442 657742620 655872941 653924346 651725233 648968935 645537436 641939878 637801588 628105462 610394478
1460.4 610394478 595373333 597250521 611980855 620005786 616044641 615338027 642550349 684382439
1476.7 684382439 716445208 737091839 752039135 763286352 772428513 780747592 787943542 793060780
1493 793060780 796865702 800581455 804034054 806651175 808326542 809424520 810729682 812243581 813459694
1511.4 813459694 814350605 815018177 815810084 816779494 817833424 818724632 819312036 819905221 820520878
1529.7 820520878 820884109 820910990 820779741 820500791 820156455 819893479 819522858 818959534 818275154 817505479
1550.1H17505479r36985j326025j740455k276302k212643j589716k059817k638340
1566.4H02725196k897501k990425k728760l186107m254520l936410l440439l860772
1582.8G75430262m375935m657149m638076m558026m676462n082249n405724n385340
1599.1G36651301n290925n384505n644321n969227o335795o594896o861925q194447
1615.4F86375260r841263q401394p257998p902324p450342o276369m963339l066718
1631.7F31215513j695216j156568r12786r86159j321852j900971k903700l313720k529323
1650.1F14495218k827227l444136k103269j493215j510322j469732j293063j153707
1666.4E99200547j163125q00848l5465N99861J196563J485646J483500J096070l2485
$$ plain form
1550.1 817505479 816568494 815242469 813502014 811225712 809013069 807423353 805363536 802725196
1566.4 802725196 799827695 796837270 794108510 790922403 786667883 782731473 779291034 775430262
1582.8 775430262 771054327 766397178 761759102 757201076 752524614 747442365 742036641 736651301
1599.1 736651301 731360376 725975871 720331550 714362323 708026528 701431632 694569707 686375260
1615.4 686375260 676533997 668132603 660874605 652972281 645521939 639245570 634282231 631215513
1631.7 631215513 629520297 628363729 627450943 626464784 625142932 623241961 620338261 617024541 614495218
1650.1 614495218 611667991 608223855 606120586 604627371 603117049 601647317 600354254 599200547
1666.4 599200547 598037422 597236574 597201109 597800970 598997533 600483179 601966679 603062749 603030264
1684.7F03030264j668751l339827m800200n590499p411003r107411r613275j1231959
1701.1E50267339j0151983j0119378j1653900j0892391r490490p832915n529463j715720
1717.4D82881099K399147L933966M505366N133182N980819P151127Q414388J1179089
1733.7E31578183J2346387J0176957J0270416J0622979R756088R308517R064674R489417
1750F12613618R737194Q978665Q913755R094179Q558869Q812189Q578897P994592Q091092
1768.4F91373050Q062721Q603334Q378088P134140O549001O417989O212593O218493
1784.7G48949409O133616N484044N275905N796850N636513N006135M705965M494727
1801G91483164M243612L927052L606975L169000K737046K429127K258599K147556J825690
$$ plain form
1684.7 603030264 601361513 598021686 593221486 587630987 580219984 571112573 561499298 550267339
1701.1 550267339 540115356 529995978 518342078 507449687 497959197 490126282 484596819 482881099
1717.4 482881099 485280246 489214212 493719578 498852760 504833579 511984706 520399094 531578183
1733.7 531578183 543924570 554101527 564371943 574994922 584751010 594059527 603124201 612613618
1750 612613618 622350812 631329477 640243232 649337411 657896280 666708469 675287366 683281958 691373050
1768.4 691373050 699435771 708039105 716417193 723551333 730100334 736518323 742730916 748949409
1784.7 748949409 755083025 760567069 765842974 771639824 777276337 782282472 786988437 791483164
1801 791483164 795726776 799653828 803260803 806429803 809166849 811595976 813854575 816002131 817827821
1819.4H17827821J385152J193226J345872J311005J119732J037896J042664J194358
1835.7H27457726J350403J189709Q45849R28283J289367J238108Q99911O27399N93245
1854H36420000P36355P58887N58853L24190K62618L79920N21123M87626K58982K06530
1874.4H40915084L50892L90351J88232l0399R776J88112K26021M4524j33931m8399
1894.8H42100263K45273L71098K30432O5267R9122K52545K95282J53661l9340n8472
1915.2H43715131J36197K65837P2658r2745J0431J89066K17318K9743j21713l3438
1935.6H44388485J41859J19805m5001j25051m2021J20759J80662M0054j27315j00077
1956H44552159M9830J07169r596j51098j11997R5069J59681k3902j69098r5248O5267
$$ plain form
1819.4 817827821 819212973 820406199 821752071 823063076 824182808 825220704 826263368 827457726
1835.7 827457726 828808129 829997838 830843687 831771970 833061337 834299445 835199356 835826755 836420000
1854 836420000 837156355 837915242 838474095 838798285 839060903 839440823 839961946 840449572 840708554 840915084
1874.4 840915084 841265976 841656327 841844559 841814160 841823936 842012048 842238069 842282593 842148662 842100263
1894.8 842100263 842345536 842716634 842947066 843012333 843111455 843364000 843659282 843812943 843773603 843715131
1915.2 843715131 843851328 844117165 844189823 844097078 844107509 844296575 844513893 844543636 844421923 844388485
1935.6 844388485 844530344 844650149 844605148 844480097 844438076 844558835 844739497 844779551 844652236 844552159
1956 844552159 844601989 844709158 844699562 844548464 844436467 844531536 844691217 844667315 844498217 844402969 844468236
1978.5H44468236R8646l0518j69218j36375Q524M8816n8055j58370j29044j0311L9458
2000.9H43971789q9169k36213k02000p4983q5234k71619m09245k85447m1067M7862
2021.3H42324674j4067n7160M76R7216J24573K1100r0003m9591O1870P9095L934o2287
2045.8H42439830m0412O0737J11104M7028k8015k1100L2485L9995j6094m1365K9027
2068.2H42613220J14978J05321J7881o318O2049J21355J13308N6982K4498N9426J07526
2090.6H43390226R8467N7340M0233N7280P8976N9665Q225q106M1187J03712J07407
2113.1H44034612M8459L397J6749N3108M6968J3948J1086K4855K0504l695l0458m1783
2137.5H44197750j4782K2471J4246j2815j9968k682M7386P4684K0802o914M9353R1910
$$ plain form
1978.5 844468236 844566882 844536364 844367146 844230771 844239295 844288111 844230056 844071686 843942642 843932331 843971789
2000.9 843971789 843882620 843646407 843444407 843369424 843284190 843012571 842603326 842317879 842276812 842324674
2021.3 842324674 842310607 842253447 842253923 842351139 842475712 842496812 842406809 842357218 842419088 842498183 842502117 842439830
2045.8 842439830 842399418 842460155 842571259 842618287 842590272 842569172 842601657 842641652 842625558 842584193 842613220
2068.2 842613220 842728198 842833519 842851400 842845082 842907131 843028486 843141794 843198776 843223274 843282700 843390226
2090.6 843390226 843488693 843546033 843586266 843643546 843722522 843782187 843790412 843782306 843823493 843927205 844034612
2113.1 844034612 844083071 844086468 844103217 844156325 844203293 844217241 844228327 844253182 844273686 844269991 844239533 844197750
2137.5 844197750 844182968 844205439 844219685 844206870 844186902 844184220 844231606 844306290 844327092 844320178 844369531 844461441
2162H44461441P0035K5154L1292P3254Q1718M1127k98J8120O0022O0141L5882R358
2186.5H44967246j0967K503L5763M1485K4319J6868K2649K8015J5735j79R895M1663
2211H45194995N3227K9803K265j5617j3590K265j073k6464k7299O616J9014k4199q1778
2237.5H45118165p0751k7358l5763p9513r5844o5625l3497n0724r6679r6500m6074
2259.9H44419837K682m172n9843r2924q1003n9902o8784j09792j32978q9347k4617
2282.3H43699157j5437o9857j52111j76728j28388j27137j94848k48611k54273k37524
2302.7H42094243k57612l13759l41653l16739k75016k82407m04716n20706m57823l03865
2323.1H38619947k54273l37362l41654j92046j61588k62022k31147q5593K2412J42872
$$ plain form
2162 844461441 844531476 844556630 844587922 844661176 844742894 844784021 844783723 844801843 844861865 844922006 844957888 844967246
2186.5 844967246 844956279 844958782 844994545 845036030 845060349 845077217 845099866 845127881 845143616 845143437 845153332 845194995
2211 845194995 845248222 845278025 845280290 845264673 845251083 845253348 845252275 845225811 845198512 845205128 845224142 845199943 845118165
2237.5 845118165 845047414 845020056 844984293 844904780 844808936 844743311 844709814 844659090 844562411 844465911 844419837
2259.9 844419837 844422519 844418347 844358504 844265580 844184577 844124675 844055891 843946099 843813121 843723774 843699157
2282.3 843699157 843683720 843613863 843461752 843285024 843156636 843029499 842834651 842586040 842331767 842094243
2302.7 842094243 841836631 841522872 841181219 840864480 840589464 840307057 839902341 839381635 838923812 838619947
2323.1 838619947 838365674 838028312 837686658 837494612 837333024 837071002 836839855 836754262 836776674 836919546
2343.5H36919546L79264K94149k22385o05046n64277l28064k05517j60456L2842L18885
2363.9H35858941L98517K73585K48134L79920M35889L68476K91884K40981K07782J66059
2384.3H38870168N8412j05858k12252j87218j26302j45018k40565k91287k07127j09374
2404.7H37303579j36614k46346l01361k21431j12176j31548k18749k30908j61171q7142
2425.1H35456133j02997j97589k56420k17020j35899j35600k43962l15964k54750j58310
2445.5H33437622j73271k91288l35991k60413j92165k12849l01718l47197k69056j73569
2465.9H30880105k23994l74019m38630l56555k34902j94490k44499k99394k80678k18093
2486.3H28014851k13981k97964l44455k76148j94311k17379l19957l65794k94685k22624
$$ plain form
2343.5 836919546 837298810 837592959 837370574 836765528 836201251 835873187 835667670 835507214 835540056 835858941
2363.9 835858941 836257458 836531043 836779177 837159097 837594986 837963462 838255346 838496327 838704109 838870168
2384.3 838870168 838928580 838822722 838610470 838423252 838296950 838151932 837911367 837620080 837412953 837303579
2404.7 837303579 837166965 836920619 836619258 836397827 836285651 836154103 835935354 835704446 835543275 835456133
2425.1 835456133 835353136 835155547 834899127 834682107 834546208 834410608 834166646 833850682 833595932 833437622
2445.5 833437622 833264351 832973063 832637072 832376659 832184494 831971645 831669927 831322730 831053674 830880105
2465.9 830880105 830656111 830282092 829843462 829486907 829252005 829057515 828813016 828513622 828232944 828014851
2486.3 828014851 827800870 827502906 827158451 826882303 826687992 826470613 826150656 825784862 825490177 825267553
2506.7H25267553k50280l20434l46899k95878k24769k46048l58879m22895l47674k24888
2527.1H22228909k00868k60532k51651j63019j09255j57535k94626l91423l60608l00467
2547.5H19738925l06190l35991l22580k42174j70708k09450l07262l31939k42114j62542
2567.9H17107975k33948l74198m00185l06547k18749k27392l15249l67343l25024k74897
2588.3H14064443k91169l69370m37259l99828l18647k91645l10660l42011l50058l45767
2608.7H10608029l71277m29332m58658m25518l98337m39167n03183n25832n05447m71831
2629.1H06079447m49776m35353l69847k38418j49131j59264j99675k22921k23637k11895
2649.5H03419530k26020k63632k72572k22981j36971q4758q9586p8857p987Q0288R9957
$$ plain form
2506.7 825267553 825017273 824696839 824349940 824054062 823829293 823583245 823224366 822801471 822453797 822228909
2527.1 822228909 822028041 821767509 821515858 821352839 821243584 821086049 820791423 820400000 820039392 819738925
2547.5 819738925 819432735 819096744 818774164 818531990 818361282 818151832 817844570 817512631 817270517 817107975
2567.9 817107975 816874027 816499829 816099644 815793097 815574348 815346956 815031707 814664364 814339340 814064443
2588.3 814064443 813773274 813403904 812966645 812566817 812248170 811956525 811645865 811303854 810953796 810608029
2608.7 810608029 810236752 809807420 809348762 808923244 808524907 808085740 807582557 807056725 806551278 806079447
2629.1 806079447 805629671 805194318 804824471 804586053 804436922 804277658 804077983 803855062 803631425 803419530
2649.5 803419530 803193510 802929878 802657306 802434325 802297354 802212596 802123010 802044153 802036166 802116454 802216411
2671.9H02216411K5153m1068k8550N066q762q8274j75953j81914j25587j36435k56538
2694.3H01203549l69907l82781l64422m17769n20587n85497n59687n09978n46634o29604
2714.7G96316683o58154o40869o35982o71029p43330p34686n58913l34025j83105r7811
2735.1G91058779l9280N126Q1063J35243N5432o1095o8128l5048j09136k88546m23372
2757.6G90311038m32491l94761m16398n22912o15954o06895n77748o38604p43925q37088
2778G84524262r09209r48251j046896j260340j464784j548231j592099j708746j896799
2796.3G72148907k061546k103507k106369k229213k479911k693057k762854k853573
2812.6G52858877l140032l542781l979862m435181m917860n582393o518662p687091
$$ plain form
2671.9 802216411 802241564 802200496 802171946 802177012 802168250 802079976 801904023 801722109 801596522 801460087 801203549
2694.3 801203549 800833642 800450861 800086439 799668670 799148083 798562586 798002899 797492921 796946287 796316683
2714.7 796316683 795658529 795017660 794381678 793710649 792967319 792232633 791673720 791339695 791156590 791058779
2735.1 791058779 791019499 791024625 791105688 791240931 791296363 791235268 791167140 791132092 791022956 790734410 790311038
2757.6 790311038 789878547 789483786 789067388 788544476 787928522 787321627 786743879 786105275 785361350 784524262
2778 784524262 783615053 782666802 781619906 780359566 778894782 777346551 775754452 774045706 772148907
2796.3 772148907 770087361 767983854 765877485 763648272 761168361 758475304 755712450 752858877
2812.6 752858877 749718845 746176064 742196202 737761021 732843161 727260768 720742106 713055015
2828.9G13055015r148539j1245548j4557302j9762159k8075695m2114555o4121843
2843.2E24029374q6952090q5799515m1683585K0874977N7285011N7879001M3835878
2857.5D89469051L1335116K2709131J5433133Q255362J869798k123475k551973l54767
2873.8E64041376J582921J177430j236797m208326o742954q515000r566308j0075330
2890.1E26457012j0313034j0567129j0902107j1316806j2037158j3598531j6743392
2904.4D40978855k2378385l1534076m4287026n6267530n6581929l7780359q466736
2918.7A83682814J5602663K8313235L2334462L1535446K8955609K6504308K4790704
2933C71719241K3506314K2072732K0163119J7705530J4584720J0543853N262882j033813
$$ plain form
2828.9 713055015 703906476 692660928 678103626 658341467 630265772 588151217 524029374
2843.2 524029374 437077284 351277769 309594184 330469161 387754172 445633173 489469051
2857.5 489469051 520804167 543513298 558946431 567201793 569071591 566948116 564396143 564041376
2873.8 564041376 565624297 566801727 565564930 561356604 554613650 546098650 536532342 526457012
2890.1 526457012 516143978 505576849 494674742 483357936 471320778 457722247 440978855
2904.4 440978855 418600470 387066394 342779368 286511838 229929909 192149550 183682814
2918.7 183682814 199285477 227598712 259933174 291468620 320424229 346928537 371719241
2933 371719241 395225555 417298287 437461406 455166936 469751656 480295509 485558391 484524578
2949.3D84524578o580651q541703n868018p02321M141956P511556R570688J0816127
2965.6D94872212J1598885J1993468J2026072J1803388J1436642J1017620J0579169
2979.9E75327456J0151565R805620R513497R116471Q556604P953763P410050O914496
2996.2F44749522O452918O036997N680561N400479N151927M827917M389644L930986
3012.5F86620951L537953L200948K853513K453863K054811J742184J545489J421928
3028.8G05431640J305461J201928J174628J186133J125216R92239Q99672Q82626Q55088
3047.2G15054631P59244O06597M64141L93212L62158K75016J00195l7968n6625l4928
3067.6G17885673p2181j90199l03864l35157l06129k90215l41297m00126l81529l27527
$$ plain form
2949.3 484524578 477943927 469402224 463534206 462831885 466973841 474485397 484056085 494872212
2965.6 494872212 506471097 518464565 530490637 542294025 553730667 564748287 575327456
2979.9 575327456 585479021 595284641 604798138 613914609 622471213 630424976 637835026 644749522
2996.2 644749522 651202440 657239437 662919998 668320477 673472404 678300321 682689965 686620951
3012.5 686620951 690158904 693359852 696213365 698667228 700722039 702464223 704009712 705431640
3028.8 705431640 706737101 707939029 709113657 710299790 711425006 712417245 713316917 714199543 715054631
3047.2 715054631 715813875 716420472 716884613 717277825 717639983 717914999 718015194 717977226 717920601 717885673
3067.6 717885673 717813492 717623293 717319429 716984272 716678143 716387928 716046631 715646505 715264976 714937449
3088G14937449l11554l34620l84212l99768l79324m25041n18858n66423n49853n23448
3108.4G10544348n59807o53148p13289p02083o96361p25448p65920p92682p96377q52943
3128.8G03286290r44495r89199j037061j070499j046598j046479j101077j151383j155734
3147.1F93743765j137733j166463j233041j254976j251936j276255j308262j338720
3163.4F83776379j361132j365900j359046j383304j468480j527607j500547j464188
3179.8F72346175j485169j533270j581848j614332j595139j587093j644016j679122
3196.1F59626186j666188j672685j699865j717925j722515j707196j677156j690745
3212.4F46071911j760066j811504j799703j752615j751065j796544j836001j865507
$$ plain form
3088 714937449 714625895 714291275 713907063 713507295 713127971 712702930 712184072 711617649 711067796 710544348
3108.4 710544348 709984541 709331393 708618104 707916021 707219660 706494212 705728292 704935610 704139233 703286290
3128.8 703286290 702341795 701352596 700315535 699245036 698198438 697151959 696050882 694899499 693743765
3147.1 693743765 692606032 691439569 690206528 688951552 687699616 686423361 685115099 683776379
3163.4 683776379 682415247 681049347 679690301 678306997 676838517 675310910 673810363 672346175
3179.8 672346175 670861006 669327736 667745888 666131556 664536417 662949324 661305308 659626186
3196.1 659626186 657959998 656287313 654587448 652869523 651147008 649439812 647762656 646071911
3212.4 646071911 644311845 642500341 640700638 638948023 637196958 635400414 633564413 631698906
3228.7F31698906j897573j905680j858055j824797j826167j816749j840115j903713
3245F16826057j879274j744450j686632j753569j785040j726389j685977j687944j679360
3263.4F01197422j707733j771450j779795j719415j661182j670300j708210j717865
3279.7E87461472j719237j734972j776635j855135j931251j941978j935602j972973
3296E72593689j996458k017319k090633k166092k206564k226472k207339k171576k206921
3314.4E53304315k319158k423107k466619k489209k534092k573132k579093k580703
3330.7E33339202k615094k658367k703786k742052k734423k729296k754212k786636
3347E11615336k841890k912640k943159k919972k898335k895892k894461k915978k955795
$$ plain form
3228.7 631698906 629801333 627895653 626037598 624212801 622386634 620569885 618729770 616826057
3245 616826057 614946783 613202333 611515701 609762132 607977092 606250703 604564726 602876782 601197422
3263.4 601197422 599489689 597718239 595938444 594219029 592557847 590887547 589179337 587461472
3279.7 587461472 585742235 584007263 582230628 580375493 578444242 576502264 574566662 572593689
3296 572593689 570597231 568579912 566489279 564323187 562116623 559890151 557682812 555511236 553304315
3314.4 553304315 550985157 548562050 546095431 543606222 541072130 538498998 535919905 533339202
3330.7 533339202 530724108 528065741 525361955 522619903 519885480 517156184 514401972 511615336
3347 511615336 508773446 505860806 502917647 499997675 497099340 494203448 491308987 488393009 485437214
3365.4D85437214k955675k876013k767474k702236k652466k563715k456248k350777
3381.7D64112610k226144k131463k083182k018392j913518j798331j729191j686066
3398D48526323j624167j537740j444638j369238j306713j223892j142233j064182r57489
3416.3D36856031q45700p64251p00205n90742m59850l47882k37257j30444l1949J04309
3436.7D32852060K54601L59416M51833N62459O90401P79837Q30442Q90881R91314J122386
3457.1D39785630J227229J296252J379818J430214J458883J569152J695156J769185
3473.4D51611519J802891J838267J909465K010047K042175K071708K204537K290368
3489.8D67780977K289325K339036K476632K560020K576560K679914K860635K911538
$$ plain form
3365.4 485437214 482481539 479605526 476838052 474135816 471483350 468919635 466463387 464112610
3381.7 464112610 461886466 459755003 457671821 455653429 453739911 451941580 450212389 448526323
3398 448526323 446902156 445364416 443919778 442550540 441243827 440019935 438877702 437813520 436856031
3416.3 436856031 436010331 435246080 434545875 433955133 433495283 433147401 432910144 432779700 432747751 432852060
3436.7 432852060 433106661 433466077 433917910 434480369 435170770 435950607 436781049 437671930 438663244 439785630
3457.1 439785630 441012859 442309111 443688929 445119143 446578026 448147178 449842334 451611519
3473.4 451611519 453414410 455252677 457162142 459172189 461214364 463286072 465490609 467780977
3489.8 467780977 470070302 472409338 474885970 477445990 480022550 482702464 485563099 488474637
3506.1D88474637K933920L030330L093958L169834L244162L306865L365219L470719
3522.4E14089644L620326L741563L838360L886461L855229L887772M040420M104913
3538.7E45064688M060387M096687M360676M591167M471004M388690M590511M618466
3555E80242276M515648M589796M593790M429996M648864N366921N325675M683853M606485
3573.4F23003304M861116M959286M914820M734814M429698M583418N288482N138159
3589.7F61913097M312158M262208M481733M275501M150272M143595L859222L796935
3606F95194721M299581M403770M047036L776968L416657L638685M036546L361225K484202
3624.4G28659391K436400L592253L845930K521157K186596K320111K203405K118766
$$ plain form
3506.1 488474637 491408557 494438887 497532845 500702679 503946841 507253706 510618925 514089644
3522.4 514089644 517709970 521451533 525289893 529176354 533031583 536919355 540959775 545064688
3538.7 545064688 549125075 553221762 557582438 562173605 566644609 571033299 575623810 580242276
3555 580242276 584757924 589347720 593941510 598371506 603020370 608387291 613712966 618396819 623003304
3573.4 623003304 627864420 632823706 637738526 642473340 646903038 651486456 656774938 661913097
3589.7 661913097 666225255 670487463 674969196 679244697 683394969 687538564 691397786 695194721
3606 695194721 699494302 703898072 707945108 711722076 715138733 718777418 722813964 726175189 728659391
3624.4 728659391 731095791 734688044 738533974 741055131 743241727 745561838 747765243 749884009
3640.7G49884009J896739J517952J607001K533495K754450J566887J190424J743376
3657G64694333J597822J190245J148105Q99255O42240J141906J296997O53326J186729
3675.4G74450958J489401P22348N33998M81725L51429Q01206J529455J304567O57856
3693.7G82322943M35472M21226N10812P87437O62028J26899m1604L91125R60291O36697
3714.1G87213326M7266k6345R4890J29998J89483L24726J14560j53958K8610M61101
3734.5G88423657O56367J23262o11126k79427Q33035L82244k53200N49078P16746p2897
3754.9G90467739k81870J30534K60055l0875k6524O4730K07067L37303K7060k56956
3775.3G90898263j02996K37226J40786r1433L6299R4414K1398o1333j69754p2062j37031
$$ plain form
3640.7 749884009 751780748 753298700 754905701 757439196 760193646 761760533 762950957 764694333
3657 764694333 766292155 767482400 768630505 769529760 770172000 771313906 772610903 773264229 774450958
3675.4 774450958 775940359 776662707 777196705 777678430 778029859 778831065 780360520 781665087 782322943
3693.7 782322943 782758415 783179641 783690453 784477890 785139918 785266817 785225213 785616338 786576629 787213326
3714.1 787213326 787260592 787234247 787329137 787459135 787648618 787973344 788087904 787933946 787962556 788423657
3734.5 788423657 789080024 789203286 788592160 788312733 789145768 789528012 789274812 789823890 790540636 790467739
3754.9 790467739 790185869 790316403 790576458 790545583 790519059 790583789 790790856 791128159 791155219 790898263
3775.3 790898263 790795267 791032493 791173279 791081846 791118145 791212559 791233957 791172624 791002870 790930808 790793777
3797.7G90793777j39058L64959P8380j77324K19107q4519n85795l92318J87338J0550
3818.1G90275097L0100N53072J28507j75416j56522j98960j37210j95682J0669M48704
3838.5G90582359K81334J5795l5882k87771o36399o46174N29051J337290J3649o87659
3858.9G90465593m67896o7890K8908k86996n6982L50595J45614p2778l32653k24531
3879.3G89480984K3604j10627J82271J79112k15947J2874M6969l72470l55362k7240
3899.7G88844168J63019L23892K50756q6963j93834j72973k34246q7440J72376R3937
3920.1G89072692j09017l6060N8472q4400j29819N0902J08004k265q5235p3790M4167
3942.5G88813651L5584o7056J8239J02103J371r5785q2194l2008M2796N0843o7711
$$ plain form
3797.7 790793777 790654719 791019678 791098058 790920734 791139841 791055322 790469527 790077209 790264547 790275097
3818.1 790275097 790305197 790858269 790986776 790811360 790654838 790455878 790318668 790122986 790133655 790582359
3838.5 790582359 790863693 790879488 790843606 790555835 789919436 789273262 789802313 791139603 791153252 790465593
3858.9 790465593 789997697 789929807 789958715 789671719 789614737 789965332 790110946 790038168 789705515 789480984
3879.3 789480984 789504588 789393961 789576232 789755344 789539397 789552271 789599240 789226770 788871408 788844168
3899.7 788844168 789007187 789331079 789581835 789494872 789301038 789128065 788893819 788806379 788978755 789072692
3920.1 789072692 788963675 788927615 788986087 788901687 788771868 788822770 788930774 788928509 788843274 788769484 788813651
3942.5 788813651 788849235 788782179 788800418 788902521 788903892 788808107 788725913 788693905 788736701 788787544 788719833
3965G88719833j11938m7385m5002p8916n9724n2035m7684j2219j6868l9101k8133m947
3989.5G88175881J4841K6286J7166k6941
3997.6G88207233
$$ plain form
3965 788719833 788607895 788560510 788515508 788436592 788376868 788324833 788277149 788264930 788248062 788208961 788180828 788175881
3989.5 788175881 788190722 788217008 788234174 788207233
3997.6 788207233
##END=$$ End of the data block
