##TITLE=Luteina Padrao $$ Begin of the data block
##JCAMP-DX=5.00 $$ ACD/SpecManager v 10.08
##SPECTROMETER/DATA SYSTEM=Alpha
##DATE=09 Oct 2014 07:06:54
##DATA TYPE=INFRARED SPECTRUM
##DATA CLASS=XYDATA
##ORIGIN=
##OWNER=
##NPOINTS=1765
##FIRSTX=399.76428223
##LASTX=3997.64306641
##MAXX=3997.64306641
##MINX=399.76428223
##MAXY=0.83264595
##MINY=0.43350220
##XFACTOR=1.0000000000
##YFACTOR=1.000000000000000e-9
##FIRSTY=0.64445537
##DELTAX=2.03961372
##XUNITS=1/CM
##YUNITS=ARBITRARY UNITS
##XYDATA=(X++(Y..Y))
399.8F44455373l831327k767384o84499Q53240O11961k04563K74777K338946L095627
418.1F44142151j041770l582299k083599j135290j195788j200319l61621Q17478N17010
436.5F34875953l10182O14345K029001J682282K79367j36078P97034J359463R68933
454.8F42160118L50237o98507j292885j623332k092958j541733k39134j4246j768350
473.2F33239210k766729j305103k0921k45929o51479k33412L64483n6803j078189r88901
493.6F26256227P5400J61648o69598j009942p46428q21472j938998k564490j345694
511.9F17396653j7524l97742j856267j901746j92404P16090j04189k93910J370013
530.3F14718974K450466J544297O06715J319111J947343O78718r71913j015246j77264
$$ y = [644455373, 640624046, 637856662, 637172163, 638025403, 638637364, 638432801, 638707578, 641046524, 644142151, 643100381, 639518082, 637434483, 636299193, 635103405, 633903086, 633541465, 634358943, 634875953, 634565771, 635180116, 637209117, 638891399, 639170766, 639034688, 639831722, 641191185, 642160118, 642510355, 641811848, 640518963, 638895631, 636802673, 635260940, 635021806, 635007560, 633239210, 630472481, 629167378, 629146457, 628900528, 628249049, 628015637, 628380120, 628323317, 627245128, 626256227, 626331627, 626493275, 625823677, 624813735, 624067307, 623245835, 621306837, 618742347, 617396653, 617379129, 616981387, 615125120, 613223374, 613030970, 613747060, 613642871, 613348961, 614718974, 617169440, 618713737, 619320452, 620639563, 622586906, 623265624, 622293711, 621278465, 621101201]
548.7F21101201n35012j888692k151370j047909o18637j747727k658606j898348r19640
567F07635260j611591k729892j780212M04417J106143O06716J127183K811194L608465
585.4F11177683K605855J657069K038241K143621P76648n78582l82244N82635N14686
603.7F20535612m05133l50237J092554K087891J584768J103044K225995L710210L510237
622.1F35094941K376556K239347K918541K634227J288951N89490J233339J753509R30905
640.4F51059806N9426N91278J500786J280605M54426M88997J361310J605928Q36313
658.8F59238875M48882J053632R38237n90981l10599K053678K180040J306772N09202
677.2F66827738M51684J133979J509905J023113M30584M92156O98507K19822p08700
$$ y = [621101201, 620566189, 618677497, 616526127, 615478218, 614859581, 613111854, 610453248, 608554900, 607635260, 606023669, 603293777, 601513565, 601917982, 603024125, 603630841, 604758024, 607569218, 611177683, 613783538, 615440607, 617478848, 619622469, 620399117, 619820535, 619438291, 620020926, 620535612, 620130479, 619780242, 620872796, 622960687, 624545455, 625648499, 627874494, 631584704, 635094941, 637471497, 639710844, 642629385, 645263612, 646552563, 647142053, 648375392, 650128901, 651059806, 651119232, 651710510, 653211296, 654491901, 654946327, 655435324, 656796634, 658402562, 659238875, 659687757, 660741389, 661679626, 661088645, 660778046, 662831724, 665011764, 666318536, 666827738, 667279422, 668413401, 669923306, 670946419, 671377003, 671869159, 672567666, 672787488, 672078788]
695.5F72078788j260400j221776j130819j246214j025378j5617J246154J893998J905322
713.9F71224058J887560K285480L205240L781795L390491K963484K906859K750873
730.2F94395840K341330J921773J776815J460015M75407n59747r55761j266420k277016
748.5F97312236l483534l650308k797603k156258k012610j309574M11451K055526K593934
766.9F86963260K705097L498197M405975M201889L218770K830267L240347L256500
783.2G14320302K367198J664043K047896K721548K654612K273083K625644L492475
799.5G34166801L576875K608180J812339J922786K060771J358628M55976M06026P66516
817.9G49134898L44098p65264j434803j465142j858473l019750l998876l914713l310919
$$ y = [672078788, 670818388, 669596612, 668465793, 667219579, 666194201, 666178584, 667424738, 669318736, 671224058, 673111618, 675397098, 678602338, 682384133, 685774624, 688738108, 691644967, 694395840, 696737170, 698658943, 700435758, 701895773, 702371180, 701811433, 700855672, 699589252, 697312236, 693828702, 690178394, 687380791, 685224533, 683211923, 681902349, 682313800, 684369326, 686963260, 689668357, 693166554, 697572529, 701774418, 704993188, 707823455, 711063802, 714320302, 716687500, 718351543, 720399439, 723120987, 725775599, 728048682, 730674326, 734166801, 737743676, 740351856, 742164195, 744086981, 746147752, 747506380, 747962356, 748368382, 749134898, 749478996, 748713732, 747278929, 745813787, 743955314, 740935564, 736936688, 733021975, 729711056]
836.2G29711056l127992l102422k332509r96232j98781j97768j46270M69148J078427
854.6G21156657J038432Q32379J351356K448201L125310L070236L051340L352583L216922
873G42643416K133846N88834o42299j638472k958596m382908n015791m587590l921450
891.3G22218990l712475l589153l011346k383053k483011l159463l562689l506541
907.6F96811259l608704m144132m523814m158377l383100k911210k692700k102494
923.9F69286728j071453k76506j7166K42233R16481J660526J965880J986861K030552
942.3F76724136J628220J4245k595722m898846o083429o674230p407070q108735q228004
960.7F34370565p971406q032977q487225q733630q523166q360863q555770q602440
$$ y = [729711056, 726583064, 723480642, 721148133, 720151901, 719953120, 719755352, 719609082, 720078230, 721156657, 722195089, 723027468, 724378824, 726827025, 729952335, 733022571, 736073911, 739426494, 742643416, 744777262, 745366096, 744723797, 743085325, 740126729, 735743821, 730728030, 726140440, 722218990, 718506515, 714917362, 711906016, 709522963, 707039952, 703880489, 700317800, 696811259, 693202555, 689058423, 684534609, 680376232, 676993132, 674081922, 671389222, 669286728, 668215275, 667938769, 667921603, 668163836, 669080317, 670740843, 672706723, 674693584, 676724136, 678352356, 678366601, 675770879, 670872033, 664788604, 658114374, 650707304, 642598569, 634370565, 626399159, 618366182, 609878957, 601145327, 592622161, 584261298, 575705528, 567103088]
977E67103088p958830o860256n922436n169988m116595k759039j673520j171052q69274
995.3E30602098l28064J64270R358o54101j180769j488447j969635k612174k892256
1013.7E19650280k490341j761794j253784q60333j48595P13289J175761J182735J197159
1032E17404377J429379J571537J386940J199841J425565J920759K161682K062619K083301
1050.4E32646000K442480K860248L110051L478229M280686N149663N243539M077197
1066.7E63288093J824736j019954l693521n158127m782021k924442o67870J060664
1083E47927558K210796L218234M069984M246056L645956K829016K167701J541734Q34286
1101.4E72691321L33250L99768Q59976J177967J217663J344800J697421J880288J639426
$$ y = [567103088, 559144258, 552284002, 546361566, 541191578, 537074983, 534315944, 532642424, 531471372, 530602098, 530274034, 530438304, 530447662, 529793561, 528612792, 527124345, 525154710, 522542536, 519650280, 517159939, 515398145, 514144361, 513284028, 513135433, 513848722, 515024483, 516207218, 517404377, 518833756, 520405293, 521792233, 522992074, 524417639, 526338398, 528500080, 530562699, 532646000, 535088480, 537948728, 541058779, 544537008, 548817694, 553967357, 559210896, 563288093, 565112829, 564092875, 560399354, 555241227, 550459206, 547534764, 546866894, 547927558, 550138354, 553356588, 557426572, 561672628, 565318584, 568147600, 570315301, 571857035, 572691321, 573024571, 573424339, 574284315, 575462282, 576679945, 578024745, 579722166, 581602454, 583241880]
1119.8E83241880J348019J467466J866579K086043K059102J928211J500845M11510
1136.1E95909655j266658k840340l744424m137158m365325m306793l722549k756357
1152.4E68770051j788378r80496q3506J116633K376497L389955M254341N172133O046057
1170.7E88273287O550252O576240O450653O475747O435812O006538N359531M842400
1187.1F36970460M391969L672421K704084J901209J468480J187920R02832Q50260J257956
1205.4F55307591J882017K291917K410233K460957K470970K162934J472294P70330
1221.7F71229243L34561m113m02867o75738o44446m32193k92182k83658k34247l6776
1242.1F68557584J19508R2148P6414K50637N24640O74546O76811P68959R84132J165510
$$ y = [583241880, 584589899, 586057365, 587923944, 590009987, 592069089, 593997300, 595498145, 595909655, 594642997, 591802657, 588058233, 583921075, 579555750, 575248957, 571526408, 568770051, 566981673, 566001177, 565917671, 567034304, 569410801, 572800756, 577055097, 582227230, 588273287, 594823539, 601399779, 607850432, 614326179, 620761991, 626768529, 632128060, 636970460, 641362429, 645034850, 647738934, 649640143, 651108623, 652296543, 653199375, 654049635, 655307591, 657189608, 659481525, 661891758, 664352715, 666823685, 668986619, 670458913, 671229243, 671563804, 671559691, 671156824, 670481086, 669836640, 669404447, 669112265, 668828607, 668594360, 668557584, 668677092, 668769240, 668845654, 669096291, 669620931, 670295477, 670972288, 671741247, 672725379, 673890889]
1262.5F73890889J296639J386225J469434J535773J439035J215696J076460J063347
1278.8F84373498J031101Q65161O25789M06444J52767j81973n20766p44342p84874
1297.2F85222805o84560n63085m16636j01269K64109M14550L23891N8115j69575m04895
1317.6F83943450j096010j809358j889527j718700j771331j926661j776576j115620
1333.9F70839667k15768J05261p63535j602709j299024r04262j074851j340747j393079
1352.3F62350953j497507j792014j546204p79093j172125k508223k209484q87931J93894
1370.6F50152266J035213O08027l61144j9312N81563R72092K091407K926410K041101
1389F60027623J700521K871811K909184J164198o30260j539886r94682p85947j420200
$$ y = [673890889, 675187528, 676573753, 678043187, 679578960, 681017995, 682233691, 683310151, 684373498, 685404599, 686269760, 686895549, 687301993, 687454760, 687272787, 686752021, 686007679, 685222805, 684538245, 683975160, 683558524, 683457255, 683721364, 684135914, 684459805, 684517920, 684348345, 683943450, 682847440, 681038082, 679148555, 677429855, 675658524, 673731863, 671955287, 670839667, 670623899, 670729160, 669965625, 668362916, 667063892, 666159630, 665084779, 663744032, 662350953, 660853446, 659061432, 657515228, 656736135, 655564010, 653055787, 650846303, 649958372, 650152266, 651187479, 651795506, 651434362, 651415050, 651996613, 652968705, 655060112, 657986522, 660027623, 661728144, 664599955, 667509139, 668673337, 668043077, 666503191, 665508509, 664722562, 663302362]
1407.3F63302362j268327q32379l48926J008749K110303L32355j613021r43482k90632
1425.7F61457002L87252Q03589L67701J134515J943767k73883j727760n97536N35309
1444.1F64029956J066148L83914p09534K9743K377093L711223q65102m353344j547992
1462.4F64122105J453399J482964J921892M782021O724954N057633L344416L392875
1478.7F92282259M125357M533231N125642O574691O239056K498388R12428L368736
1495G25659788M575967J933814Q11457L500343Q154928O717503k151608k824664O42419
1513.4G47019947L511309L966809L254532K150357m42386j028716q28207j55449K072812
1531.8G59521008K096831J072646M363536O736637o319m548549l734410j311839N43475
$$ y = [663302362, 662034035, 661201656, 660852730, 661861479, 663971782, 664304137, 662691116, 661747634, 661457002, 661844254, 662647843, 663015544, 664150059, 666093826, 665819943, 664092183, 663494647, 664029956, 665096104, 665480018, 664770484, 664800227, 667177320, 670888543, 670023441, 665670097, 664122105, 665575504, 667058468, 668980360, 673762381, 680487335, 685544968, 688889384, 692282259, 696407616, 700940847, 706066489, 712641180, 718880236, 721378624, 722291052, 725659788, 730235755, 732169569, 732981026, 736481369, 744636297, 751353800, 749202192, 746377528, 747019947, 750531256, 754498065, 757752597, 759902954, 759460568, 758431852, 757603645, 757448196, 759521008, 761617839, 762690485, 767054021, 773790658, 773784339, 769235790, 765501380, 764189541, 764733016]
1550.1G64733016J242936K676308N338610N498886m526317p004381k494812J13309
1566.4G65577555Q91626r38476j650929N11706o32107l971041l319084j984835j772344
1584.8G52712071j824498j752317j819194k014875k420962k819061k701283k534389
1601.1G34825492k845049l027439k907932l478646m105091l063858k150059m682421
1617.4G08564997n680502l307581l006637m160464m283249m077613j816631K102375
1633.7F84334695K401948k277851k865732r9897L152967N214333K632976J332164M797220
1652.1F98622823K268135l331721r54926K652646L916621K591371K923549N173385
1668.4G13861883M329323K094567K422571K004683J977385M466712O968617L949583
$$ y = [764733016, 765975952, 768652260, 773990870, 779489756, 774963439, 767959058, 765464246, 765577555, 766469181, 765530705, 763879776, 764391482, 763759375, 759788334, 756469250, 754484415, 752712071, 750887573, 749135256, 747316062, 745301187, 742880225, 740061164, 737359881, 734825492, 731980443, 728953004, 726045072, 722566426, 718461335, 715397477, 713247418, 708564997, 702884495, 699576914, 696570277, 692409813, 688126564, 684048951, 682232320, 684334695, 686736643, 684458792, 681593060, 681493163, 684646130, 689860463, 692493439, 693825603, 698622823, 700890958, 697559237, 696604311, 699256957, 703173578, 705764949, 708688498, 713861883, 718191206, 720285773, 722708344, 724713027, 726690412, 731157124, 738125741, 742075324]
1684.7G42075324j767635j270950L98815K081334M362285M204750J975060j373768
1701.1G50685215k785861j581729j942158j964569j4007K455056M092455K101421k453983
1719.4G48591840k409637K5332J551748K900958M370689N374491M809439J179696O43730
1737.8G67038286K374470K298832K139091L074706L745914K487599n1200K1994J718164
1756.1G84847856K101957K090991J737475Q37207J794875L434598L999472K297282
1772.4H03141713q91328j088619P20024J526535J073420O66499O80685J961708L482401
1790.8H11273038J865149p62880j45912J361966J044929l87192m95314O96897J503766
1809.2H15954447P86245l88980k04623M76956N89848Q81791J541317J499593J260996
$$ y = [742075324, 740307689, 739036739, 739435554, 741516888, 745879173, 750083923, 752058983, 750685215, 747899354, 746317625, 744375467, 742410898, 742396891, 744851947, 748944402, 751045823, 748591840, 746182203, 746207535, 747759283, 750660241, 755030930, 760405421, 765214860, 766394556, 767038286, 769412756, 771711588, 773850679, 776925385, 780671299, 783158898, 783107698, 783129692, 784847856, 786949813, 789040804, 790778279, 791615486, 793410361, 796844959, 800844431, 803141713, 802250385, 801161766, 801881790, 803408325, 804481745, 805148244, 805828929, 807790637, 811273038, 813138187, 812375307, 812229395, 813591361, 814636290, 814249098, 813753784, 814450681, 815954447, 816740692, 816351712, 816147089, 816624045, 817213893, 818095684, 819637001, 821136594, 822397590]
1827.5H22397590O86288j215935j421571K4736M29034M70221J635790J971603k42293
1845.9H24735463j601339j148462l64006K03550K96533J38462Q8871L31401J002133
1864.2H23682606J890838J367927r20475j732349q13484j50442J09732K78354K76684
1882.6H23989391K14398N46634Q63910J09911m72665k07007j94668k09988k6583K0504
1903H24633837J97828N67555M18365k91407l75331N26071R43184J26779k92063k96950
1923.4H26157868o19769m95196j53780j1563O7234O3658J21236N67555Q64208J06752
1943.8H26668203o45101n55754k39849N1796J93119Q0348l8743K6345J46210L49641
1964.2H26036215L98576n3942l59893j57773j5438k9087J6332P0989N8829M1366J42872
$$ y = [822397590, 823083878, 821867943, 820446372, 820471108, 820900142, 821370363, 823006153, 824977756, 824735463, 823134124, 821985662, 821621656, 821825206, 822121739, 822260201, 822349072, 822680473, 823682606, 825573444, 826941371, 826020896, 824288547, 823475063, 823324621, 823434353, 823712707, 823989391, 824203789, 824750423, 825614333, 825724244, 825251579, 825044572, 824849904, 824639916, 824613333, 824633837, 824831665, 825399220, 825817585, 825526178, 825150847, 825676918, 826620102, 826746881, 826454818, 826157868, 825538099, 825042903, 824889123, 824877560, 824944794, 825008452, 825129688, 825697243, 826561451, 826668203, 826023102, 825467348, 825227499, 825279295, 825472414, 825552762, 825514019, 825540364, 825686574, 826036215, 826434791, 826380849, 826020956, 825863183, 825847745, 825818658, 825834990, 825905979, 825964808, 826006174, 826149046]
1986.6H26149046L47555M03345q8156n89132m04060j05679j18196j94967j59919r4533
2007H25145304j51992k70962j92225N7816l6239m78685o14763m08888k64585k76923
2027.4H22507858l46780l34858k57194k43962k53380j93417j78635k50876k74896k32697
2047.8H19941163j31249l9459n0962p9453k0444O4909J25230J18136j9014q4579Q35
2070.2H19825113L0875k98K2531P2658P3909N0843P2539J32143J39058O2645K2113
2092.7H20504129N8889P0751N0306M7446O6518P0751J6332k8730K3246Q8215L3498
2115.1H21001351n9307m2379L6657N7042J5974r656J9014M6432K38n4776l6598O795
2139.6H20980787n364m1127j4484M9054N9605Q643P15R3043J97112K08378J57535J62602
$$ y = [826149046, 826496601, 826899946, 826811790, 826222658, 825818598, 825712919, 825594723, 825399756, 825239837, 825145304, 824993312, 824722350, 824530125, 824587941, 824551702, 824073017, 823458254, 823049366, 822784781, 822507858, 822161078, 821826220, 821569026, 821325064, 821071684, 820878267, 820699632, 820448756, 820173860, 819941163, 819809914, 819770455, 819719493, 819640040, 819619596, 819684505, 819809735, 819927871, 819908857, 819824278, 819825113, 819855988, 819855690, 819878221, 819950879, 820024788, 820075631, 820148170, 820280313, 820419371, 820482016, 820504129, 820563018, 820633769, 820684075, 820731521, 820798039, 820868790, 820885122, 820856392, 820879638, 820967853, 821001351, 820942044, 820899665, 820936322, 820993364, 821009338, 820999682, 821018696, 821065128, 821065366, 821010590, 820973992, 820980787, 820975423, 820934296, 820919812, 820968866, 821028471, 821037114, 821037829, 821130872, 821327984, 821536362, 821693897, 821856499]
2164.1H21856499K48015K93791K39253K11000K73407L17693K76863K16544K30133K98203
2184.5H24461401K98857K19047K07246L01420L43204K59697J90437K41161L26693K97188
2204.8H27146351K00868K27273L26514L12805K05517J70946K44140K77639J91152J09494
2225.2H29412699J51157K29240J77621N1260M5658J60515K00152Q1778K503Q5533J63436
2247.7H30761552R6619p927O914J02818J27315M6551R060J05858J91331J42515O6638
2270.1H31649244R2268J77920J87635J32084J36137J62363J08302m8459j89900j85073
2290.5H32222521j24216j43647k40207l11434k92242k92897m39822o34790o92248n99206
2310.9H28451812n04255n65648q12471j034975j019776q33213o67095o47068o85037
$$ y = [821856499, 822104514, 822398305, 822637558, 822848558, 823121965, 823439658, 823716521, 823933065, 824163198, 824461401, 824760258, 824979305, 825186551, 825487971, 825831175, 826090872, 826281309, 826522470, 826849163, 827146351, 827347219, 827574492, 827901006, 828213811, 828419328, 828590274, 828834414, 829112053, 829303205, 829412699, 829563856, 829793096, 829970717, 830021977, 830067635, 830228150, 830428302, 830510080, 830512583, 830598116, 830761552, 830858171, 830850244, 830857158, 830959976, 831087291, 831133842, 831142902, 831248760, 831440091, 831582606, 831649244, 831741512, 831919432, 832107067, 832239151, 832375288, 832537651, 832645953, 832597494, 832407594, 832222521, 832098305, 831954658, 831714451, 831403017, 831110775, 830817878, 830378056, 829743266, 829051018, 828451812, 827947557, 827381909, 826569438, 825534463, 824514687, 823681474, 823014379, 822367311, 821682274]
2329.3H21682274o24060n52953n53667m95494l92735k83420K10882J302957J595616
2347.6H21889400K39909j633048k655089k319038j506209q17597j39415O09278J223147
2366H14891338J572430J744509J833499J801550J668751J558721J473487J257241Q53180
2384.3H28654706M06445J02818k7061r1433j73152k23517k05219k01762k51889k89619
2404.7H27700317k73764k57373k75195k85983k90036l08096l20435l29435l39389l48866
2425.1H24671745l65078l63290l52324l77178m24027m20511l55184l43323m17530m55916
2445.5H20797384m03404l57628m01855m50790l94165l21329l47674m14550m04954l21746
2465.9H16979289k88486l46184l78967l26216k84254l32237l88324l39091k46703k57314
$$ y = [821682274, 821058214, 820505261, 819951594, 819456100, 819063365, 818779945, 818990827, 820293784, 821889400, 822129309, 820496261, 817841172, 815522134, 814015925, 813198328, 813058913, 813668191, 814891338, 816463768, 818208277, 820041776, 821843326, 823512077, 825070798, 826544285, 827801526, 828654706, 829061151, 829163969, 829136908, 829045475, 828872323, 828648806, 828443587, 828241825, 827989936, 827700317, 827426553, 827169180, 826893985, 826608002, 826317966, 826009870, 825689435, 825360000, 825020611, 824671745, 824306667, 823943377, 823591053, 823213875, 822789848, 822369337, 822014153, 821670830, 821253300, 820797384, 820393980, 820036352, 819634497, 819183707, 818789542, 818468213, 818120539, 817705989, 817301035, 816979289, 816690803, 816344619, 815965652, 815639436, 815355182, 815022945, 814634621, 814295530, 814048827, 813791513]
2486.3H13791513l28123l02971k10762k03847k85805l11970k17379j47342k00808k64407
2506.7H11318099k44498j91986k19703l03328k91884k08259k13861l06785l40581k82765
2527.1H08714449k48015l08811l82543l62396k86281k71559l37422l80456l38316k92123
2547.5H05506527l20017l72887l50058k74717k69473l17454l24965k92778k71320l09050
2567.9H02403808l60489l31342k67506k68936l13521l04818k57969k74479l39508l68476
2588.3G99316764l20792k43306k34008l17157l80873l61383l44873l91960m65393m74274
2608.7G95782745m30644m62770n58257n93901n55694n64516o59346p14779o65248o12556
2629.1G89965034o62446p47443p34865o57499o55294p38799p63655o87718o43909o83368
$$ y = [813791513, 813463390, 813160419, 812949657, 812745810, 812460005, 812148035, 811930656, 811783314, 811582506, 811318099, 811073601, 810881615, 810661912, 810358584, 810066700, 809858441, 809644580, 809337795, 808997214, 808714449, 808466434, 808157623, 807775080, 807412684, 807126403, 806854844, 806517422, 806136966, 805798650, 805506527, 805186510, 804813623, 804463565, 804188848, 803919375, 803601921, 803276956, 802984178, 802712858, 802403808, 802043319, 801711977, 801444471, 801175535, 800862014, 800557196, 800299227, 800024748, 799685240, 799316764, 798995972, 798752666, 798518658, 798201501, 797820628, 797459245, 797114372, 796722412, 796257019, 795782745, 795352101, 794889331, 794331074, 793737173, 793181479, 792616963, 791957617, 791242838, 790577590, 789965034, 789302588, 788555145, 787820280, 787162781, 786507487, 785768688, 785005033, 784317315, 783673406, 782990038]
2649.5G82990038p22169o91295o26922o32524o97077o97732o01649n35428n78404o12795
2669.9G76594043n49317m91261n12362n47051n30839m86374m74691n01871n09501m71353
2690.3G71519423m56036n12898n46813n02109m59314m75287n18978n38706n22197n15639
2710.7G66471446n50807n64158n20527m94540n14567n38051n39780n28097n25534n22435
2731.1G61172950n26488n32925m99487m51624m31716m23313l93808l90887m64141n37276
2751.4G56521285n22793m56571m25220m42326m69327m77314m94838n35726n41926m89592
2771.8G51665652m47810n00560o08265o56426o43313o36458o51658o98507p69973q05080
2792.2G45247602q05079q48592r40442r98855r98079j028240j101613j119733j118958
$$ y = [782990038, 782267869, 781576574, 780949652, 780317128, 779620051, 778922319, 778320670, 777785242, 777206838, 776594043, 776044726, 775553465, 775041103, 774494052, 773963213, 773476839, 773002148, 772500277, 771990776, 771519423, 771063387, 770550489, 770003676, 769501567, 769042253, 768566966, 768047988, 767509282, 766987085, 766471446, 765920639, 765356481, 764835954, 764341414, 763826847, 763288796, 762749016, 762220919, 761695385, 761172950, 760646462, 760113537, 759614050, 759162426, 758730710, 758307397, 757913589, 757522702, 757058561, 756521285, 755998492, 755541921, 755116701, 754674375, 754205048, 753727734, 753232896, 752697170, 752155244, 751665652, 751217842, 750717282, 750109017, 749452591, 748809278, 748172820, 747521162, 746822655, 746052682, 745247602, 744442523, 743593931, 742653489, 741654634, 740656555, 739628315, 738526702, 737406969, 736288011]
2810.6G36288011j178920j252890j277983j283407j350284j476228j567900j577914
2826.9G25322485j613379j766622j982510k212882k531826l155947m300952o146848
2843.2G01611519q575857r697318o680548o42955L521859L803313K283216Q23855k41339
2861.6F86205745j026690j653910k157271k425611k370536k157033k022683j963556
2877.9F70428455j886308j798868j726449j680791j648903j582384j479149j417637
2894.2F57207966j469910j580000j664222j812040k204299k913416l968358n608082
2910.5F35987639p887184r506524q245766l947794P25925L526926M381716M237532
2926.8F19272470L840387L445864L189802L175438L307521L441930L517926L469050
$$ y = [736288011, 735109091, 733856201, 732578218, 731294811, 729944527, 728468299, 726900399, 725322485, 723709106, 721942484, 719959974, 717747092, 715215266, 712059319, 707758367, 701611519, 693035662, 683338344, 676657796, 676014841, 679536700, 683340013, 685623229, 686447084, 686205745, 685179055, 683525145, 681367874, 678942263, 676571727, 674414694, 672392011, 670428455, 668542147, 666743279, 665016830, 663336039, 661687136, 660104752, 658625603, 657207966, 655738056, 654158056, 652493834, 650681794, 648477495, 645564079, 641595721, 635987639, 628100455, 618593931, 610348165, 606400371, 607126296, 610653222, 615034938, 619272470, 623112857, 626558721, 629748523, 632923961, 636231482, 639673412, 643191338, 646660388]
2943.2F46660388L224611K796650K300560J872122J617313J651406J912654K168119
2959.5F64203823K336979K464830K545536K577603K646625K805292K916635K840757
2975.8F85338080K721608K664625K518595K313077K205431K138257K068341J904249
2992.1G03872263J530350J184106R68575P55250O08624M51922K45094K07603K44975
3010.5G10068762M232m55439p53522q17477q39353q82387r61423j051486r82344q85308
3030.9G02444255j026272j267553j364350j259029j148641j227737j380682j430094
3047.2F92339897j398206j401960j415313j397788j482427j595080j496136j312674
3063.5F80840313j289486j489699j736820j737595j523852j299500j234949j429320
$$ y = [646660388, 649884999, 652681649, 654982209, 656854331, 658471644, 660123050, 662035704, 664203823, 666540802, 669005632, 671551168, 674128771, 676775396, 679580688, 682497323, 685338080, 688059688, 690724313, 693242908, 695555985, 697761416, 699899673, 701968014, 703872263, 705402613, 706586719, 707555294, 708310544, 708919168, 709371090, 709616184, 709823787, 710068762, 710072994, 709617555, 708864033, 708046556, 707207203, 706324816, 705363393, 704311907, 703329563, 702444255, 701417983, 700150430, 698786080, 697527051, 696378410, 695150673, 693769991, 692339897, 690941691, 689539731, 688124418, 686726630, 685244203, 683649123, 682152987, 680840313, 679550827, 678061128, 676324308, 674586713, 673062861, 671763361, 670528412, 669099092]
3079.8F69099092j638233j650036j636684j619875j536906j558542j641631j594603
3096.1F56222582j416326j342117j547814j701355j536846j384735j473963j454354
3112.4F44365072j222372j197874j421392j653910j803219j763165j598656j503647
3128.8F32200837j513362j562893j513779j334012j308679j542688j674294j562834
3145.1F20188296j454055j339019j216411j367391j638829j651824j527846j476764
3161.4F08516157j465142j446545j454532j483500j481057j452744j399040j371205
3177.7E96962392j417100j465261j487613j514971j490533j419425j404822j418293
3194E85344374j410782j425147j475930j501143j467348j392245j329303j325845j326800
$$ y = [669099092, 667460859, 665810823, 664174139, 662554264, 661017358, 659458816, 657817185, 656222582, 654806256, 653464139, 651916325, 650214970, 648678124, 647293389, 645819426, 644365072, 643142700, 641944826, 640523434, 638869524, 637066305, 635303140, 633704484, 632200837, 630687475, 629124582, 627610803, 626276791, 624968112, 623425424, 621751130, 620188296, 618734241, 617395222, 616178811, 614811420, 613172591, 611520767, 609992921, 608516157, 607051015, 605604470, 604149938, 602666438, 601185381, 599732637, 598333597, 596962392, 595545292, 594080031, 592592418, 591077447, 589586914, 588167489, 586762667, 585344374, 583933592, 582508445, 581032515, 579531372, 578064024, 576671779, 575342476, 574016631, 572689831]
3212.4E72689831j321196j334071j360059j415909j437366j368939j285196j216531
3228.7E61950564j116633j089811j281977j471877j405537j233399j094163j017332
3245E52239835j103341j254618j209856j012384r48966j046836j102925j050889r77397
3263.4E42532623r21071p93338o37769p26641j000642j154483j154601j080871j031935
3281.7E34031272j036525j024544r76563q87632q85904j057267j220286j312435j309037
3300.1E24321079j106500q96693r96768j374424j670420j679599j567423j523972j513123
3318.4E11992157j478732j421750j427889j631319j834810j817346j722693j632243
3334.8D99025375j558811j689344j931876k009541j995266j926481j784325j872420
$$ y = [572689831, 571368635, 570034564, 568674505, 567258596, 565821230, 564452291, 563167095, 561950564, 560833931, 559744120, 558462143, 556990266, 555584729, 554351330, 553257167, 552239835, 551136494, 549881876, 548672020, 547659636, 546710670, 545663834, 544560909, 543510020, 542532623, 541611552, 540818214, 540180445, 539453804, 538453162, 537298679, 536144078, 535063207, 534031272, 532994747, 531970203, 530993640, 530106008, 529220104, 528162837, 526942551, 525630116, 524321079, 523214579, 522317886, 521321118, 519946694, 518276274, 516596675, 515029252, 513505280, 511992157, 510513425, 509091675, 507663786, 506032467, 504197657, 502380311, 500657618, 499025375, 497466564, 495777220, 493845344, 491835803, 489840537, 487914056, 486129731, 484257311]
3351.1D84257311k169609k254576k084523j919598j929641j956015j781166j697451
3367.4D68464732j965821k277255k228886j920670j712590j635522j606971j570642
3383.7D53546375j463145j246035r55552r57191j315176j393378j000464p75486j099676
3402.1D43340272j439721j263261r30726q02189p82609q33333q19444o17683n22524
3420.4D35328782o41972o01232l17455p6085m7326l6150Q3118L6389j47074p8798K26766
3442.9D33728963M98235N05090K87086K87861M97370O58840Q46357J013040R18955
3461.2D39241797Q02695J060486J301766J036405O47009O97076R97067J284301J419842
3479.6D48488444J188219R84132J141131J202762J097083J234114J478195J505465
$$ y = [484257311, 482087702, 479833126, 477748603, 475829005, 473899364, 471943349, 470162183, 468464732, 466498911, 464221656, 461992770, 460072100, 458359510, 456723988, 455117017, 453546375, 452083230, 450837195, 449881643, 448924452, 447609276, 446215898, 445215434, 444439948, 443340272, 441900551, 440637290, 439706564, 438904375, 438121766, 437288433, 436468989, 435851306, 435328782, 434686810, 434085578, 433768123, 433692038, 433644712, 433608562, 433691680, 433728069, 433580995, 433502197, 433728963, 434227198, 434732288, 435019374, 435307235, 435804605, 436463445, 437309802, 438322842, 439241797, 440044492, 441104978, 442406744, 443443149, 444090158, 444787234, 445784301, 447068602, 448488444, 449676663, 450660795, 451801926, 453004688, 454101771, 455335885, 456814080, 458319545]
3495.9D58319545J401156J578480J809865J400948R84072J277298J560480J530259
3512.2D69862103J478166J444787J611769K023339K342343K124578J663178J455993
3528.5D84006256J439929J666844K078324K146542J917631K207488K883434K981484
3544.8E01327932K142548J555741J924575K120435J955688K267241K795399L030002
3561.1E19119561L380418L974616L355444J503229J170277K194047K932728L133356
3577.5E40763676L246308L486573M102171M828393L993035K190053K406061L579259
3593.8E68595529L721356L464699L454804L216028L398300M402995M866779M221797
3610.1E99342287L884852L760278L742933L975093K827526J669764K808273N162597
$$ y = [458319545, 459720701, 461299181, 463109046, 464509994, 465494066, 466771364, 468331844, 469862103, 471340269, 472785056, 474396825, 476420164, 478762507, 480887085, 482550263, 484006256, 485446185, 487113029, 489191353, 491337895, 493255526, 495463014, 498346448, 501327932, 503470480, 505026221, 506950796, 509071231, 511026919, 513294160, 516089559, 519119561, 522499979, 526474595, 529830039, 531333268, 532503545, 534697592, 537630320, 540763676, 544009984, 547496557, 551598728, 556427121, 560420156, 562610209, 565016270, 568595529, 572316885, 575781584, 579236388, 582452416, 585850716, 590253711, 595120490, 599342287, 603227139, 606987417, 610730350, 614705443, 617532969, 619202733, 622011006, 627173603]
3626.4F27173603N792558K690613J131833K011478K544880K882242L203213L607690
3642.7F51038110M988253O913960N977154Q86738r41038J143933K060353J365364J456976
3661.1F74889803J973867K862990M485905M987359L072739K780378K678394o31511
3677.4F97099924j604378k26915J245797L171742M727423K887189r88960j549661n6863
3695.8G04705298J236141K057790J682878N02884J129568L113389L693640R09150j794338
3714.1G17236400j001358P30514J581252J428425P29382r1553J10388K113760M149675
3732.5G26986885L262162m40478k102971m2260K707303K404868M65870J370788Q14974
3750.8G35427141k359807k133727N5790M16040p67887l72946Q96573J173020N95271
$$ y = [627173603, 632966161, 635656774, 636788607, 638800085, 641344965, 644227207, 647430420, 651038110, 656026363, 662940323, 668917477, 669804215, 668863177, 670007110, 672067463, 673432827, 674889803, 676863670, 679726660, 684212565, 689199924, 692272663, 695053041, 697731435, 697099924, 695495546, 695268631, 696514428, 699686170, 704413593, 707300782, 706311822, 704762161, 704705298, 705941439, 707999229, 709682107, 710184991, 711314559, 714427948, 718121588, 719030738, 717236400, 716235042, 716965556, 718546808, 719975233, 720704615, 720613062, 720723450, 722837210, 726986885, 730249047, 729808569, 727705598, 727663338, 730370641, 732775509, 733241379, 734612167, 735427141, 733067334, 730933607, 730989397, 731405437, 730637550, 730264604, 731161177, 732334197, 732929468]
3769.2G32929468p93040j192331K33531J676559J260102k49862l16739j5200k81751
3787.5G33250737j00016N04136J459300K126396J924336J979470P72476j063287o65069
3805.9G40188479j084804j565218K24054K390861K518893J554727J311779r84609k275586
3824.3G42278576r13262k1935P60019J430750J813471K120316P98524j338065k023459
3842.6G44904935j896858r06467J375436M082144L755688k056360l852129j244843
3858.9G44161546R80914J637459M90904K63035R93132j36435j340389j383304k85805
3877.3G45381057J354575R19700J25051j42753r38118j31965L01421r20713l40939
3895.6G45607316J693845K371490J192928p99418k500653k390444j074553R954Q55982
$$ y = [732929468, 732136428, 730944097, 731177628, 732854187, 734114289, 733864427, 733547688, 733532488, 733250737, 733150721, 733654857, 735114157, 737240553, 739164889, 741144359, 741916835, 740853548, 740188479, 739103675, 737538457, 737762511, 740153372, 742672265, 744226992, 745538771, 744554162, 742278576, 741365314, 741343379, 742103398, 743534148, 745347619, 747467935, 748266459, 746928394, 744904935, 743008077, 742101610, 743477046, 747559190, 751314878, 749258518, 745406389, 744161546, 745142460, 746779919, 747270823, 747533858, 748526990, 748390555, 747050166, 745666862, 745381057, 746735632, 747655332, 747780383, 747637630, 746699512, 746567547, 746868968, 745948255, 745607316, 747301161, 749672651, 750865579, 750066161, 747565508, 745175064, 744100511, 744110465, 744966447]
3914G44966447J297951N63562l85165k18094Q6546k63631q3566N44310J03056q35061
3934.4G45776355p85231q822P14421O09875o1333j9729J55747k84255m97639k35319
3954.8G45364070K3067J38581J20520n9008j44184j1265R9480P9751M5657M2856Q941
3977.2G45708466j0014K0623J4127j9730J7643P0095M5300J0490n9%
3997.6G45856941
$$ y = [744966447, 746264398, 746827960, 746442795, 746224701, 746311247, 746047616, 745964050, 746508360, 746611416, 745776355, 744991124, 744982302, 745696723, 746306598, 746245265, 746225536, 746381283, 746097028, 745599389, 745364070, 745387137, 745525718, 745646238, 745587230, 745443046, 745431781, 745531261, 745611012, 745656669, 745699525, 745708466, 745698452, 745719075, 745733202, 745713472, 745731115, 745801210, 745846510, 745857000, 745856941, 745856941]
##END=$$ End of the data block
