##TITLE=Lut 1p3 $$ Begin of the data block
##JCAMP-DX=5.00 $$ ACD/SpecManager v 10.08
##SPECTROMETER/DATA SYSTEM=Alpha
##DATE=02 Sep 2014 14:56:18
##DATA TYPE=INFRARED SPECTRUM
##DATA CLASS=XYDATA
##ORIGIN=
##OWNER=
##NPOINTS=1765
##FIRSTX=399.76428223
##LASTX=3997.64306641
##MAXX=3997.64306641
##MINX=399.76428223
##MAXY=0.83029360
##MINY=0.38332245
##XFACTOR=1.0000000000
##YFACTOR=1.000000000000000e-9
##FIRSTY=0.75334883
##DELTAX=2.03961372
##XUNITS=1/CM
##YUNITS=ARBITRARY UNITS
##XYDATA=(X++(Y..Y))
399.8G53348827K15531k416849l617227j618267O12557j98185k894938l681064j012265
418.1G38738120J782238m02808m164815m082918j20759K511322L98875l576100l763676
436.5G27319479K73287K374232q10146m806459l902078M65036K106845j195192m461170
454.8G17363834l037750J227021K200246j384676m385888k500773J944304K819955
471.2G14246273j241803m390180k105832K338409K793789j498818m644335k255618
487.5G03241885K246320K562940j875460m828870k256155K156317K408504j995623
503.8G01659858n011141k491415K024591K201796k141118m952669k414704J901269
520.1F90776467J977504k174795m824400k116442K232433K313256j884639m610002
$$ y = [753348827, 753564358, 751147509, 747530282, 745912015, 746524572, 746326387, 743431449, 739750385, 738738120, 740520358, 740117550, 735952735, 731869817, 731749058, 734260380, 734659255, 731083155, 727319479, 727592766, 729966998, 729156852, 724350393, 720448315, 720913351, 723020196, 721825004, 717363834, 714326084, 715553105, 717753351, 716368675, 711982787, 709482014, 711426318, 714246273, 713004470, 708614290, 706508458, 708846867, 711640656, 710141838, 705497503, 703241885, 705488205, 708051145, 706175685, 701346815, 699090660, 701246977, 703655481, 701659858, 696648717, 694157302, 696181893, 698383689, 696242571, 691289902, 688875198, 690776467, 692753971, 690579176, 685754776, 683638334, 685870767, 688184023, 686299384, 681689382]
536.4F81689382k126098K174556K441049j648247m357160j816988K414942K519846
552.7F81291282j540661m113674j591563K509296K512872j511991m065633j678049
569.1F71811879K327799K405763j387834l831625j603187K224386K392650j268685
585.4F73071146l663898j603066J985490K188086j248717l593743j722634J802504
601.7F67215168K239883r00864l151119j365602J919448K210677p19368k573848m78804
620F64395571K977609L553749P63714j476467o2287K888739L147960L05295j856267
638.4F74637616o41167J970410K207041l79145k370477j140535J429737J770973m91202
656.8F76993251k201677r29415J606047J732111j220882k938985M12404K564311K245128
$$ y = [681689382, 679563284, 681737840, 684178889, 682530642, 678173482, 676356494, 678771436, 681291282, 679750621, 675636947, 674045384, 676554680, 679067552, 677555561, 673489928, 671811879, 674139678, 676545441, 675157607, 671325982, 669722795, 671947181, 674339831, 673071146, 669407248, 667804182, 669789672, 671977758, 670729041, 667135298, 665412664, 667215168, 669455051, 668554187, 665403068, 664037466, 665956914, 668167591, 667448223, 664874375, 664395571, 667373180, 670926929, 671690643, 670214176, 670151889, 673040628, 676188588, 676493883, 674637616, 673996449, 675966859, 678173900, 677794755, 675424278, 674283743, 675713480, 677484453, 676993251, 674791574, 673862159, 675468206, 677200317, 675979435, 673040450, 673452854, 676017165, 678262293]
675.1F78262293K02775j444876n73635J582444J964807N305j677871r88781Q44598
693.5F78177059J070976o62088j761973m42982J815498K339840P49349p21693j86443
711.8F80377543J446128J659751p9394j285255L79861L634691N235195M264117K914488
730.2F98547125L181040M265368M040361K133131P21037J536548L428042L950775K594292
748.5G24397719J321137J780987K977788K713561Q68321m22955K53260J763642J920760
766.9G37574220M04954o18995M06743K223014K569080J249015L89934J482606L285646
785.3G48966217L479838J904488P75218J647890L207266L034651J061559k91109N44846
803.6G64330864K247870K444088Q92401p987J397491L485381L558517J603007K36571
$$ y = [678262293, 678465068, 677020192, 676446557, 678029001, 679993808, 679999113, 678321242, 677332461, 678177059, 679248035, 678585947, 676823974, 676380992, 678196490, 680536330, 681285679, 680563986, 680377543, 681823671, 683483422, 683404028, 682118773, 682498634, 686133325, 691368520, 695632637, 698547125, 701728165, 705993533, 710033894, 712167025, 712888062, 714424610, 717852652, 721803427, 724397719, 725718856, 727499843, 730477631, 733191192, 734059513, 733636558, 733889818, 735653460, 737574220, 737979174, 737360179, 737766922, 739989936, 742559016, 743808031, 744197965, 745680571, 748966217, 752446055, 754350543, 755125761, 756773651, 759980917, 763015568, 764077127, 763786018, 764330864, 766578734, 769022822, 769915223, 769907236, 771304727, 774790108, 778348625, 779951632, 780188203]
822G80188203J035333K469480K031683l06904j872480q70108J178383J595200J61528
840.3G85610318o11663R05395L092468L215491J091421m43280N95928K563715K554833
858.7G98574626L31581j387715n84781J277864J254737r86993k647996j652658N76734
877G94755399J110971o21855k045393r92715J266360J772404j41561j911998j199365
895.4G91992247Q97169J370788m87745k117276j253963J035571J825452K07067j500845
913.7G91968465r03368J116395J613140l11732k309621j944899M9948P71940q84473
932.1G89165795k743662k337455l08752M25279j347125l486931l366888j420319n63562
950.5G74016380k201557m408181m663467l234148k681315m281163o216347o052733
$$ y = [780188203, 781223536, 783693016, 785724699, 785417795, 783545315, 782675207, 783853590, 785448790, 785610318, 784998655, 785904050, 788996518, 792212009, 793303430, 792860150, 793456078, 796019793, 798574626, 798906207, 797518492, 796933711, 798211575, 799466312, 798479319, 795831323, 794178665, 794755399, 795866370, 795244515, 793199122, 792206407, 793472767, 795245171, 795103610, 793191612, 791992247, 792889416, 794260204, 793772459, 791655183, 790401220, 791436791, 793262243, 793469310, 791968465, 791065097, 792181492, 793794632, 793482900, 791173279, 789228380, 789278328, 790050268, 789165795, 786422133, 784084678, 783775926, 784201205, 782854080, 779367149, 776000261, 774579942, 774016380, 771814823, 767406642, 762743175, 759509027, 756827712, 752546549, 746330202, 740277469]
966.8G40277469m038930k718031l629267n357624n496680l960073k978266l923058
983.1G08175540n506039n567968l995716k828717l509820n045116n369365m169881
999.4F72182918l264249m093945n837977o515324n560458m482388m795015n958736
1015.7F31674826o162345m872978l534555l631652m750550n110561l953815k476990
1032E97181380k160430k950370l471494k839565j896084k034545l189683l959238l437937
1050.4E71242034k319991j983464k661467l158986k538860j382589r83000j611292
1066.7E54602385k175034j681268m90010J87040q5235l56614M42326K028286L060222
1085.1E55532098K821386K154112K365827L536642M502356M477799M053950M259765
$$ y = [740277469, 736238539, 733520508, 729891241, 724533617, 719036937, 715076864, 712098598, 708175540, 702669501, 697101533, 693105817, 690277100, 686767280, 681722164, 676352799, 672182918, 668918669, 664824724, 658986747, 652471423, 646910965, 642428577, 637633562, 631674826, 625512481, 620639503, 617104948, 613473296, 608722746, 603612185, 599658370, 597181380, 595020950, 592070580, 588599086, 585759521, 583863437, 581828892, 578639209, 574679971, 571242034, 568922043, 566938579, 564277112, 561118126, 558579266, 557196677, 556213677, 554602385, 552427351, 550746083, 550256073, 550443113, 550357878, 550001264, 550443590, 552471876, 555532098, 558353484, 560507596, 562873423, 566410065, 570912421, 575390220, 579444170, 583703935]
1101.4E83703935N096316N344749M075110J987755O42598N61297Q37564O66976N26548
1119.8F03442848J396775L064036L942550K869069N47588j377761k242506k683222
1136.1F08959377l405512m052341l587484j911521l21448M7565m89891o74665J95563
1154.4E94759643J444161K011478J945734K295494L641784N232036N941034N795359
1170.7F23066723N956769P114351Q427143Q544862P304907N963624N673766O015718
1187.1F78067863N583107L985048K408862J968145K168358J577437j65463j815319
1203.4F93778038k144694j569212j534641k529323l522694l495872k810836k665758
1219.7F73505008l499806m402041m326224l407419k759218k971411l327847k819061
$$ y = [583703935, 588800251, 594145000, 598220110, 600207865, 600850463, 601411760, 602249324, 602916300, 603442848, 604839623, 607903659, 611846209, 614715278, 615262866, 613885105, 611642599, 608959377, 605553865, 601501524, 597914040, 596002519, 595681071, 595728636, 595238745, 594564080, 594759643, 596203804, 598215282, 600161016, 602456510, 606098294, 611330330, 617271364, 623066723, 629023492, 636137843, 644564986, 653109848, 660414755, 666378379, 672052145, 678067863, 683650970, 687636018, 690044880, 692013025, 694181383, 695758820, 695593357, 693778038, 691633344, 690064132, 688529491, 686000168, 682477474, 678981602, 676170766, 673505008, 670005202, 665603161, 661276937, 657869518, 655110300, 652138889, 648811042, 645991981]
1236F45991981j479626l04341P6056J99198R32634K152205K811074K257466J156569
1254.4F53793216P06911J214444J835227J742542J264274J325250K006292K350390
1270.7F66238546J625479L18706l73841L6896Q67009J153052Q13782N80132P98344
1289F72058105R49681M27306n36084j136780r68277m99011m76241r52839j225770q18372
1309.4F66821718j11222K21670J03116K39193J089573K110481K429605J913845J204312
1327.8F76022291Q38101N82874j15216j228571k052069j848280q70168k11775k86401
1346.2F70830786m97699k77698J57655K14934l44455j108825j650334k118885k892256
1364.5F62313223l785133m057527l421187l131152l982246m652440m067242k992153
$$ y = [645991981, 644512355, 644208014, 644284070, 644483268, 645415902, 647568107, 650379181, 652636647, 653793216, 654500127, 655714571, 657549798, 659292340, 660556614, 661881864, 663888156, 666238546, 667864025, 668182731, 667808890, 667845786, 668712795, 669865847, 670679629, 671259761, 672058105, 673007786, 673435092, 672899008, 671762228, 670793951, 670294940, 669818699, 668865860, 667640090, 666821718, 666710496, 666932166, 667035282, 667274475, 668364048, 670474529, 672904134, 674817979, 676022291, 676860392, 677443266, 677328050, 676099479, 674047410, 672199130, 671328962, 671117187, 670830786, 670333087, 670055389, 670213044, 670427978, 670083523, 668974698, 667324364, 665205479, 662313223, 658528090, 654470563, 651049376, 647918224, 643935978, 639283538, 635216296, 632224143]
1380.8F32224143k501071k477884k411068k114713j764893j778424k011180k010584
1397.1F15154326j695216p50303O87480J970649K369463J846075J179159Q36968Q77738
1415.5F22476339J345754K294958K781629K544105J756728K25782j515984k622128
1431.8F29287183k996444l482223l532886k639950j963138j550436j340628j554132
1448.1F10227346k035856k560496k461851q65340J989007L030837K690136L167152
1464.5F13180935N673826R733141J4111876J7176569J4738202R345472N042433J396895
1480.8F90399349j547873l827095o137550q884907j0862112j0678947j1016250j2573778
1497.1F24870837j2436867j1010826r968161j1106611j3525724j1293650r073019q643627
$$ y = [632224143, 629723072, 627245188, 624834120, 622719407, 620954514, 619176090, 617164910, 615154326, 613459110, 612708807, 613396287, 615366936, 617736399, 619582474, 620761633, 621598601, 622476339, 623822093, 626117051, 628898680, 631442785, 633199513, 633425295, 631909311, 629287183, 626290739, 622808516, 619275630, 616635680, 614672542, 613122106, 611781478, 610227346, 608191490, 605630994, 603169143, 602303803, 604292810, 607323647, 610013783, 613180935, 618854761, 628587902, 642699778, 659876347, 674614549, 683960021, 689002454, 690399349, 688851476, 685024381, 678886831, 670001924, 659139812, 648460865, 637444615, 624870837, 612433970, 601423144, 591454983, 580348372, 566822648, 555528998, 546455979, 537812352]
1513.4E37812352p536828n829752m353642m137397l966153l443002l274560k965510
1529.7E02305508k902359k780020j857519j098186p54863J24097J149505J975745K712965
1548.1D98874873L372699L780186L987670M182875N791962P604063N783141M787504
1564.4E38164973N077899N538046N875766M744172L804982M203677M050553L131986
1580.7E74592054K226949J424253Q83877N24759j14202j117468k153516k711833k987802
1599.1E70567071l658294m875779o265700p461727q563936r419620j0136246j2041986
1615.4E08143783j4349401j3000012j2600779j5217275j5861481j4499486j2178272
1629.7D10437077q503824n902201m891217l266483j803607j166940q47816o21468j11073
$$ y = [537812352, 530275524, 524445772, 520092130, 515954733, 511988580, 508545578, 505271018, 502305508, 499403149, 496623129, 494765610, 493667424, 492912561, 493036658, 494186163, 496161908, 498874873, 502247572, 506027758, 510015428, 514198303, 519990265, 527594328, 533377469, 538164973, 543242872, 548780918, 554656684, 559400856, 563205838, 567409515, 571460068, 574592054, 576819003, 578243256, 579127133, 579651892, 579537690, 578420222, 576266706, 573554873, 570567071, 566908777, 562032998, 555767298, 548305571, 539741635, 530322015, 520185769, 508143783, 493794382, 480794370, 468193591, 452976316, 437114835, 422615349, 410437077, 401933253, 396031052, 391139835, 387873352, 386069745, 384902805, 384054989, 383433521, 383322448]
1648C83322448L31699P50542J800090K287120K325654L011882M195660N045504M886657
1666.4D07957256N278855O321401O415993O981015P717609P151604O610543P558643
1682.7D61992919J0199100J0242969R141117R799570J0379374J3020575J5833915J6344189
1699E56953728J8044472J5602708J3377785J3163507J1022151Q924484P746578P324993
1715.3F52160406P382989O171107L884673K276600R17792j218855m158676p757544
1731.7F59658492j3532281j7302573j7144620j9575477j9447029j3821184o014049
1745.9E52821279L537714J4401257K3337782K6221632K7485133K7095377K2918701
1760.2F97818875J8843651J4194489J0306954Q311570O541311N207122M359245L704250
$$ y = [383322448, 383654147, 384404689, 386204779, 388491899, 390817553, 393829435, 398025095, 403070599, 407957256, 413236111, 419557512, 425973505, 432954520, 440672129, 447823733, 454434276, 461992919, 472192019, 482434988, 491576105, 501375675, 511755049, 524775624, 540609539, 556953728, 574998200, 590600908, 603978693, 617142200, 628164351, 637088835, 644835413, 652160406, 659543395, 665714502, 669599175, 671875775, 672793567, 671574712, 667416036, 659658492, 646126211, 628823638, 611679018, 592103541, 572656512, 558835328, 552821279, 556358993, 570760250, 594098032, 620319664, 647804797, 674900174, 697818875, 716662526, 730857015, 741163969, 749475539, 756016850, 761223972, 765583217, 769287467]
1776.5G69287467L463328L197789K551615K057731K076924K203524K002359J754224
1792.8G88594961J527965J484752J680374J784682J466036J039922J047373J359105
1809.2G99985170J537860J234650Q07882P65145J112341J229883Q78274N31137N46575
1827.5H08628917R19878J271606J077413N61595M12762O34969P30633O05166N35906
1845.9H15378845N28455O42776Q46148P62105M16994J98364L62217O02603N38469J76251
1866.3H20453227j2994L28004P01726O53565L45349J17421J49190L64364M48763K59578
1886.7H23808193K6107J20580L92080M57406L33964J39595Q3088K26975L57389K73228
1907.1H26218605P9930L8743J71780K45929J91689J22666L6597O9023K39551K51412
$$ y = [769287467, 772750795, 775948584, 778500199, 780557930, 782634854, 784838378, 786840737, 788594961, 790122926, 791607678, 793288052, 795072734, 796538770, 797578692, 798626065, 799985170, 801523030, 802757680, 803565562, 804330707, 805443048, 806672931, 807551205, 808082342, 808628917, 809548795, 810820401, 811897814, 812459409, 812872171, 813507140, 814237773, 814842939, 815378845, 815907300, 816550076, 817396224, 818158329, 818575323, 818773687, 819135904, 819738507, 820276976, 820453227, 820440233, 820768237, 821469963, 822123528, 822468877, 822586298, 822735488, 823099852, 823548615, 823808193, 823834300, 823954880, 824346960, 824804366, 825138330, 825277925, 825361013, 825587988, 825945377, 826218605, 826298535, 826337278, 826509058, 826754987, 826946676, 827069342, 827105939, 827174962, 827414513, 827665925]
1927.5H27665925Q3029k6703J4782J41025K02715P9573q4520o5386P9989J57893J20580
1949.9H28368902J4067l7432J8776R3519J09792L1293p1764q1301J9610Q4877K4020
1972.3H28574359p1466p8380J8597J04368P1525o7293j41204p6055N305K6226l3379
1994.8H28332603j25051r2923L8683P0334n0366j95325j79648l4809M2200o2585k34485
2017.2H27508628k42412q3089N5671n901j90079k28047o1751P9036K5988j42038k18809
2039.6H26497197q2254J12653J10030r1613k32041j49011N9187J25170l5048j94430
2060H26119840j46687M7386J40011Q047j80722j49428O0320J65879M1664j43767j31726
2082.5H25830817Q7798K50459J34587j04964j56641K8908K11358J63556p1586j64866
$$ y = [827665925, 827748954, 827722251, 827737033, 827878058, 828080773, 828160346, 828075826, 828010440, 828090429, 828248322, 828368902, 828382969, 828345537, 828364313, 828457832, 828567624, 828598917, 828527153, 828445852, 828465462, 828550339, 828574359, 828502893, 828424513, 828443110, 828547478, 828619003, 828551710, 828410506, 828334451, 828339756, 828365982, 828332603, 828207552, 828114629, 828153312, 828223646, 828173280, 827977955, 827798307, 827763498, 827805698, 827743113, 827508628, 827266216, 827183127, 827238798, 827232897, 827042818, 826814771, 826753020, 826832056, 826858044, 826716006, 826497197, 826414943, 826527596, 826637626, 826546013, 826313972, 826164961, 826224148, 826349318, 826314270, 826119840, 825973153, 826020539, 826160550, 826168597, 825987875, 825838447, 825898767, 826064646, 826106310, 825962543, 825830817, 825918615, 826169074, 826303661, 826198697, 826042056, 826070964, 826282322, 826445878, 826374292, 826209426]
2102.9H26209426K8074K34544J87159o8069j97887k6167K08855J89721m1067j62482
2123.3H26562107j1087K18392K37643L2783j44243o7652J54674K38657P9871j21296
2143.7H27179849r2149J41502K72691J20103j04010r2148J31845K69532J56105o6161
2164.1H27917159j02759J12057K88427J95563l5107r7931Q5235K55823J86622k0742
2184.5H28784347j13786K5928K30551K24352K9504q8930J3352J86085J95802M1663
2204.8H29528868q0406j6928J64509K10225L6419j12176m4942J27017J91868Q8036
2225.2H30092490m4644m3631Q4877J54317N0187j00136j17660Q464J09434M6790p5877
2247.7H30164611q2135K8134R1791j4186j56999j51336k8789O4671L3736p2598j08362
$$ y = [826209426, 826237500, 826472044, 826659203, 826591134, 826393247, 826367080, 826575935, 826765656, 826724589, 826562107, 826551020, 826769412, 827007055, 827039838, 826895595, 826827943, 826982617, 827221274, 827301145, 827179849, 827087700, 827229202, 827501893, 827621996, 827517986, 827425838, 827557683, 827827215, 827983320, 827917159, 827814400, 827926457, 828214884, 828410447, 828375340, 828277409, 828362644, 828618467, 828805089, 828784347, 828670561, 828696489, 828927040, 829151392, 829180896, 829091966, 829105318, 829291403, 829487205, 829528868, 829448462, 829431534, 829596043, 829806268, 829842687, 829730511, 829685569, 829812586, 830004454, 830092490, 830047846, 830004215, 830089092, 830243409, 830293596, 830193460, 830075800, 830084264, 830193698, 830240488, 830164611, 830082476, 830110610, 830202401, 830188215, 830031216, 829879880, 829851091, 829915762, 829949498, 829876900, 829768538]
2270.1H29768538l5405N4062O7889j2159q0645o2048m1306j17481k42353l08692k81692
2292.5H28708708j98245j82390l00884m22240m21226m09781n22972o85215p28786n99384
2312.9H24237585m93646o67095r81152j027703p61807n36203n85676p22348o13869
2331.3H17848086l48985k77042l46363l58701k42948K29239J111508J289904P6771
2349.7H18981469j515687k281606j952410j249790o04510p1824M93229J047909J318216
2368H14164996J399458J483023J503706J471936J388312J214027R69649O75618L66092
2386.4H24636817R9182j02997k02000j87278j39057j34349k16007k96533k43724j45495
2406.8H23068559j51515k39193l02196k52962j57773j60695k66373l46482k90572j68443
$$ y = [829768538, 829733133, 829787195, 829855084, 829842925, 829762280, 829700232, 829658926, 829541445, 829299092, 828990400, 828708708, 828510463, 828328073, 828027189, 827604949, 827183723, 826773942, 826250970, 825565755, 824836969, 824237585, 823743939, 823076844, 822095692, 821067989, 820306182, 819769979, 819184303, 818461955, 817848086, 817499101, 817222059, 816875696, 816516995, 816274047, 816503286, 817614794, 818904698, 818981469, 817465782, 815184176, 813231766, 811981976, 811377466, 811305642, 811798871, 812846780, 814164996, 815564454, 817047477, 818551183, 820023119, 821411431, 822625458, 823595107, 824270725, 824636817, 824735999, 824633002, 824431002, 824243724, 824104667, 823970318, 823754311, 823457778, 823214054, 823068559, 822917044, 822677851, 822375655, 822122693, 821964920, 821804225, 821537852, 821191370, 820900798, 820732355]
2427.2H20732355j55747k65777l26097k71439j90974j87397k82287l61026l07619j95265
2447.6H18188727j91867l04223m03344l80576k68519k15292k89023l88741l78847k81334
2467.9H15086961k21551k93493m16338m34280l53336k70724k83957l79503m17471l52740
2488.3H11663568k83599l09110m17947m70281l63052k28286k53975l84629m39048l54528
2508.7H08159113k39909k42114l63290m46618l77059k56359k38657l18468l85463l61204
2529.1H04929972k74957k31027k97785l93212l70621k35320j62243k53320l79503l85523
2549.5H01946461k83301j94311k27928l54171l97265k96890j88590k02417l12447l73483
2569.9G99115658l36528k67983k69591l87669m64439l80695k60890k54452l65913m59790
$$ y = [820732355, 820576608, 820310831, 819984734, 819713295, 819522321, 819334924, 819052637, 818691611, 818383992, 818188727, 817996860, 817692637, 817289293, 816908717, 816640198, 816424906, 816135883, 815747142, 815368295, 815086961, 814865410, 814571917, 814155579, 813721299, 813367963, 813097239, 812813282, 812433779, 812016308, 811663568, 811379969, 811070859, 810652912, 810182631, 809819579, 809591293, 809337318, 808952689, 808513641, 808159113, 807919204, 807677090, 807313800, 806867182, 806490123, 806233764, 805995107, 805676639, 805291176, 804929972, 804655015, 804423988, 804126203, 803732991, 803362370, 803127050, 802964807, 802711487, 802331984, 801946461, 801663160, 801468849, 801240921, 800886750, 800489485, 800192595, 800004005, 799801588, 799489141, 799115658, 798779130, 798511147, 798241556, 797853887, 797389448, 797008753, 796747863, 796493411, 796127498, 795667708]
2590.3G95667708m18484l18170k96354l77298m83989m92871l82722l25024m09960m83513
2610.7G91679323m59552l95775l45528l99590n45859n98550m97460l92974m20570n31316
2631.1G87092149n69820m81069l85821m14908n19514n74052n30601m44114m36127n41568
2651.5G82194555o28770n87880n04017m88818n32865n91398o02305n12838m13120m18603
2671.9G76913941m78268m64320l69310l17335l71993m51207m38869l39985k60651k81692
2692.3G73140311l67939m03047l69787l47257l81767m78447n90980o10948n53310n68687
2712.7G68468142o75440p47919p36654o86705o51241o91712p91907q13246o74784n18024
2733.1G61480510n07056n91100o45339n92947m97461n19454o46412p23005o78777n92709
$$ y = [795667708, 795249224, 794931054, 794634700, 794257402, 793773413, 793280542, 792897820, 792572796, 792162836, 791679323, 791219771, 790823996, 790478468, 790078878, 789533019, 788934469, 788437009, 788044035, 787623465, 787092149, 786522329, 786041260, 785655439, 785240531, 784721017, 784146965, 783616364, 783172250, 782736123, 782194555, 781565785, 780977905, 780473888, 779985070, 779452205, 778860807, 778258502, 777745664, 777332544, 776913941, 776435673, 775971353, 775602043, 775284708, 774912715, 774461508, 774022639, 773682654, 773422003, 773140311, 772772372, 772369325, 771999538, 771652281, 771270514, 770792067, 770201087, 769590139, 769036829, 768468142, 767792702, 767044783, 766308129, 765621424, 764970183, 764278471, 763486564, 762673318, 761998534, 761480510, 760973454, 760382354, 759737015, 759144068, 758646607, 758127153, 757480741, 756757736, 756078959, 755486250]
2753.5G55486250o06358p26938p99597p35759o42479o73413q12650q97288q59976p71642
2773.9G47960150p57754q96453j058937j063227r66728r37581j017332j146793j214266
2792.2G38901079j162827j095474j159549j335382j423538j383364j384259j511335
2808.6G28445351j726329j905263j965403k014280k200841k542675k907395l219545
2824.9G09963620l595114m096329m664243n244493n925179p082462r264886j2704432
2841.2F57386482j7005742k1310687k4378300k4675369k0860374j2686372k022206
2855.5E34447432P634997J3394236J4562548J2283265Q232713M001439J170098P25210
2871.8E96451938K027810L347516L564477K630651J032412p17104k339482l688931
$$ y = [755486250, 754879892, 754152954, 753353357, 752617598, 751975119, 751301706, 750489056, 749591768, 748731792, 747960150, 747202396, 746305943, 745247006, 744183779, 743217051, 742279470, 741262138, 740115345, 738901079, 737738252, 736642778, 735483229, 734147847, 732724309, 731340945, 729956686, 728445351, 726719022, 724813759, 722848356, 720834076, 718633235, 716090560, 713183165, 709963620, 706368506, 702272177, 697607934, 692363441, 686438262, 679355800, 670090914, 657386482, 640380740, 619070053, 594691753, 570016384, 549156010, 536469638, 534447432, 542082429, 555476665, 570039213, 582322478, 590555191, 594556630, 595726728, 596451938, 598479748, 601827264, 605391741, 608022392, 609054804, 608337700, 605998218, 602309287]
2888.1F02309287m759491n680323o467104p048070p473528p902384q513570r406507
2904.4E45058310j0550022j1930764j3643026j5725315j7827093j9103349j8683642
2918.7D37595099j6185760j1813999o353318p85470M213959Q324891J1527419J3859153
2935D40381974J5186876J5432179J4707148J3020516J0304689O793797L195226M28021
2951.3E19450426r31799p53701P18117K938211N366087P566750R208560J0104596J0319233
2969.7E63986480J0107696R637416Q961618Q208513P520974O881892O243587N555451
2986F27103627M701793L691971K591968J398623J48058j113594k122164k452671k075136
3004.4F31872475j205444j4901J292407K470315L272414L504693L137052K404035J627504
$$ y = [602309287, 597549796, 591869473, 585402369, 578354299, 570880771, 562978387, 554464817, 545058310, 534508288, 522577524, 508934498, 493209183, 475382090, 456278741, 437595099, 421409339, 409595340, 403242022, 402456552, 406670511, 414995402, 426522821, 440381974, 455568850, 471001029, 485708177, 498728693, 509033382, 515827179, 519022405, 519450426, 518518627, 517764926, 518483043, 521421254, 526787341, 534354091, 543562651, 553667247, 563986480, 574094176, 583731592, 592693210, 600901723, 608422697, 615304589, 621548176, 627103627, 631805420, 635497391, 638089359, 639487982, 639636040, 638522446, 636400282, 633947611, 631872475, 630667031, 630652130, 631944537, 634414852, 637687266, 641191959, 644329011, 646733046, 648360550]
3022.7F48360550R57609M02331m1544l78132o03199p51496q78751j019776j208901
3041.1F44838691j373232j425385j415134j413524j467824j559674j557470j466215
3057.4F33160233j421332j404703j318156j134038q99971p29739p08878p15673n71192
3075.7F24256551l78430l51131m46856m80115l93033k37405j29342j69754k65599k57432
3096.1F21147454j83344k06053l51608m73142m82976m60267n22614o51240p63178q30710
3116.5F16222322q52942r40741j120627j228451j260638j293839j328051j389086j488268
3134.9F05319679j580000j628578j688182j792908j890182j941443j905560j852155
3151.2E91040671j959205k157688k223790k186060k168297k182186k245605k337694
$$ y = [648360550, 649318159, 649720490, 649678946, 649300814, 648697615, 647946119, 647067368, 646047592, 644838691, 643465459, 642040074, 640624940, 639211416, 637743592, 636183918, 634626448, 633160233, 631738901, 630334198, 629016042, 627882004, 626982033, 626252294, 625543416, 624827743, 624256551, 623878121, 623526990, 623080134, 622600019, 622206986, 621969581, 621840239, 621670485, 621404886, 621147454, 620964110, 620758057, 620406449, 619933307, 619450331, 618990064, 618467450, 617816210, 617053032, 616222322, 615369380, 614428639, 613308012, 612079561, 610818923, 609525084, 608197033, 606807947, 605319679, 603739679, 602111101, 600422919, 598630011, 596739829, 594798386, 592892826, 591040671, 589081466, 586923778, 584699988, 582513928, 580345631, 578163445, 575917840, 573580146]
3167.5E73580146k372801k355576k360106k428233k510965k506852k454460k455771
3183.8E54135382k487719k484083k456367k453804k454579k431750k397716k353907
3200.1E34615457k304554k282560k291977k291143k254129k211094k206802k223790
3216.5E16549408k229929k218425k188682k188385k226472k252400k238393k214968
3232.8D98791754k300232k445758k494842k495467k520860k552419k610177k707005
3249.1D78664994k771169k789944k789736k790391k831966k823502k703965k572357
3265.4D56591964k481401k351135k163977k012550j879067j721203j578003j430094
3281.7D40974534j264841j103312r55104q34734p22259o10560n26697m52488l67105
$$ y = [573580146, 571207345, 568851769, 566491663, 564063430, 561552465, 559045613, 556591153, 554135382, 551647663, 549163580, 546707213, 544253409, 541798830, 539367080, 536969364, 534615457, 532310903, 530028343, 527736366, 525445223, 523191094, 520980000, 518773198, 516549408, 514319479, 512101054, 509912372, 507723987, 505497515, 503245115, 501006722, 498791754, 496491522, 494045764, 491550922, 489055455, 486534595, 483982176, 481371999, 478664994, 475893825, 473103881, 470314145, 467523754, 464691788, 461868286, 459164321, 456591964, 454110563, 451759428, 449595451, 447582901, 445703834, 443982631, 442404628, 440974534, 439709693, 438606381, 437651277, 436816543, 436094284, 435483724, 434957027, 434504539, 434137434]
3300.1D34137434k86788j92434j28239j52111j95622j81735j18196p6085q3506r2209
3320.5D32630509r1225j43260k44140k99156l07768l29286l39449l56078m33028n28365
3340.9D29558754n98460o35177o17981n95481o62356p82073q38160q10236p54356p52479
3361.3D22511995q09431p88719p18414p55281q71747r19611q16166o65665n95480n96166
3381.7D14975315n88298n31137m03642k68728l12626n01990n35161l12775j25468k40445
3402.1D11155045m43161l80426j84536j04666j06215j18673j03623q851J06424J87665
3422.5D09998983K79397L85195N14984O13451P10100Q14348P30992N55157O26594Q57622
3442.9D16086823R59784R73552J006365J079500J159519J193344J207113J255006J295268
$$ y = [434137434, 433850646, 433658212, 433529973, 433377862, 433182240, 433000505, 432882309, 432806224, 432722718, 432630509, 432539284, 432396024, 432151884, 431852728, 431544960, 431215674, 430876225, 430520147, 430087119, 429558754, 428960294, 428325117, 427707136, 427111655, 426449299, 425667226, 424829066, 424018830, 423264474, 422511995, 421702564, 420913845, 420195431, 419440150, 418568403, 417648792, 416832626, 416166961, 415571481, 414975315, 414387017, 413855880, 413452238, 413183510, 412870884, 412368894, 411833733, 411520958, 411395490, 411155045, 410711884, 410331458, 410146922, 410042256, 409936041, 409817368, 409713745, 409704894, 409811318, 409998983, 410278380, 410663575, 411178559, 411792010, 412502110, 413316458, 414047450, 414602607, 415229201, 416086823, 417046607, 418020159, 419026524, 420106024, 421265543, 422458887, 423666000, 424921006, 426216274]
3461.2D26216274J394779J595497J651496J450091J257569J345754J561522J709968
3477.5D38182950J747459J695305J715124J833618J882165J854211J870454J940012
3493.8D52721298K025813K011209J944363J953960J982778J993805K031684K088964
3510.2D68753874K176702K238155K219677K234578K325237K450227K439380K348006
3526.5D87185836K411187K542048K651215K810567K856851K740860K772987K938807
3542.8E08910358L030598K950370K837062K892614L060400L162563L198564L257036
3559.1E33299565L240228L137887L221511L666819L919005L687978L534078L665984
3575.4E61373055L808796L890098L951609L881335L781021L916561M122436M001618
$$ y = [426216274, 427611053, 429206550, 430858046, 432308137, 433565706, 434911460, 436472982, 438182950, 439930409, 441625714, 443340838, 445174456, 447056621, 448910832, 450781286, 452721298, 454747111, 456758320, 458702683, 460656643, 462639421, 464633226, 466664910, 468753874, 470930576, 473168731, 475388408, 477622986, 479948223, 482398450, 484837830, 487185836, 489597023, 492139071, 494790286, 497600853, 500457704, 503198564, 505971551, 508910358, 511940956, 514891326, 517728388, 520621002, 523681402, 526843965, 530042529, 533299565, 536539793, 539677680, 542899191, 546566010, 550485015, 554172993, 557707071, 561373055, 565181851, 569071949, 573023558, 576904893, 580685914, 584602475, 588724911, 592726529]
3591.7E92726529L883063M029453M197836M194498M072786L894627L762483L905237
3608.1F24666512M058659L968954L828466L646195L743529M102290L871977L237069
3624.4F55123651K898693L335357L949225L648996L292441L183961L085137L017902
3640.7F81535363K830625K449929K222598K635896L104508K700091K266824K439260
3657G02185094K515972K153873J836241J664459J451552J439393J615643J401127J321733
3675.4G17585087J705706J804471J665533J506030J312912J235425J253784J265347
3691.7G29334295J262307J108885Q44896O97672P69138Q45909O70255L87191L28064
3710G36248612O61433R26018P14183L86297K24352K29895L10481L65555L46780K14338
$$ y = [592726529, 596609592, 600639045, 604836881, 609031379, 613104165, 616998792, 620761275, 624666512, 628725171, 632694125, 636522591, 640168786, 643912315, 648014605, 651886582, 655123651, 658022344, 661357701, 665306926, 668955922, 672248363, 675432324, 678517461, 681535363, 684365988, 686815917, 689038515, 691674411, 694778919, 697479010, 699745834, 702185094, 704701066, 706854939, 708691180, 710355639, 711807191, 713246584, 714862227, 716263354, 717585087, 719290793, 721095264, 722760797, 724266827, 725579739, 726815164, 728068948, 729334295, 730596602, 731705487, 732550383, 733248055, 734017193, 734863102, 735533357, 735920548, 736248612, 736910045, 737836063, 738550246, 738936543, 739160895, 739390790, 739701271, 740066826, 740413606, 740627944]
3730.4G40627944J46509L55720O88911O86168K41220j88946J8477N10633L68774K75493
3750.8G43730903N98728O24001L47793K13385L16382L34620K42114J87337J99438L28838
3771.2G47123539L56317K39074J74403J42456J00374Q1002J38939K11537K02596J08957
3791.6G48879194n0127j23143p8142q7440L0756K17259J83046K92062L75450J22249
3812G49761164j64866j84894q6069j53363Q7381L85940K53916R9301Q345j9074K4557
3834.4G50012338p7784j41382P2598K60055K74420J53542j31309n34475o05106K00510
3854.8G49483407O89566L64363l4809j79053p7247m9710r5964O1154J71900J58251
3875.2G50491858O5624j38879q1777J26600J19388P391j20997p9096J37151Q5294k34246
$$ y = [740627944, 740774453, 741130173, 741819084, 742505252, 742746472, 742557526, 742576003, 743086636, 743455410, 743730903, 744329631, 744953632, 745301425, 745514810, 745831192, 746165812, 746407926, 746595263, 746794701, 747123539, 747479856, 747718930, 747893333, 748035789, 748136163, 748217165, 748356104, 748567641, 748770237, 748879194, 748829067, 748705924, 748627782, 748540342, 748571098, 748788357, 748971403, 749263465, 749638915, 749761164, 749596298, 749411404, 749325335, 749171972, 749259353, 749645293, 749899209, 749998510, 750006855, 749987781, 750012338, 749934554, 749793172, 749865770, 750125825, 750400245, 750553787, 750422478, 749888003, 749282897, 749483407, 750172973, 750537336, 750502527, 750323474, 750246227, 750196517, 750100553, 750161707, 750333607, 750491858, 750557482, 750418603, 750336826, 750463426, 750582814, 750590205, 750469208, 750390112, 750527263, 750612557, 750378311]
3897.7G50378311l96490k19167J17421L35753K32637J4484n1141o8962j16170r9182
3918.1G50127494q6307q9765R954R1136k6882j67370p9155J09017J02878m7803j75297
3940.5G49767900j94669n7817O7771K4438q6487r4413L218M2439j4484n7698o4194
3962.9G49336004p8618o9618k5273m9293r7096k8849N0426M0710L8266K5630p8380
3985.4G49063909j37210o6757m1008r8586p8797L8027
3997.6G48679578
$$ y = [750378311, 749981821, 749762654, 749880075, 750215828, 750448465, 750462949, 750411808, 750342846, 750226676, 750127494, 750041187, 749951422, 749961376, 750052512, 750025630, 749858260, 749779105, 749888122, 749991000, 749943197, 749767900, 749573231, 749515414, 749583185, 749607623, 749521136, 749426723, 749429941, 749472380, 749457896, 749400198, 749336004, 749257386, 749187768, 749162495, 749113202, 749016106, 748987257, 749037683, 749078393, 749116659, 749142289, 749063909, 748926699, 748859942, 748818934, 748720348, 748641551, 748679578]
##END=$$ End of the data block
