##TITLE=Lut 1p2 $$ Begin of the data block
##JCAMP-DX=5.00 $$ ACD/SpecManager v 10.08
##SPECTROMETER/DATA SYSTEM=Alpha
##DATE=03 Sep 2014 08:47:40
##DATA TYPE=INFRARED SPECTRUM
##DATA CLASS=XYDATA
##ORIGIN=
##OWNER=
##NPOINTS=1765
##FIRSTX=399.76428223
##LASTX=3997.64306641
##MAXX=3997.64306641
##MINX=399.76428223
##MAXY=0.82922840
##MINY=0.39302298
##XFACTOR=1.0000000000
##YFACTOR=1.000000000000000e-9
##FIRSTY=0.76527834
##DELTAX=2.03961372
##XUNITS=1/CM
##YUNITS=ARBITRARY UNITS
##XYDATA=(X++(Y..Y))
$$ plain form
399.8 765278339 762773871 761334956 761216879 759172142 756698549 756775737 756732821 755021513 754512012
418.1 754512012 754552782 752537310 751024902 750971198 749829710 748190343 748382807 748326302 746398151
436.5 746398151 745532691 745676637 743967056 742152750 742065072 740941465 738716900 738248527 738324225
454.8 738324225 736780882 735703945 735745430 734283507 732476592 732787669 733135402 732018352 731700420
473.2 731700420 732031822 730955422 730048954 730677247 730472326 729084551 728966415 729158938 727752090
491.5 727752090 726757348 727128267 726424456 724860311 724462628 723968744 722238421 721251905 721248031 720186949
511.9 720186949 718854845 718737781 718001902 716082394 715311050 715269387 713974357 712761462 712875783
530.3 712875783 712391078 711039424 710744143 710736811 709519386 708577394 708718359 708224952 707104266 706945300
$$ packed form
399.8G65278339k504468j438915j18077k044737k473593P7188m2916j711308n09501
418.1G54512012M0770k015472j512408n3704j141488j639367J92464n6505j928151
436.5G46398151q65460J43946j709581j814306q7678j123607k224565m68373P5698
454.8G38324225j543343j076937M1485j461923j806915L11077L47733j117050l17932
473.2G31700420L31402j076400r06468O28293k04921j387775j18136J92523j406848
491.5G27752090r94742L70919p03811j564145l97683m93884j730323r86516l874j061082
511.9G20186949j332104j17064p35879j919508p71344m1663j295030j212895J14321
530.3G12875783m84705j351654k95281p332j217425r41992J40965m93407j120686j58966
$$ plain form
550.7 706945300 707062006 706310928 705846310 706165135 705819666 705028057 705104768 705102861 704162419 703665376
571.1 703665376 703896046 703422129 702580392 702598095 702554286 701736987 701452374 701820970 701521575 700995564
591.5 700995564 701200902 701155007 700420380 700237036 700544536 700189054 699734986 700015962 699961841 699077547
611.9 699077547 698629320 698751152 698657811 699141800 700900674 702788174 704241812 706107080 708096802
630.2 708096802 709235072 710154474 711552680 712472498 712676764 713241041 713978112 713999808 713943422 714475095
650.6 714475095 714694321 714395165 714589059 715067387 714981437 714955270 715409636 715275526 714796424 715656281
671 715656281 716674209 716868937 716947556 717476130 717650950 717355251 717535198 717918456 717595875 716999710
691.4 716999710 716650188 715983748 715008140 714654267 714985132 715420902 716138124 717207134 717754841 717666209
$$ packed form
550.7G06945300J16706p51078m64618L18825l45469p91609P6711j907r40442m97043
571.1G03665376K30670m73917q41737J7703m3809q17299k84613L68596k99395n26011
591.5G00995564K05338m5895p34627j83344L07500l55482m54068K80976n4121q84294
611.9F99077547m48227J21832r3341M83989J758874J887500J453638J865268J989722
630.2G08096802J138270R19402J398206R19818K04266N64277P37071K1696n6386N31673
650.6G14475095K19226k99156J93894M78328q5950k6167M54366j34110m79102Q59857
671G15656281J017928J94728P8619N28574J74820k95699J79947L83258l22581n96165
691.4G16999710l49522o66440r75608l53873L30865M35770P17222J069010N47707q8632
$$ plain form
711.8 717666209 717805684 717873037 717056572 716273546 717027485 719285786 722626388 727020085 731527030
730.2 731527030 735100329 738199055 741325021 743803084 745681763 748052120 750827730 753235459
746.5 753235459 755739093 758642077 760952294 762409687 763858259 765201449 765815675 766335905 767301738
764.9 767301738 767953455 768237829 769084215 770229757 770967007 771965563 773701072 775300860 776605666
783.2 776605666 778461993 780574024 782150686 783690512 785663724 787341177 788571298 790032089
799.5 790032089 791366160 791994452 792656362 793899238 795070529 796095550 797694862 799604416 801132262
817.9 801132262 802674472 804457366 805625796 806061924 806528389 806781232 806306362 805824637 805848837
836.2 805848837 805871487 805985749 806883633 808204770 809171617 810094059 811246634 812006950 812420905 813206732
$$ packed form
711.8G17666209J39475O7353q16465p83026P53939K258301L340602M393697M506945
730.2G31527030L573299L098726L125966K478063J878679K370357K775610K407729
746.5G53235459K503634K902984K310217J457393J448572J343190O14226N20230R65833
764.9G67301738O51717K84374Q46386J145542P37250R98556J735509J599788J304806
783.2G76605666J856327K112031J576662J539826J973212J677453J230121J460791
799.5G90032089J334071O28292O61910J242876J171291J025021J599312J909554J527846
817.9H01132262J542210J782894J168430M36128M66465K52843m74870m81725K4200
836.2H05848837K2650J14262Q97884J321137R66847R22442J152575P60316M13955P85827
$$ plain form
856.6 813206732 814034581 814221084 814151883 814170003 813697934 812623441 811544716 810297906 808402896
875 808402896 806470811 805327713 804964662 805319667 806374013 807482779 808053136 808347702 808664322
893.4 808664322 808667898 808309555 808072507 807928443 807548583 807249129 807313502 807350874 807237387 807361305
913.7 807361305 807625294 807543755 807237029 807024658 806616008 805845976 805106044 804396987 803361714 802230120
934.1 802230120 801304042 800208986 798709989 797163844 795636594 793784440 791681051 789615095 787352741
952.5 787352741 784601927 781575978 778337061 774599314 770542741 766673088 762989581 759321511
968.8 759321511 755910218 752773345 749441206 745824158 742233753 738588333 734720647 730913818
985.1 730913818 727292657 723569512 719823122 716393590 713046014 709397852 705624104 701853156
$$ packed form
856.6H13206732Q27849J86503o9201J8120m72069j074493j078725j246810j895010
875H08402896j932085j143098l63051L55005J054346J108766N70357K94566L16620
893.4H08664322L576l58343k37048j44064l79860k99454O4373L7372j13487J23918
913.7H07361305K63989q1539l06726k12371m08650p70032p39932p09057j035273j131594
934.1H02230120r26078j095056j498997j546145j527250j852154k103389k065956k262354
952.5G87352741k750814l025949l238917l737747m056573l869653l683507l668070
968.8G59321511l411293l136873l332139l617048l590405l645420l867686l806829
985.1G30913818l621161l723145l746390l429532l347576l648162l773748l770948
$$ plain form
1001.4 701853156 697736979 693196237 688530028 683730185 678752244 673967540 669544637 665203750
1017.8 665203750 660931230 656989634 653271198 649502814 645870984 642657995 639719307 636967838
1034.1 636967838 634550929 632308245 629944026 627505362 625064671 622418344 619568050 616848528
1050.4 616848528 614307165 611774385 609416366 607391715 605445087 603491306 601810038 600388348
1066.7 600388348 598971426 597659588 596627593 595680475 594776511 594252288 594250321 594703853 595668256
1085.1 595668256 597052991 598540425 600105703 602092564 604700863 607897937 611733913 616135895
1101.4 616135895 620632172 624761462 628269732 630745769 631881893 632040441 631899714 631995618 632942140
1119.8 632942140 635237336 638533056 641740143 643958330 644739091 643667758 640711904 636589408
$$ packed form
1001.4G01853156m116177m540742m666209m799843m977941m784704m422903m340887
1017.8F65203750m272520l941596l718436l768384l631830l212989k938688k751469
1034.1F36967838k416909k242684k364219k438664k440691k646327k850294k719522
1050.4F16848528k541363k532780k358019k024651j946628j953781j681268j421690
1066.7F00388348j416922j311838j031995r47118r03964n24223j967M53532R64403
1085.1E95668256J384735J487434J565278J986861K608299L197074L835976M401982
1101.4F16135895M496277M129290L508270K476037J136124J58548j40727R5904R46522
1119.8F32942140K295196L295720L207087K218187P80761j071333k955854m122496
$$ plain form
1136.1 636589408 632147253 628062665 624962211 623010099 621739388 620725930 619909227 619190514 618485630
1154.4 618485630 618081152 618298113 619191110 620895088 623614013 627199709 631413460 636389554 642279923
1172.8 642279923 648834765 655717373 662720382 669487238 675690234 681365013 686559737 691107988
1189.1 691107988 695007801 698415339 701244056 703307629 704647779 705297291 705142438 704317749 703124583
1207.5 703124583 701642156 699895501 698040962 696051776 693692625 690978885 688104868 685049832
1223.8 685049832 681772649 678502083 675426602 672517955 669853806 667641878 665947080 664842427
1240.1 664842427 664583683 665264010 666697383 668693841 670966983 673002720 674503803 675623059 676590025
1258.4 676590025 677533925 678650141 680079639 681694567 683324397 684862256 686042845 686630607 686838925
$$ packed form
1136.1F36589408m442155m084588l100454j952112j270711j013458q16703p18713p04884
1154.4F18485630m04478K16961Q92997J703978K718925L585696M213751M976094N890369
1172.8F42279923O554842O882608P003009O766856O202996N674779N194724M548251
1189.1F91107988L899813L407538K828717K063573J340150O49512j54853q24689j193166
1207.5G03124583j482427j746655j854539j989186k359151k713740k874017l055036
1223.8F85049832l277183l270566l075481k908647k664149k211928j694798j104653
1240.1F64842427k58744O80327J433373J996458K273142K035737J501083J119256R66966
1258.4F76590025R43900J116216J429498J614928J629830J537859J180589N87762K08318
$$ plain form
1276.8 686838925 687083662 687613070 688607693 690097928 691669881 692781448 693368673 693629563 693578184
1295.2 693578184 693236470 692794621 692363858 691966653 691691041 691541195 691361427 691179395 691265643 691713989
1315.6 691713989 692473590 693633854 695258319 697137654 699013233 700695038 701848626 702183247 701803148
1333.9 701803148 700952649 699648201 698079765 696819603 696082056 695600152 695271313 695115983 694965839
1352.3 694965839 694702208 694321036 693683565 692474008 690360963 687330186 683834255 680455029 677621901
1370.6 677621901 674625576 670291185 665463805 661972165 659882426 658185542 656769514 655825675
1386.9 655825675 654987037 654115200 653116405 651677251 650031328 648642778 647906899 648162365 649350226
1405.3 649350226 650888741 651988804 652281344 652153850 652367711 653267086 654709756 656273782 657475173
$$ packed form
1276.8F86838925K44737N29408R94623J490235J571953J111567N87225K60890n1379
1295.2F93578184l41714m41849m30763l97205k75612j49846j79768j82032Q6248M48346
1315.6F91713989P59601J160264J624465J879335J875579J681805J153588L34621l80099
1333.9G01803148q50499j304448j568436j260162p37547m81904l28839j55330j50144
1352.3F94965839k63631l81172o37471j209557k113045l030777l495931l379226k833128
1370.6F77621901k996325m334391m827380l491640k089739j696884j416028r43839
1386.9F55825675q38638q71837r98795j439154j645923j388550p35879K55466J187861
1405.3F49350226J538515J100063K92540j27494K13861Q99375J442670J564026J201391
$$ plain form
1423.7 657475173 657744825 656798124 654522240 651256502 647853851 644065499 639827132 636472106 634148955
1442 634148955 632359207 630749643 628910959 626632035 623854280 621170580 619777918 620459735 622199655
1460.4 622199655 624176145 626756668 631906211 642176032 658260167 677471220 692471325 701029360
1476.7 701029360 705797493 707706928 706963301 704198539 699671745 692782760 683931470 675330043
1493 675330043 666702211 656585038 646404684 637754261 630477846 622575402 611975193 602269769
1509.3 602269769 594606578 587825954 582229376 577901065 574737072 571833074 568783641 565843999
1525.6 565843999 562978089 560732901 559010208 557347238 556387603 556479752 556890488 557370663 558464825
1544 558464825 560223281 562734306 566153288 570222676 574658036 579441667 585118890 590642452 594641924
$$ packed form
1423.7F57475173K69652r46701k275884l265738l402651l788352m238367l355026k323151
1442F34148955j789748j609564j838684k278924k777755k683700j392662O81817J739920
1460.4F22199655J976490K580523N149543J0269821J6084135J9211053J5000105Q558035
1476.7G01029360M768133J909435p43627k764762m526794o888985q851290q601427
1493F75330043q627832j0117173j0180354q650423p276415p902444j0600209r705424
1509.3F02269769p663191o780624n596578m328311l163993k903998l049433k939642
1525.6E65843999k865910k245188j722693j662970r59635R2149M10736M80175J094162
1544E58464825J758456K511025L418982M069388M435360M783631N677223N523562L999472
$$ plain form
1562.4 594641924 598714590 603227198 607664704 611849546 615439713 618722618 621683002 623816848
1578.7 623816848 625396192 626517773 627196431 627433300 627022207 625861764 624201894 622012138 619190812
1597 619190812 615914941 612152398 607597589 602205575 596085548 588876486 580669045 572158873 562408268
1615.4 562408268 550101221 538309038 526901424 512877226 497610182 483088732 470557719
1629.7 470557719 462070286 457038850 453320801 450536728 448811114 447882175 447686851 447918266 448382467
1648 448382467 449362725 450864643 452424198 454182029 456695914 460171729 464458674 469183534 474007487
1666.4 474007487 479387611 485310018 490998864 497000575 503375232 509493232 515620649 522406757
1682.7 522406757 530188560 537450910 544299722 551872909 560120523 570592165 583182395 596243680
$$ packed form
1562.4E94641924M072666M512608M437506M184842L590167L282905K960384K133846
1578.7F23816848J579344J121581O78658K36869m11093j160443j659870k189756k821326
1597F19190812l275871l762543m554809n392014o120027p209062q207441q510172r750605
1615.4E62408268j2307047j1792183j1407614j4024198j5267044j4521450j2531013
1629.7D70557719q487433n031436l718049k784073j725614r28939j95324K31415M64201
1648D48382467R80258J501918J559555J757831K513885L475815M286945M724860M823953
1666.4D74007487N380124N922407N688846O001711O374657O118000O127417O786108
1682.7E22406757P781803P262350O848812P573187Q247614J0471642J2590230J3061285
$$ plain form
1699 596243680 610327423 622042894 631775498 641114056 649089813 655963600 662286162 668467522
1715.3 668467522 674372494 678866923 681677103 683038235 682373285 679212809 673482001 664570093
1731.7 664570093 649092019 628855765 609554708 588707030 568590224 554823816 549485266
1745.9 549485266 554212153 570362449 595891654 624398649 653958678 682688117 706934750
1760.2 706934750 726864696 741727233 752374947 760698497 767147720 772276640 776236653 779283226
1776.5 779283226 782098770 784837067 787211061 789280176 791278601 793317914 795212269 796805322
1792.8 796805322 798165262 799482286 800755978 801983356 803120792 804119527 805173993 806331515
1809.2 806331515 807359874 808137834 808956802 809863210 810704231 811539471 812470794 813338578 814070046
$$ packed form
1699E96243680J4083743J1715471R732604R338558P975757O873787O322562O181360
1715.3F68467522N904972M494429K810180J361132o64950l160476n730808q911908
1731.7F64570093j5478074k0236254j9301057k0847678k0116806j3766408n338550
1745.9E49485266M726887J6150296K5529205K8506995K9560029K8729439K4246633
1760.2G06934750J9929946J4862537J0647714Q323550O449223N128920L960013L046573
1776.5G79283226K815544K738297K373994K069115J998425K039313J894355J593053
1792.8G96805322J359940J317024J273692J227378J137436R98735J054466J157522
1809.2H06331515J028359P77960Q18968R06408Q41021Q35240R31323Q67784P31468
$$ plain form
1827.5 814070046 814778388 815355062 815842271 816364944 816968024 817613959 818289876 818906546 819338322 819648504
1847.9 819648504 819962084 820374370 820804894 821175754 821548820 821968317 822340786 822725236 823232770 823633194
1868.3 823633194 823707223 823761702 824015558 824252844 824410200 824640274 824918568 825103879 825313270 825618029
1888.7 825618029 825820625 825927496 826106489 826302230 826400042 826508999 826719403 826936424 827081680 827227652
1909.1 827227652 827351809 827396154 827516019 827734649 827836573 827817917 827850938 827917695 827909708 827894390 827983320
1931.5 827983320 828046978 828005433 828044116 828173757 828178763 828091741 828100443 828091383 827991128 827976942 828044534 828018904
1956 828018904 827965736 828026175 828061163 828001380 828000009 828020990 827907979 827792883 827821314 827821434 827705920 827665150
1980.5 827665150 827704906 827624738 827511907 827548087 827568948 827411175 827280700 827258348 827150822 827024281
$$ packed form
1827.5H14070046P08342N76674M87209N22673O03080O45935O75917O16670M31776L10182
1847.9H19648504L13580M12286M30524L70860L73066M19497L72469L84450N07534M00424
1868.3H23633194P4029N4479K53856K37286J57356K30074K78294J85311K09391L04759
1888.7H25618029K02596J06871J78993J95741R7812J08957K10404K17021J45256J45972
1909.1H27227652J24157M4345J19865K18630J01924j8656L3021O6757p987j5318Q8930
1931.5H27983320O3658m1545L8683J29641N006q7022Q702r060j00255j4186O7592k5630
1956H28018904n3168O0439L4988n9783j371K0981j13011j15096K8431J20j15514m0770
1980.5H27665150L9756q0168j12831L6180K0861j57773j30475k2352j07526j26541
$$ plain form
2000.9 827024281 827019870 826983690 826824784 826736867 826734662 826610565 826447427 826413751 826349080 826154292 826031506
2023.3 826031506 826008916 825896561 825748265 825739443 825731814 825603068 825553238 825606644 825542212 825429916 825472116
2045.8 825472116 825500548 825370848 825311661 825380623 825347900 825261533 825313926 825372219 825291812 825236261 825273514
2068.2 825273514 825239778 825192511 825266004 825311780 825250030 825288951 825456858 825524271 825519145 825625420 825750053
2090.6 825750053 825767338 825805604 825908601 825947821 825950205 826048136 826158345 826163173 826201022 826322436 826368153
2113.1 826368153 826353967 826420844 826490521 826466501 826500237 826652348 826725721 826707721 826772809 826860428 826873839
2135.5 826873839 826923668 827040076 827068985 827030241 827092588 827187657 827191114 827214897 827333391 827407658 827425063
2157.9 827425063 827523530 827637553 827645659 827666581 827767611 827824891 827849686 827953637 828072488 828101337 828132272
$$ packed form
2000.9H27024281m411l6180j58906q7917k205j24097j63138l3676o4671j94788j22786
2023.3H26031506k2590j12355j48296q822p629j28746m9830N3406o4432j12296M2200
2045.8H25472116K8432j29700n9187O8962l2723q6367N2393N8293q0407n5551L7253
2068.2H25273514l3736m7267P3493M5776o1750L8921J67907O7413n126J06275J24633
2090.6H25750053J7285L8266J02997L9220K384R7931J10209M828L7849J21414M5717
2113.1H26368153j4186O6877O9677k4020L3736J52111P3373j8000O5088Q7619J3411
2135.5H26873839M9829J16408K8909l8744O2347R5069L457K3783J18494P4267J7405
2157.9H27425063R8467J14023Q106K0922J01030N7280K4795J03951J18851K8849L0935
$$ plain form
2180.4 828132272 828231156 828285038 828280509 828347385 828460336 828496277 828522801 828621984 828686297 828688502 828757942 828864872
2204.8 828864872 828875422 828856885 828929901 828997612 828984618 829021633 829114318 829128683 829111218 829165399 829223096
2227.3 829223096 829212725 829192758 829191983 829165339 829147041 829195142 829228401 829177201 829142928 829173684 829158664 829101384
2251.8 829101384 829091370 829057038 828949213 828899264 828921556 828860343 828761637 828774035 828797221 828718007 828651547
2274.2 828651547 828660190 828622699 828529179 828499496 828479052 828345180 828195751 828090668 827911258 827685773 827537537
2296.6 827537537 827400982 827166140 826928973 826747596 826476276 826099277 825796425 825590789 825326502 824968576
2317 824968576 824573159 824124753 823663592 823321223 823026061 822651982 822366953 822224617 821974337 821646035
2337.4 821646035 821461916 821373403 821296215 821513772 822080493 822338164 821842134 820861042 819938600 819247901
$$ packed form
2180.4H28132272R8884N3882m529O6876J12951L5941K6524R9183O4313K205O9440J06930
2204.8H28864872J0550j8537P3016O7711j2994L7015R2685J4365j7465N4181N7697
2227.3H29223096j0371j9967p75k6644j8298M8101L3259n1200l4273L0756j5020n7280
2251.8H29101384j0014l4332j07825m9949K2292o1213r8706J2398K3186p9214o6460
2274.2H28651547Q643l7491r3520k9683k0444j33872j49429j05083j79410k25485j48236
2296.6H27537537j36555k34842k37167j81377k71320l76999l02852k05636k64287l57926
2317H24968576l95417m48406m61161l42369k95162l74079k85029j42336k50280l28302
2337.4H21646035j84119q8513p7188K17557N66721K57671m96030r81092r22442o90699
$$ plain form
2357.8 819247901 818801939 818637252 818682671 818903148 819365561 819951415 820451021 820924282 821492434 822041273
2378.2 822041273 822468638 822834373 823116422 823192477 823115766 823023677 822899163 822715163 822549164 822410464
2398.6 822410464 822219968 821999371 821821451 821640313 821410239 821220040 821081996 820875168 820618331 820428908
2419 820428908 820243835 819981933 819758892 819607019 819399178 819142580 818948209 818769097 818519175 818279743
2439.4 818279743 818102837 817897141 817642689 817415535 817200482 816921949 816625059 816390097 816157222 815873742
2459.8 815873742 815607429 815375507 815103054 814796865 814524531 814261019 813954592 813654244 813407421 813124835
2480.2 813124835 812767088 812414289 812060714 811670899 811315179 811024725 810719609 810387909 810094535 809820831
2500.6 809820831 809503853 809191823 808944941 808678389 808365285 808106065 807884037 807607532 807317674 807075560
$$ packed form
2357.8H19247901m45962j64687M5419K20477M62413N85854M99606M73261N68152N48839
2378.2H22041273M27365L65735K82049P6055p6711r2089j24514j84000j65999j38700
2398.6H22410464j90496k20597j77920j81138k30074j90199j38044k06828k56837j89423
2419H20428908j85073k61902k23041j51873k07841k56598j94371j79112k49922k39432
2439.4H18279743j76906k05696k54452k27154k15053k78533k96890k34962k32875k83480
2459.8H15873742k66313k31922k72453l06189k72334k63512l06427l00348k46823k82586
2480.2H13124835l57747l52799l53575l89815l55720k90454l05116l31700k93374k73704
2500.6H09820831l16978l12030k46882k66552l13104k59220k22028k76505k89858k42114
$$ plain form
2521 807075560 806814551 806532562 806310475 806097925 805833042 805586576 805387616 805155516 804876328 804628372
2541.4 804628372 804406404 804137230 803865016 803663075 803459644 803206861 802970767 802757323 802504182 802232981
2561.8 802232981 802005768 801769853 801476300 801197767 800963342 800681770 800353467 800075531 799797237 799457431
2582.2 799457431 799156725 798910797 798593760 798227966 797939122 797666669 797313809 796978533 796718061 796408355
2602.6 796408355 796024024 795663118 795310080 794925511 794594944 794319391 793976128 793583453 793220878 792826414
2623 792826414 792364120 791931689 791557491 791155457 790725529 790355682 790007710 789594054 789184809 788830221
2643.4 788830221 788440585 787993848 787564158 787131310 786645651 786188960 785790086 785333335 784826756 784388363
2663.7 784388363 783977449 783523440 783113599 782799840 782464206 782063305 781715333 781427145 781117380 780836880
$$ packed form
2521H07075560k61009k81989k22087k12550k64883k46466j98960k32100k79188k47956
2541.4H04628372k21968k69174k72214k01941k03431k52783k36094k13444k53141k71201
2561.8H02232981k27213k35915k93553k78533k34425k81572l28303k77936k78294l39806
2582.2G99457431l00706k45928l17037l65794k88844k72453l52860l35276k60472l09706
2602.6G96408355l84331l60906l53038l84569l30567k75553l43263l92675l62575l94464
2623G92826414m62294m32431l74198m02034m29928l69847l47972m13656m09245l54588
2643.4G88830221l89636m46737m29690m32848m85659m56691l98874m56751n06579m38393
2663.7G84388363m10914m54009m09841l13759l35634m00901l47972k88188l09765k80500
$$ plain form
2684.1 780836880 780633926 780425370 780179679 779952645 779737234 779484153 779209733 778941631 778603971 778177798
2704.5 778177798 777775884 777374625 776863337 776307642 775777221 775205612 774598062 774026394 773458600 772846282
2724.9 772846282 772239685 771687388 771175683 770702660 770290494 769892752 769443870 768997192 768610775 768219888
2745.3 768219888 767767608 767281771 766776562 766247213 765725017 765212357 764654398 764057934 763475835 762887597
2765.7 762887597 762255549 761619270 761002064 760345936 759614050 758822143 757997096 757141232 756249011 755353570
2786.1 755353570 754462898 753530085 752532959 751488805 750417054 749329150 748201787 746994972 745688796
2804.5 745688796 744287610 742824674 741268277 739547908 737682998 735667825 733407795 730860829
2820.8 730860829 728007376 724723697 720893025 716540337 711673260 706174910 699800014 691995263
$$ packed form
2684.1G80836880k02954k08556k45691k27034k15411k53081k74420k68102l37660m26173
2704.5G78177798m01914m01259n11288n55695n30421n71609o07550n71668n67794o12318
2724.9G72846282o06597n52297n11705m73023m12166l97742m48882m46678l86417l90887
2745.3G68219888m52280m85837n05209n29349n22196n12660n57959n96464n82099n88238
2765.7G62887597o32048o36279o17206o56128p31886p91907q25047q55864q92221q95441
2786.1G55353570q90672r32813r97126j044154j071751j087904j127363j206815j306176
2804.5G45688796j401186j462936j556397j720369j864910k015173k260030k546966
2820.8G30860829k853453l283679l830672m352688m867077n498350o374896p804751
$$ plain form
2837.1 691995263 681708992 667589962 648584783 624575317 596949816 568932176 545319736
2851.4 545319736 531159759 529292703 538585365 554717302 572577715 588158667 599229336 605353296
2867.7 605353296 607970655 609851360 613087893 617598534 621961594 624945581 626004279 625089705
2884 625089705 622393072 618168950 612664521 606166840 598993003 591303647 583068788 574226201 564657688
2902.4 564657688 554121017 542332411 528935552 513453305 495507389 475218415 453542054
2916.6 453542054 432293385 413831949 400428981 393445581 393022984 398422390 408536017 422335893
2933 422335893 438841879 456885666 475169718 492455065 507645845 519736886 527918458 532045245
2949.3 532045245 532989621 532340169 531889677 533182442 537051618 543588102 552445114 563054204 574638486
$$ packed form
2837.1F91995263j0286271j4119030j9005179k4009466k7625501k8017640k3612440
2851.4E45319736j4159977j867056R292662J6131937J7860413J5580952J1070669O123960
2867.7F05353296K617359J880705L236533M510641M363060K983987J058698r14574
2884F25089705k696633m224122n504429o497681p173837p689356q234859q842587r568513
2902.4E64657688j0536671j1788606j3396859j5482247j7945916k0288974k1676361
2916.6D53542054k1248669j8461436j3402968o983400m22597N399406J0113627J3799876
2933D22335893J6505986J8043787J8284052J7285347J5190780J2091041Q181572M126787
2949.3E32045245R44376o49452m50492J292765L869176O536484Q857012J0609090J1584282
$$ plain form
2967.6 574638486 586340249 597580016 608069003 617612958 626220524 634034812 641048431 647192299
2984 647192299 652482629 656920612 660383880 662635207 663477957 662925124 661125302 658402324 655418098
3002.3 655418098 652881801 651363611 651400387 653238237 656584024 660854280 665432632 669704676 673230112
3020.7 673230112 675886035 677729845 678876698 679527462 679844260 679866791 679619491 679167151 678594232
3039 678594232 677924275 677138507 676243126 675249636 674199700 673148632 672075570 670943022 669797957
3057.4 669797957 668717444 667729139 666818380 666015804 665372789 664843738 664368093 663978219 663696289
3075.7 663696289 663468003 663203835 662894964 662628353 662405610 662219167 662106514 662000656 661852002 661709309
3096.1 661709309 661580801 661391735 661109090 660789549 660450637 660051107 659586430 659106791 658625603 658077180
$$ packed form
2967.6E74638486J1701763J1239767J0488987R543955Q607566P814288P013619O143868
2984F47192299N290330M437983L463268K251327Q42750n52833j799822k722978k984226
3002.3F55418098k536297j518190L6776J837850L345787M270256M578352M272044L525436
3020.7F73230112K655923J843810J146853O50764L16798K2531k47300m52340n72919
3039F78594232o69957p85768q95381r93490j049936j051068j073062j132548j145065
3057.4F69797957j080513r88305r10759q02576o43015n29051m75645l89874k81930
3075.7F63696289k28286k64168l08871k66611k22743j86443j12653j05858j48654j42693
3096.1F61709309j28508j89066k82645l19541l38912l99530m64677m79639m81188n48423
$$ plain form
3116.5 658077180 657418013 656620979 655663610 654639125 653636336 652624309 651569605 650454402 649249077
3134.9 649249077 647972286 646672070 645292997 643789530 642243743 640692770 639135301 637564719
3151.2 637564719 635888517 634077728 632216513 630348980 628492415 626607180 624641180 622646272
3167.5 622646272 620639861 618569255 616462290 614378035 612269104 610085666 607852697 605619252
3183.8 605619252 603427470 601265967 599088311 596864522 594627261 592430830 590256274 588063061
3200.1 588063061 585907102 583831131 581770241 579682708 577600539 575534821 573469877 571404219
3216.5 571404219 569321513 567214549 565105200 563006222 560904086 558760345 556580365 554404438
3232.8 554404438 552161872 549792230 547405720 545062125 542678714 540204942 537663579 535065532
$$ packed form
3116.5F58077180o59167p97034r57369j024485j002789j012027j054704j115203j205325
3134.9F49249077j276791j300216j379073j503467j545787j550973j557469j570582
3151.2F37564719j676202j810789j861215j867533j856565j885235j966000j994908
3167.5F22646272k006411k070606k106965k084255k108931k183438k232969k233445
3183.8F05619252k191782k161503k177656k223789k237261k196431k174556k193213
3200.1E88063061k155959k075971k060890k087533k082169k065718k064944k065658
3216.5E71404219k082706k106964k109349k098978k102136k143741k179980k175927
3232.8E54404438k242566k369642k386510k343595k383411k473772k541363k598047
$$ plain form
3249.1 535065532 532436371 529845119 527286649 524692774 522063911 519459367 516898394 514371037
3265.4 514371037 511940598 509677827 507528603 505439341 503469706 501645744 499938428 498387784
3281.7 498387784 496976525 495625526 494389534 493324816 492352873 491384745 490443021 489592403 488835931
3300.1 488835931 488171279 487602562 487051845 486421883 485740781 485079736 484428793 483791530 483190626 482581437
3320.5 482581437 481931925 481253654 480526984 479719669 478839248 477933735 477036685 476093620 475024998
3338.8 475024998 473850697 472638667 471409053 470169753 468914509 467570662 466096997 464559376
3355.2 464559376 463049680 461612135 460195541 458723336 457228869 455758482 454241097 452608913
3371.5 452608913 450994849 449571013 448280007 447014660 445792913 444657147 443600237 442664176
$$ packed form
3249.1E35065532k629161k591252k558470k593875k628863k604544k560973k527357
3265.4E14371037k430439k262771k149224k089262j969635j823962j707316j550644
3281.7D98387784j411259j350999j235992j064718r71943r68128r41724q50618p56472
3300.1D88835931o64652n68717n50717o29962o81102o61045o50943o37263o00904o09189
3320.5D82581437o49512o78271p26670q07315q80421r05513q97050r43065j068622
3338.8D75024998j174301j212030j229614j239300j255244j343847j473665j537621
3355.2D64559376j509696j437545j416594j472205j494467j470387j517385j632184
3371.5D52608913j614064j423836j291006j265347j221747j135766j056910r36061
$$ plain form
3387.8 442664176 441895783 441120028 440169543 439237833 438589960 438111186 437461615 436615229 435858488 435301960
3408.2 435301960 434861064 434453279 434027880 433633238 433379441 433238894 433146685 433192581 433420360 433798015
3428.6 433798015 434263259 434808016 435467452 436095417 436623603 437256962 438096553 439071357 440138400
3446.9 440138400 441220284 442290843 443431169 444684893 446038187 447476834 448919535 450380683
3463.2 450380683 452021867 453801185 455469489 456919104 458371878 460042298 461927563 463891774
3479.6 463891774 465782344 467653126 469624817 471624821 473605216 475629926 477698147 479805946
3495.9 479805946 481932491 484079838 486252844 488376915 490470022 492645979 494918466 497270465
3512.2 497270465 499630898 501912653 504234314 506735325 509407878 512052536 514550269 517021656
$$ packed form
3387.8D42664176p68393p75755r50485r31710o47873m78774o49571q46386p56741n56528
3408.2D35301960m40896m07785m25399l94642k53797j40547r2209M5896K27779L77655
3428.6D33798015M65244N44757O59436O27965N28186O33359Q39591R74804J067043
3446.9D40138400J081884J070559J140326J253724J353294J438647J442701J461148
3463.2D50380683J641184J779318J668304J449615J452774J670420J885265J964211
3479.6D63891774J890570J870782J971691K000004J980395K024710K068221K107799
3495.9D79805946K126545K147347K173006K124071K093107K175957K272487K351999
3512.2D97270465K360433K281755K321661K501011K672553K644658K497733K471387
$$ plain form
3528.5 517021656 519574404 522286117 525192022 528080881 530803919 533675015 536859334 540054083
3544.8 540054083 542938828 545660138 548571527 551660120 554748118 557858586 561088860 564416587
3561.1 564416587 567756712 571138203 574670851 578195035 581566870 584968567 588570833 592329383
3577.5 592329383 596174002 600133002 604230106 608358026 612315416 616122782 619937360 623805761
3593.8 623805761 627718568 631714463 635706425 639569223 643408179 647287488 651184082 655059159
3610.1 655059159 658851027 662515521 666061163 669625044 673128009 676305115 679349363 682569444
3626.4 682569444 685929120 688991010 691661835 694288909 696882725 699368238 701837718 704329610
3642.7 704329610 706832230 709360838 711768687 713684380 715215385 716801047 718520403 720171332
$$ packed form
3528.5E17021656K552748K711713K905905K888859K723038K871096L184319L194749
3544.8E40054083K884745K721310K911389L088593L087998L110468L230274L327727
3561.1E64416587L340125L381491L532648L524184L371835L401697L602266L758550
3577.5E92329383L844619L959000M097104M127920L957390L807366L814578L868401
3593.8F23805761L912807L995895L991962L862798L838956L879309L896594L875077
3610.1F55059159L791868L664494L545642L563881L502965L177106L044248L220081
3626.4F82569444L359676L061890K670825K627074K593816K485513K469480K491892
3642.7G04329610K502620K528608K407849J915693J531005J585662J719356J650929
$$ plain form
3659 720171332 721665502 723041594 724467099 726008236 727437019 728615701 729688168 730551422 731208444
3677.4 731208444 731968224 732878923 734015048 735451818 737014949 738164723 738767505 739344478 740061998
3695.8 740061998 740845382 741600335 742180645 742655814 743273437 744037926 744673789 744935632 745051980 745307803
3716.2 745307803 745656192 746004343 746288478 746456921 746570230 746836126 747332692 747979462 748498440 748585701
3736.5 748585701 748538971 748763800 749079764 749185145 749429822 749870718 749922216 749659479 749681950 749926150
3756.9 749926150 750033259 750038207 750184476 750383556 750535309 750654936 750647962 750612617 750780940 751116037
3777.3 751116037 751284301 751174092 751064777 751017630 750958681 751002610 751206279 751420677 751534998 751663089
3797.7 751663089 751783252 751712143 751666903 751682818 751544178 751488686 751682281 751901984 751961052 752054989 752105176
$$ packed form
3659G20171332J494170J376092J425505J541137J428783J178682J072467Q63254O57022
3677.4G31208444P59780R10699J136125J436770J563131J149774O02782N76973P17520
3695.8G40061998P83384P54953N80310M75169O17623P64489O35863K61843J16348K55823
3716.2G45307803L48389L48151K84135J68443J13309K65896M96566O46770N18978Q7261
3736.5G48585701m6730K24829L15964J05381K44677M40896N1498k62737K2471K44200
3756.9G49926150J07109M948J46269J99080J51753J19627o974l5345J68323L35097
3777.3G51116037J68264j10209j09315m7147n8949M3929K03669K14398J14321J28091
3797.7G51663089J20163p1109m5240J5915j38640n5492J93595K19703N9068R3937N0187
$$ plain form
3820.2 752105176 751827240 751602232 751594007 751624405 751703680 751890004 752189875 752373755 752222717 751978636
3840.6 751978636 751806676 751646280 751601696 751817465 752169251 752100229 751534760 751283050 751352549 751486003
3861 751486003 751579583 751554251 751493454 751414895 751285315 751165032 751073360 751089215 751107395 751012981 750960171
3883.4 750960171 750861883 750729442 750723660 750616968 750411510 750448883 750670135 750774324 750651896 750365913
3903.8 750365913 750080585 749901831 749792635 749773443 749824584 749824584 749746263 749683142 749654830 749558985 749426842
3926.2 749426842 749367058 749327064 749255180 749155164 749027610 748925030 748890102 748862803 748792171 748736739 748682380
3948.7 748682380 748543561 748415947 748393357 748349071 748253345 748192728 748124719 748008728 747907102 747893512 747887015
3971.1 747887015 747805417 747756660 747743607 747678161 747610271 747609973 747620702 747551441 747444510 747374892 747313380 747247338
$$ packed form
3820.2G52105176k77936k25008q225L0398P9275J86324K99871J83880j51038k44081
3840.6G51978636j71960j60396m4584K15769L51786o9022n65469k51710O9499J33454
3861G51486003R3580k5332o0797p8559j29580j20283r1672J5855J8180r4414n2810
3883.4G50960171r8288j32441n782j06692k05458L7373K21252J04189j22428k85983
3903.8G50365913k85328j78754j09196j9192N1141%p8321o3121k8312r5845j32143
3926.2G49426842n9784l9994p1884j00016j27554j02580l4928k7299p0632n5432n4359
3948.7G48682380j38819j27614k2590m4286r5726o0617o8009j15991j01626j3590o497
3971.1G47887015q1598m8757j3053o5446o7890k98J0729o9261j06931o9618o1512o6042
$$ plain form
3995.6 747247338 747234821
3997.6 747234821
$$ packed form
3995.6G47247338j2517
3997.6G47234821
##END=$$ End of the data block
