##TITLE=Lut 1p1 $$ Begin of the data block
##JCAMP-DX=5.00 $$ ACD/SpecManager v 10.08
##SPECTROMETER/DATA SYSTEM=Alpha
##DATE=03 Sep 2014 08:47:40
##DATA TYPE=INFRARED SPECTRUM
##DATA CLASS=XYDATA
##ORIGIN=
##OWNER=
##NPOINTS=1765
##FIRSTX=399.76428223
##LASTX=3997.64306641
##MAXX=3997.64306641
##MINX=399.76428223
##MAXY=0.87084633
##MINY=0.52139866
##XFACTOR=1.0000000000
##YFACTOR=1.000000000000000e-9
##FIRSTY=0.83503515
##DELTAX=2.03961372
##XUNITS=1/CM
##YUNITS=ARBITRARY UNITS
##XYDATA=(X++(Y..Y))
399.8H35035145q02874M849970J232028n688369m050255L473878M281580k295851n287588
$$ 835035145 834232271 839082241 840314269 834625900 830575645 834049523 838331103 836035252 830747664
418.1H30747664O57976M312694j015485o035149k210617M508376L161431l884077m714787
$$ 830747664 831405640 835718334 834702849 828667700 826457083 830965459 834126890 830242813 825528026
436.5H25528026K005279M638552j405477n955219j226485M447102J595676m872083
$$ 825528026 827533305 832171857 830766380 824811161 823584676 828031778 829627454 824755371
452.8H24755371m022897L073752M654110k141714n447507j95861M738331J427293m408718
$$ 824755371 820732474 823806226 828460336 826318622 820871115 820675254 825413585 826840878 822432160
471.2H22432160l038108L246903L829360k146005m725039M91082M766167Q62956m583121
$$ 822432160 819394052 822640955 826470315 824324310 819599271 820090353 824856520 825719476 821136355
489.5H21136355k583205L442287L342450k667666m598438O38544M275918J48833m903972
$$ 821136355 818553150 821995437 825337887 822670221 818071783 818710327 822986245 823135078 818231106
507.9H18231106k524197L315985K972066k954185m647493Q07106M204691O0260m846453
$$ 818231106 815706909 819022894 821994960 819040775 814393282 815200388 819405079 819465339 814618886
526.2H14618886k514601L130436K852559k808809m381478Q59737M211426J97172m567087
$$ 814618886 812104285 815234721 818087280 815278471 810896993 811756730 815968156 816165328 811598241
544.6H11598241k436220L069400L042043k381742m227102N87463M272402P95424m371345
$$ 811598241 809162021 812231421 815273464 812891722 808664620 809252083 813524485 814319909 809948564
562.9H09948564k843321K910793L396571k113402m479766r358L970325J065612l748119
$$ 809948564 807105243 810016036 813412607 811299205 806819439 806810081 810780406 811846018 808097899
581.3H08097899k519965K633393L368795j312018l739834j9788L703951J392186l113449
$$ 808097899 805577934 808211327 811580122 810268104 806528270 806508482 810212433 811604619 808491170
599.6H08491170k347469K529800L617525q40545l680467m48704L408015J601934k727508
$$ 808491170 806143701 808673501 812291026 811450481 807770014 807321310 810729325 812331259 809603751
618H09603751k119482K850235M662096Q31306k278209K85983M135192K815783j708090
$$ 809603751 807484269 810334504 814996600 815827906 813549697 813835680 817970872 820786655 819078565
636.4H19078565k303958J777827L807426M14073k986967j000106L034651K448201j789928
$$ 819078565 816774607 818552434 822359860 822773933 819786966 818786860 821821511 824269712 822479784
654.7H22479784k812802J021802L494084P09891k750396k044261K623856K570868j488746
$$ 822479784 819666982 820688784 824182868 824892759 822142363 820098102 822721958 825292826 823804080
673.1H23804080k892911J67608K874732P56443k735794j947522J780808K376437j166761
$$ 823804080 820911169 821078777 823953509 824709952 821974158 820026636 821807444 824183881 823017120
691.4H23017120l221571n87881K448261J092374k243340k033352J389563K518892n22614
$$ 823017120 819795549 819207668 821655929 822748303 820504963 818471611 819861174 822380066 821857452
709.8H21857452l068983j374245J417339L98636k954483k749443J727760M735052L061831
$$ 821857452 818788469 817414224 818831563 819230199 816275716 813526273 815254033 819989085 823050916
728.1H23050916M23908J391173M268944M078210P54833o58274J870871M174947K519608
$$ 823050916 823474824 824865997 829134941 833213151 833967984 833309710 835180581 839355528 841875136
746.5H41875136n34356k38538K740860L351748K96414j850068J3470K621115J673281
$$ 841875136 841340780 841102242 843843102 847194850 847491264 845641196 845654666 848275781 849949062
764.9H49949062j274347j459837J419663K788365N60284j614929k53081K527237K405286
$$ 849949062 848674715 847214878 848634541 851422906 851983190 850368261 850115180 852642417 855047703
783.2H55047703l39270j241684J182139L033579J376390j151621n79894K097309K493322
$$ 855047703 854708433 853466749 854648888 857682467 859058857 857907236 857327342 859424651 861917973
801.6H61917973j46032j686156K86281K612591J700938q89003r79483J585304K642155
$$ 861917973 861771941 860085785 860372066 862984657 864685595 863796592 862817109 864402413 867044568
819.9H67044568M51088j554668l23832J979589J437009j308322k039194K76148J940906
$$ 867044568 867495656 865940988 865617156 867596745 869033754 867725432 865686238 865962386 867903292
838.3H67903292M56691j616299q29458J672804J997292l65078j673103J48654K126098
$$ 867903292 868359983 866743684 865914226 867587030 869584322 869219244 867546141 867694795 869820893
856.6H69820893J025438j440227j427889Q44717J542449n85377k313137j069665J024485
$$ 869820893 870846331 869406104 867978215 868822932 870365381 869780004 867466867 866397202 867421687
875H67421687O24418j409710j551389O87420J995206M08947j541495q05378J309931
$$ 867421687 868046105 866636395 865085006 865772426 867767632 868176579 866635084 865829706 867139637
893.4H67139637J305759q63134j798571j03294J457393L82721j557827j198888R11117
$$ 867139637 868445396 867582262 865783691 865680397 867137790 867520511 865962684 864763796 865674913
911.7H65674913J443028l98934j653492l31759J398921P05182j381337j675904J18136
$$ 865674913 867117941 866719007 865065515 864733756 866132677 866837859 865456522 863780618 863898754
930.1H63898754J004517n11169k080441j292586M97699L19063j630485k339065q39829
$$ 863898754 864903271 864392102 862311661 861019075 861516774 861835837 860205352 857866287 857026458
948.4H57026458L21030q23021k567708k332926p67946o09994k249956l130794j862228
$$ 857026458 857347488 856524467 853956759 851623833 850855887 850245893 847995937 844865143 843002915
966.8H43002915l73542q15511k274632k338231r42647m25339j724601k859056k113163
$$ 843002915 842629373 841813862 839539230 837200999 836258352 835833013 834108412 831249356 829136193
985.1H29136193p28071q71837k240837k598822j385033n86688j517117k800882k606690
$$ 829136193 828408122 827536285 825295448 822696626 821311593 820724905 819207788 816406906 813800216
1003.5H13800216j486004j429259k705157l450811k603948j555920j904964k952814
$$ 813800216 812314212 810884953 808179796 804728985 802125037 800569117 798664153 795711339
1019.8G95711339k905131j725554j157046j934349k610326j857817o03259n64635j530051
$$ 795711339 792806208 791080654 789923608 787989259 785378933 783521116 782917857 782353222 780823171
1038.2G80823171j834690j069069n77689j285076k239048k067566j098573p97987j507223
$$ 780823171 778988481 777919412 777341723 776056647 773817599 771750033 770651460 769853473 768346250
1056.5G68346250j912057j193285l74735o08504j382529j398504o34670l66092j113236
$$ 768346250 766434193 765240908 764866173 764257669 762875140 761476636 760841966 760475874 759362638
1074.9G59362638j826286j529634p29323n28216r80735j087010l91543K80023K43008
$$ 759362638 757536352 756006718 755277395 754749179 753768444 752681434 752289891 752569914 752812922
1093.2G52812922J71483R92417K365768L092348K751172K191544K098143J883387Q00073
$$ 752812922 752984405 753976822 756342590 759434938 762186110 764377654 766475797 768359184 769159257
1111.6G69159257o04927j062870k29836R63092J647949J938761K154052J906156O09220
$$ 769159257 768554330 767491460 767261624 768224716 769872665 771811426 773965478 775871634 776480854
1129.9G76480854j480401l179729l694594l523886l346861l005504k169848j205444
$$ 776480854 775000453 771820724 768126130 764602244 761255383 758249879 756080031 754874587
1146.3G54874587q86977j358390j854777j708329j222252j021982r50992l68714P32899
$$ 754874587 753987610 752629220 750774443 749066114 747843862 746821880 745870888 745502174 746235073
1164.6G46235073J659989K032816K294183K989888L872395M235089L989100L730357
$$ 746235073 747895062 749927878 752222061 755211949 759084344 763319433 767308533 771038890
1180.9G71038890L785908L790438L379405K793789K504527K524257K390683J880705
$$ 771038890 774824798 778615236 781994641 784788430 787292957 789817214 792207897 794088602
1197.3G94088602J324594J064718R34183N47052n0426m08828l54111k81394n92112
$$ 794088602 795413196 796477914 797412097 797959149 797908723 797499895 797145784 796864390 796272278
1215.6G96272278j075387j292885j297175j470149j879752k170980k088308j834989
$$ 796272278 795196891 793904006 792606831 791136682 789256930 787085950 784997642 783162653
1231.9G83162653j733064j722217j470864q87513k37405L14414Q51632J383423J707971
$$ 783162653 781429589 779707372 778236508 777348995 777111590 777426004 778277636 779661059 781369030
1250.3G81369030J586438J106918O83724N79358O71207P44403P85589Q89897J035572
$$ 781369030 782955468 784062386 784746110 785325468 785996675 786741078 787526667 788416564 789452136
1268.6G89452136J047372Q10981M54426K49743L53456P11977J128853J407146J431823
$$ 789452136 790499508 791310489 791764915 792014658 792368114 793080091 794208944 795616090 797047913
1287G97047913J186907P93398M20093J78337R3222J11163J57416J82986J70350J69218
$$ 797047913 798234820 799028218 799448311 799626648 799719870 799831033 799988449 800171435 800341785 800511003
1307.4H00511003J80900J29938O6757J69575M78983Q13007J027465J137972J240015
$$ 800511003 800691903 800821841 800888598 801058173 801537156 802350163 803377628 804515600 805755615
1325.8H05755615J296759J058280M81904p2003l66032n92529q56698r11176o82950
$$ 805755615 807052374 808110654 808592558 808520555 808154523 807561994 806705296 805794120 805111170
1344.1H05111170l93689k18212k08974k22564j24037l7849j31309m76539j068414j555383
$$ 805111170 804717481 804499269 804290295 804067731 803943694 803905845 803774536 803297997 802229583 800674200
1364.5H00674200j598954j498759j468301j781225k630413k903938j816332m80294
$$ 800674200 799075246 797576487 796108186 794326961 791696548 788792610 786976278 786495984
1380.8G86495984J58608N94615R36449O16312J82927Q7738j42276n45204q02756n48660
$$ 786495984 786654592 787249207 788185656 788801968 788984895 789072633 788930357 788385153 787582397 787033737
1401.2G87033737L08990J055896J043141M79222j79053n11288k42293L66986Q21888
$$ 787033737 787342727 788398623 789441764 789920986 789741933 789230645 788988352 789355338 790177226
1419.6G90177226R36449P87556J07825r13322j915098k468347k355099k632856l180146
$$ 790177226 791113675 791901231 792009056 791095734 789180636 786712289 784357190 781724334 778544188
1437.9G78544188k600193j773775j397252j348257j718939k376973k987504l024280
$$ 778544188 775943995 774170220 772772968 771424711 769705772 767328799 764341295 761317015
1454.3G61317015k407611j309633k49684K67923O74605K881349P715046J2844026J4956057
$$ 761317015 758909404 757599771 757350087 757618010 758292615 761173964 768889010 781733036 796689093
1472.6G96689093J0840535N599559L082811J639665L01838p98107j596570k635777
$$ 796689093 807529628 813129187 816211998 817851663 818153501 817355394 815758824 813123047
1488.9H13123047l848612m057348l974020m490972m662752m115939l307700l300011
$$ 813123047 809274435 805217087 801243067 796752095 792089343 787973404 784665704 781365693
1505.2G81365693m881680n118788m219532l673374k885342k004385j363456j533509
$$ 781365693 776484013 771365225 767145693 763472319 760586977 758582592 757219136 755685627
1521.6G55685627j920104j728653j563311j272202r12666q63731m84466M09424P47800
$$ 755685627 753765523 752036870 750473559 749201357 748288691 747424960 746940494 747349918 748097718
1539.9G48097718J49309J01507O46055J244008J694024K025366K500653L033936L379345
$$ 748097718 748247027 748348534 748994589 750238597 751932621 753957987 756458640 759492576 762871921
1558.3G62871921K294421J228571J681805K175152K149522J721681J331687J455426
$$ 762871921 765166342 766394913 768076718 770251870 772401392 774123073 775454760 776910186
1574.6G76910186J196384L39449M9412N0127j35958n63323j006961j328945j508892
$$ 776910186 778106570 778446019 778495431 778545558 778409600 777846277 776839316 775510371 774001479
1593G74001479j801252k224446k568364k814889l105819l550291m089951m730046n103708
$$ 774001479 772200227 769975781 767407417 764592528 761486709 757936418 753846467 749116421 744012713
1611.3G44012713n066037n795598p505297p172525o643713q106887r124160r048224
$$ 744012713 738946676 733151078 725645781 718473256 711829543 703722656 694598496 685550272
1627.6F85550272q041203n307734k682030j809239j656890r47416j11103N80788J043796
$$ 685550272 677509069 672201335 669519305 667710066 666053176 665105760 664994657 665575445 666619241
1646F66619241J153529J391292K150058K213240J556992K114237L218472L895819L787816
$$ 666619241 667772770 669164062 671314120 673527360 675084352 677198589 680417061 684312880 688100696
1664.3F88100696L571987M092753M387378L808737L759027L860533L630340L675759
$$ 688100696 691672683 695765436 700152814 703961551 707720578 711581111 715211451 718887210
1680.7G18887210L960609L962756L196001L052115L491759L835440M972041N997657
$$ 718887210 722847819 726810575 730006576 733058691 736550450 740385890 745357931 751355588
1697G51355588N880177N428911L780424K831459K443195J756549J527369J803398K351105
$$ 751355588 757235765 762664676 766445100 769276559 771719754 773476303 775003672 776807070 779158175
1715.3G79158175K569854J743436N87583m94659k028346l983736o147564q613288j3630629
$$ 779158175 781728029 783471465 784059048 783564389 781536043 777552307 771404743 762791455 749160826
1733.7G49160826j7248869j6256809j7200112j6252041j0711193l433943N101442J4442087
$$ 749160826 731911957 715655148 698455036 682202995 671491802 668057859 673159301 687601388
1750F87601388K1613895K3368240K3594439K2228598J8138171J4576077J0570705P232487
$$ 687601388 709215283 732583523 756177962 778406560 796544731 811120808 821691513 828924000
1766.3H28924000N483449M232764L254473K226055J524210J385510J400471J298844
$$ 828924000 834407449 838640213 841894686 844120741 845644951 847030461 848430932 849729776
1782.6H49729776J111210Q79466R11534J066625Q86083M60148L95059N56648N92053
$$ 849729776 850840986 851720452 852631986 853698611 854584694 855044842 855439901 855996549 856588602
1801H56588602M71652L64482L94285M72426M76778L36587K35975K23279L36766N01335
$$ 856588602 857060254 857424736 857819021 858291447 858768225 859104812 859340787 859564066 859900832 860402167
1821.4H60402167N41806L88742K74658K83777J22905J5080Q4758K19524L82841M89354
$$ 860402167 860943973 861332715 861607373 861891150 862014055 862029135 862113893 862333417 862716258 863205612
1841.8H63205612K87592q0407p4148J15514J16587k682M1604K12371K56896J04964
$$ 863205612 863493204 863412797 863338649 863454163 863570750 863568068 863609672 863822043 864078939 864183903
1862.2H64183903N4896K38001K98023k5332k90155j61767R9242J93357M5478r8884
$$ 864183903 864238799 864476800 864774823 864749491 864459336 864297569 864396811 864590168 864635646 864536762
1882.6H64536762k9027J72257J76966o3657j32621M3512J35362J19j57714r8646J04845
$$ 864536762 864507735 864679992 864856958 864793301 864660680 864704192 864839554 864839673 864681959 864583313 864688158
1905H64688158J38581m3094j63734j6153K07186J44720j37627k00749m7326j2934j27137
$$ 864688158 864826739 864783645 864619911 864603758 864810944 864955664 864818037 864617288 864569962 864557028 864429891
1927.5H64429891j87039o1274P3970J3351j17838r0659L7074L874j57177k21908j05918
$$ 864429891 864242852 864181578 864255548 864268899 864151061 864060402 864097476 864101350 863944173 863722265 863616347
1949.9H63616347M3214L0696j04070j62601q2672j1325l6358j03653j24454n9367p093
$$ 863616347 863659561 863690257 863586187 863423586 863340914 863329589 863293231 863189578 863065124 863005757 862998664
1972.3H62998664p7724j55866j07944l4511m3869q7500p8618k1339Q35q9050j85907
$$ 862998664 862920940 862765074 862657130 862622619 862578750 862491250 862412632 862391293 862392128 862303078 862117171
1994.8H62117171j56462r4235r6321j34170j34110p4625k4021m4286j09733j51991
$$ 862117171 861960709 861866474 861770153 861635983 861501873 861427248 861403227 861358941 861249208 861097217
2015.2H61097217j26720q7321j19686j59561j25647n5969j3351k4855j01447j31429
$$ 861097217 860970497 860883176 860763490 860603929 860478282 860422313 860408962 860384107 860282660 860151231
2035.6H60151231l1113N1021k0027j25706q7381K2114K8968o7413j05202j2279N5194
$$ 860151231 860120118 860171139 860151112 860025406 859938025 859960139 859989107 859921694 859816492 859804213 859859407
2058H59859407j7643j09077o7114L8266M6193o0558j20878k6524Q8632N2810p1288
$$ 859859407 859841764 859732687 859665573 859703839 859750032 859689474 859568596 859542072 859630704 859683514 859612226
2080.4H59612226o7114Q4877J60217L8803q9348j0609J40845J02580n8413r1135N2929
$$ 859612226 859545112 859629989 859790206 859829009 859739661 859729052 859869897 859972477 859914064 859822929 859875858
2102.9H59875858J51992L4332j12891n8353J07407J30654j9670j08480K3067J76489
$$ 859875858 860027850 860062182 859949291 859890938 859998345 860128999 860109329 860000849 860023916 860200405
2123.3H60200405P2539j31488j09136P2181J31607R537r4950l457J37567P2122j20819
$$ 860200405 860272944 860141456 860032320 860104501 860236108 860245645 860150695 860147238 860284805 860356927 860236108
2145.7H60236108j50144K8908J32800L0100o8843q35J29163J15276n1081j33694j3888
$$ 860236108 860085964 860114872 860247672 860277772 860208929 860208094 860337257 860452533 860401452 860267758 860253870
2168.1H60253870J25111P6234o8188n9068Q5771J28150K504j10090n6207P1406P3910
$$ 860253870 860378981 860455215 860387027 860327959 860413730 860541880 860544384 860434294 860378087 860449493 860523403
2190.6H60523403j9968l9756L9875J00375J2755j24693q7440O2227P9811m8936j22964
$$ 860523403 860503435 860463679 860503554 860603929 860616684 860491991 860404551 860466778 860546589 860497653 860374689
2213H60374689k6524J04010O5446q1837j04129K3365R2506j8060j47283q9228O1094
$$ 860374689 860348165 860452175 860517621 860435784 860331655 860355020 860447526 860429466 860282183 860192955 860254049
2235.4H60254049N5135j08898j82510m6849R4354J9908j41501j28448K0504O3240o8605
$$ 860254049 860309184 860200286 860017776 859970927 860065281 860085189 859943688 859815240 859835744 859898984 859830379
2257.9H59830379j83045j13011K5571K265j39058j36077L5047J17421j8000j69933
$$ 859830379 859647334 859534323 859559894 859562159 859423101 859287024 859322071 859439492 859421492 859251559
2278.3H59251559j10865K9326j0789j84595k35320q5175K5809q4638k44737k34544
$$ 859251559 859140694 859170020 859159231 858974636 858739316 858654141 858679950 858595312 858350575 858116031
2298.7H58116031q6308o2585k58743l78430k54512r7573j38402l44694m50968l60191
$$ 858116031 858029723 857967138 857708395 857329965 857075453 856977880 856839478 856494784 856043816 855683625
2319.1H55683625k75553l44276m18305l04759j18971j12057k77996l51965k07663p7545
$$ 855683625 855408072 855063796 854645491 854340732 854221761 854109704 853831708 853479743 853272080 853194535
2339.5H53194535j06812l397M39167O24955J30951n95331j019836r19819n03540j64807
$$ 853194535 853087723 853084326 853523493 854148448 854279399 853684068 852664232 851744413 851240873 851076066
2359.9H51076066r8407M0412M05133O12974N10752L84927M45128N56349N19634L68535
$$ 851076066 850977659 851018071 851423204 852036178 852546930 852931857 853376985 853933334 854452968 854821503
2380.2H54821503K65718K58743J89722p749j41441j11223m6253o2704j35064j43826
$$ 854821503 855087221 855345964 855535686 855527937 855386496 855275273 855229020 855166316 855031252 854887426
2400.6H54887426q1539o2764j06633j55389j49250r2566n7518q5950j42873j33693
$$ 854887426 854805887 854743123 854636490 854481101 854331851 854239285 854181767 854095817 853952944 853819251
2421H53819251o9916o5446j22368j61529j54734j06752p2538j09733j54018j30296
$$ 853819251 853749335 853683889 853561521 853399992 853245258 853138506 853065968 852956235 852802217 852671921
2441.4H52671921p8797q5294j58847j98483j51754r5546r6261j40846j47164r0063
$$ 852671921 852593124 852507830 852348983 852150500 851998746 851903200 851806939 851666093 851518929 851428866
2461.8H51428866p9929j63317k27690j77085q3745q6903j85788k21074j23977n1439
$$ 851428866 851348937 851185620 850957930 850780845 850697100 850610197 850424409 850203335 850079358 850027919
2482.2H50027919j41025k86102k75731j16646n1320j73330k68340j67549k2531p3552
$$ 850027919 849886894 849600792 849325061 849208415 849157095 848983765 848715425 848547876 848525345 848451793
2502.6H48451793k72989l20554j26898K5630q0705k57134k13862l8862l5882k31147
$$ 848451793 848178804 847858250 847731352 847756982 847676277 847419143 847205281 847166419 847130537 846899390
2523H46899390l23355j49906K3604p3016k65062k27272k0683J6749j81616l03328j50024
$$ 846899390 846576035 846426129 846449733 846376717 846111655 845884383 845863700 845880449 845698833 845395505 845245481
2545.5H45245481K8491n5433k54154k38776l5703J6272j90080l44812k03073J3172
$$ 845245481 845273972 845218539 844964385 844725609 844689906 844706178 844516098 844171286 843968213 843981385
2565.8H43981385m1067k71559l15189j10388K3365j21892l20792k68042m0114K623
$$ 843981385 843940318 843668759 843353570 843243182 843266547 843144655 842823863 842555821 842515707 842518330
2586.2H42518330k12789l22163j47879J0311j18672l60191l50654r4533J8239j61827
$$ 842518330 842305541 841983378 841835499 841845810 841727138 841366947 841016293 840921760 840939999 840778172
2606.6H40778172l24428k28942n4895r7931l19123l74794j61469k4855j70887l52382
$$ 840778172 840453744 840224802 840169907 840071976 839752853 839378059 839216590 839191735 839020848 838668466
2627H38668466l12627j42395j28985l00288l55482j88887o4612j61290l19838k97725
$$ 838668466 838355839 838213444 838084459 837784171 837428689 837239802 837175190 837013900 836694062 836396337
2647.4H36396337j34826j02937k76566m27961l40343j36137j29342l02195l52681k05457
$$ 836396337 836261511 836158574 835882008 835454047 835113704 834977567 834848225 834546030 834193349 833987892
2667.8H33987892r1195j86146l20196k42889n8174l6001j99974k82228j17898N8353
$$ 833987892 833896697 833710551 833390355 833147466 833089292 833053291 832853317 832571089 832453191 832511544
2688.2H32511544o020j91510k15649o4969j0610j48892k53022j80125p1407j41501
$$ 832511544 832505524 832314014 832098365 832033396 832022786 831873894 831620872 831440747 831369340 831227839
2708.6H31227839l49998m10855k57731j49190k33233l49522l06845j68859j98663m04596
$$ 831227839 830877841 830466986 830209255 830060065 829826832 829477310 829170465 829001606 828802943 828398347
2729H28398347m47869k36631l2902o0558k52485k93613j25110m8756j96875l65376
$$ 828398347 827950478 827713847 827680945 827620387 827367902 827074289 826949179 826900423 826703548 826338172
2749.4H26338172l33369j56402j24216l16084m21286k77519j49548k60114m42684m12047
$$ 826338172 826004803 825848401 825724185 825408101 824986815 824709296 824559748 824299634 823856950 823444903
2769.8H23444903k16901j75238m01199o08742n43237m01020m51207n82039n71073m62770
$$ 823444903 823228002 823052764 822651565 822042823 821499586 821098566 820647359 820065320 819494247 819031477
2790.2H19031477m43339n73278o95944o86705o56068p15852q74936r83596r02713q65578
$$ 819031477 818588138 818014860 817318916 816632211 815976143 815260291 814385355 813401759 812499046 811633468
2810.6H11633468j079142j331866j432002j472711j647950k036154k485692k821327
$$ 811633468 810554326 809222460 807790458 806317747 804669797 802633643 800147951 797326624
2826.9G97326624l099918l503323m102170m849017n940199q014619j1437774j5773058
$$ 797326624 794226706 790723383 786621213 781772196 775831997 767817378 756379604 740606546
2843.2G40606546k0163893k3485661k4246096k0770967j2394190j075924R296656J5580296
$$ 740606546 720442653 696956992 672710896 651939929 639545739 638469815 647766471 663346767
2859.5F63346767J7081917J5075087J1213064O883026L637552K701282L516794M233837
$$ 663346767 680428684 695503771 706716835 713599861 717237413 719938695 723455489 727689326
2875.9G27689326L793239K371729O14643r75013k352953l621399m710794n468905n916476
$$ 727689326 731482565 733854294 734468937 733493924 731140971 727519572 722808778 717339873 711423397
2894.2G11423397o355226o982446p636547q236348r034634j0270894j1964440j4055014
$$ 711423397 705068171 698085725 690449178 682212830 673178196 662907302 650942862 636887848
2910.5F36887848j6496658j9046366k0921946k0942092j8311202j3183415o587505
$$ 636887848 620391190 601344824 580422878 559480786 541169584 527986169 521398664
2924.8E21398664K16603O256163J1024654J4615178J7091632J8201411J7999112J6820133
$$ 521398664 521615267 527871430 538896084 553511262 570602894 588804305 606803417 623623550
2941.1F23623550J4709055J1562527P719934M024326J310110l2901J13785J621962
$$ 623623550 638332605 649895132 657615066 661639392 662949502 662916601 663030386 664652348
2957.4F64652348L904044O254971Q176089R445250J0040938R989560R384096Q345067
$$ 664652348 668556392 674811363 682987452 692432702 702473640 712463200 721847296 730192363
2973.8G30192363P151127O262303N643725M822135L844798L087878K538502J945794
$$ 730192363 737343490 743605793 749249518 754071653 757916451 761004329 763542831 765488625
2990.1G65488625J022517k53856j408100k236843k819419k946198k492666j442254
$$ 765488625 766511142 766257286 764849186 762612343 759792924 756846726 754354060 752911806
3006.4G52911806J49846J842201L089368L762007M034758L883421L275275K525091
$$ 752911806 753061652 754903853 757993221 761755228 765789986 769673407 772948682 775473773
3022.7G75473773J905323J398325R91344O77228M19497K05815M7326k2888j15394k66970
$$ 775473773 777379096 778777421 779768765 780445993 780865490 781071305 781118631 781095743 780980349 780713379
3043.1G80713379l70085l99947m11093m91381n50330m74333m73202o07609n97835l76821
$$ 780713379 780343294 779943347 779532254 779040873 778490543 778016210 777543008 776935399 776337564 775960743
3063.5G75960743j58131j93655m10795l96550j06216J45734J49905q9228k47776j70887
$$ 775960743 775802612 775608957 775198162 774801612 774695396 774841130 774991035 774901807 774654031 774483144
3083.9G74483144j48356k30968k43246j82033j07288j08302j62780j60277j34408j64927
$$ 774483144 774334788 774103820 773860574 773678541 773571253 773462951 773300171 773139894 773005486 772840559
3104.3G72840559k22265k73526k95162j99497j08600k33888m10378m98414o31333p58290
$$ 772840559 772618294 772344768 772049606 771850109 771741509 771507621 771097243 770598829 769967496 769209206
3124.7G69209206p29203n81563m86254n66185p17521p23779o44743p28429r26435j008391
$$ 769209206 768480003 767898440 767412186 766846001 766128480 765404701 764759958 764031529 763105094 762096703
3145.1G62096703q90255o61910o01708r13859j244426j190006j023233j053691j154959
$$ 762096703 761206448 760544538 759942830 759028971 757784545 756594539 755571306 754517615 753362656
3163.4G53362656j156927j068532j060247j197815j288772j220167j142978j236558
$$ 753362656 752205729 751137197 750076950 748879135 747590363 746370196 745227218 743990660
3179.8G43990660j416683j414896j242518j180053j327395j471341j417816j281023
$$ 743990660 742573977 741159081 739916563 738736510 737409115 735937774 734519958 733238935
3196.1G33238935j272201j379252j407504j308024j238882j306832j410842j384675
$$ 733238935 731966734 730587482 729179978 727871954 726633072 725326240 723915398 722530723
3212.4G22530723j275003j277328j410246j485169j411378j320064j344621j411915
$$ 722530723 721255720 719978392 718568146 717082977 715671599 714351535 713006914 711594999
3228.7G11594999j363933j291812j460135j707971j722455j612782j526237j477718
$$ 711594999 710231066 708939254 707479119 705771148 704048693 702435911 700909674 699431956
3245F99431956j572430j749516j726925j564324j577735j742423j770794j636326j534284
$$ 699431956 697859526 696110010 694383085 692818761 691241026 689498603 687727809 686091483 684557199
3263.4F84557199j523017j485050j324773j259685j397788j485705j389027j207829
$$ 684557199 683034182 681549132 680224359 678964674 677566886 676081181 674692154 673484325
3279.7F73484325j104414j084447j051068r49741p80224p25449q80479j005829r70065
$$ 673484325 672379911 671295464 670244396 669294655 668514431 667788982 666908503 665902674 664932609
3298F64932609q51572p04229o11543o77646q62896j004458j044571j016319r50694
$$ 664932609 664081037 663376808 662765265 662087619 661224723 660220265 659175694 658159375 657208681
3316.4F57208681r02474r06884r49204j007617j103401j214266j289070j341164j327872
$$ 657208681 656306207 655399323 654450119 653442502 652339101 651124835 649835765 648494601 647166729
3334.8F47166729j238048j275659j490175j658678j692057j606167j527369j702368
$$ 647166729 645928681 644653022 643162847 641504169 639812112 638205945 636678576 634976208
3351.1F34976208k001226k052784j881361j787424j884579j967788j831114j704216
$$ 634976208 632974982 630922198 629040837 627253413 625368834 623401046 621569932 619865716
3367.4F19865716j908958k227664k197564j887500j708925j690686j668751j578570
$$ 619865716 617956758 615729094 613531530 611644030 609935105 608244419 606575668 604997098
3383.7F04997098j421630j231968j057923j078189j277208j278102r73225p76410r96053
$$ 604997098 603575468 602343500 601285577 600207388 598930180 597652078 596678853 595902443 594906390
3402.1E94906390j267553j151085q70645p24434o59407o67572p05003o09816m40776
$$ 594906390 593638837 592487752 591617107 590892673 590233266 589565694 588860691 588250875 587810099
3420.4E87810099l08394k00868r0718N7339J67072K80857M05491L17633J54614K60830
$$ 587810099 587501705 587300837 587210119 587267458 587434530 587715387 588120878 588438511 588593125 588853955
3440.8E88853955N33402P03693P33018P43210Q46803R50635R64760J023293J196444
$$ 588853955 589387357 590091050 590824068 591567278 592414081 593364716 594329476 595352769 596549213
3459.2E96549213J266301J230120J353801J529634J404047J104593J096904J328886
$$ 596549213 597815514 599045634 600399435 601929069 603333116 604437709 605534613 606863499
3475.5F06863499J513481J576721J498819J435816J540840J628637J599848J583398
$$ 606863499 608376980 609953701 611452520 612888336 614429176 616057813 617657661 619241059
3491.8F19241059J608252J660169J676142J667738J665711J567602J494468J621663
$$ 619241059 620849311 622509480 624185622 625853360 627519071 629086673 630581141 632202804
3508.1F32202804J751721J774371J752674J697302J720309J880288K074779K027571
$$ 632202804 633954525 635728896 637481570 639178872 640899181 642779469 644854248 646881819
3524.4F46881819J836717J846075J918197J970768K147078K188981K006709K054215
$$ 646881819 648718536 650564611 652482808 654453576 656600654 658789635 660796344 662850559
3540.8F62850559K331674K417028K117753J837611J957476K141774K139807K152025
$$ 662850559 665182233 667599261 669717014 671554625 673512101 675653875 677793682 679945707
3557.1F79945707K258778K322376K303183K423405K646745K446770K125860K250611
$$ 679945707 682204485 684526861 686830044 689253449 691900194 694346964 696472824 698723435
3573.4F98723435K510429K601981K702951K834261K903879K957105K856076K547979
$$ 698723435 701233864 703835845 706538796 709373057 712276936 715234041 718090117 720638096
3589.7G20638096K444566K665221K782166K709508K693415K661943K546788K530992
$$ 720638096 723082662 725747883 728530049 731239557 733932972 736594915 739141703 741672695
3606G41672695K699852K729773K598226K451420K228439K300680K426386K018988J655340
$$ 741672695 744372547 747102320 749700546 752151966 754380405 756681085 759107471 761126459 762781799
3624.4G62781799J840532K441406K277911J431524J257778J385867J469314J542986
$$ 762781799 764622331 767063737 769341648 770773172 772030950 773416817 774886131 776429117
3640.7G76429117J423299J298428J555860J969635J426339L74019L73006R95100J012564
$$ 776429117 777852416 779150844 780706704 782676339 784102678 784476697 784849703 785844803 786857367
3659G86857367O28411M10974M34757O77168J008153Q52466M01556N08666L98815J0609
$$ 786857367 787485778 787896752 788331509 789008677 790016830 790869296 791270852 791779518 792178333 792188942
3679.4G92188942R4951L33488O83426J271129J247227L20614p2897J68324L13401L34024
$$ 792188942 792283893 792617381 793300807 794571936 795819163 796139777 796066880 796235204 796548605 796882629
3699.8G96882629L84689K66313J38164K82466M97043M78983J21594j16468m3809R8169
$$ 796882629 797267318 797533631 797671795 797954261 798451304 798930287 799051881 798935413 798891604 798989773
3720.2G98989773J78098J63854N3644r3579P1346N71251P64191L78132j89900m62592
$$ 798989773 799167871 799331725 799385369 799291790 799363136 799934387 800698578 801076710 800886810 800424218
3740.6H00424218n7876N18859P8916l27229N8710Q5592k91645k86281k8849j0252j41203
$$ 800424218 800366342 800885201 800964117 800636888 800695598 800781190 800489545 800203264 800174415 800164163 800022960
3763.1H00022960o8903J8835R1910O9976j63674k04683N4241K01046q0824k96116j74284
$$ 800022960 799954057 799972892 800064802 800134778 799971104 799766421 799820662 800021708 799940884 799644768 799470484
3785.5G99470484p5757j3113L9637J5557O3359Q1182J36733K54452j15156k86460n3108
$$ 799470484 799394727 799381614 799421251 799436808 799500167 799581349 799718082 799972534 799857378 799570918 799517810
3807.9G99517810j71601l05713n1200L43025K60710R8646r060l87370l56675j23202
$$ 799517810 799346209 799040496 798989296 799332321 799593031 799691677 799682617 799295247 798938572 798815370
3828.3G98815370k9743P8320J32859K45094K36094j67310l98457l25560k67327k25842
$$ 798815370 798785627 798863947 798996806 799241900 799477994 799310684 798912227 798586667 798319340 798093498
3848.7G98093498o3777M41551M67002l48031n48422k07901R1850P8023j65582q1599
$$ 798093498 798029721 798471272 798938274 798590243 798041821 797833920 797925770 798003793 797838211 797756612
3869.1G97756612Q7321j16587k68340k60472k4915J39416M4524Q9228j50680l59714
$$ 797756612 797843933 797727346 797459006 797198534 797173619 797313035 797357559 797446787 797296107 796936393
3889.5G96936393p2241n2273k42234p2777J47641R6679l5048k23875m15027l36588
$$ 796936393 796864152 796811879 796569645 796496868 796644509 796741188 796706140 796482265 796067238 795730650
3909.9G95730650j39296m6253M8757O9976o8546j38819q8632q8155j14501k5272N1081
$$ 795730650 795591354 795545101 795593858 795663834 795595288 795456469 795367837 795279682 795165181 795139909 795190990
3932.3G95190990r3401k51710j90496l5108M6909l1054j18673p8618r1732j58250j57595
$$ 795190990 795097589 794845879 794655383 794620275 794667184 794636130 794517457 794438839 794347107 794188857 794031262
3954.8G94031262j02162k7955j370n2035j20163r7513k0206j1445n3763j08659j20461
$$ 794031262 793929100 793901145 793899775 793847740 793727577 793630064 793609858 793598413 793544650 793435991 793315530
3977.2G93315530k5273M0412k2769j17600j31785o0082k8491n1200l3677l9220
$$ 793315530 793290257 793330669 793307900 793190300 793058515 792998433 792969942 792918742 792885065 792845845
3997.6G92845845
$$ 792845845
##END=$$ End of the data block
