##TITLE=Lut 1P1 $$ Begin of the data block
##JCAMP-DX=5.00 $$ ACD/SpecManager v 10.08
##SPECTROMETER/DATA SYSTEM=Alpha
##DATE=09 Oct 2014 07:06:54
##DATA TYPE=INFRARED SPECTRUM
##DATA CLASS=XYDATA
##ORIGIN=
##OWNER=
##NPOINTS=1765
##FIRSTX=399.76428223
##LASTX=3997.64306641
##MAXX=3997.64306641
##MINX=399.76428223
##MAXY=0.86311680
##MINY=0.44761869
##XFACTOR=1.0000000000
##YFACTOR=1.000000000000000e-9
##FIRSTY=0.77210456
##DELTAX=2.03961372
##XUNITS=1/CM
##YUNITS=ARBITRARY UNITS
##XYDATA=(X++(Y..Y))
399.8G72104561M151583K976120l223956n583525n74231L416360n33939o558776n420804
418.1G60753393L031731L616869l269613n108654M32610M122675J9908n369783l262639
436.5G54966497K675951K334058l661453n301595K08199L612697o94990n913019l976345
454.8G44250000J907289K852141k466142m616022j77681L396213J32084m841864l100694
473.2G37335324K807081L187060j974582m551292o75022L335833P70390l954530l066897
491.5G33213365J902044K782762j797974m710436j530528K596617Q15510l667116l509044
509.9G26095200Q14735K250314j568019m490435j690030K129078J049697k876937l244162
528.3G18469441L34501K243817k47598l197133k032936J214862J449168j501143k890945
$$ y = [772104561, 776256144, 779232264, 776008308, 770424783, 769850552, 773266912, 772732973, 766174197, 760753393, 763785124, 767401993, 764132380, 759023726, 759456336, 763579011, 763598919, 758229136, 754966497, 757642448, 759976506, 756315053, 751013458, 751221657, 754834354, 754139364, 748226345, 744250000, 746157289, 749009430, 746543288, 741927266, 741749585, 745145798, 745277882, 740436018, 737335324, 740142405, 743329465, 741354883, 736803591, 736128569, 739464402, 740234792, 736280262, 733213365, 735115409, 737898171, 736100197, 731389761, 729859233, 732455850, 733271360, 729604244, 726095200, 726909935, 729160249, 727592230, 723101795, 721411765, 723540843, 724590540, 721713603, 718469441, 718803942, 721047759, 720800161, 717603028, 715570092, 716784954, 718234122, 716732979, 713842034]
546.6G13842034n36084J900137O63101k229631k063512R03129J944840m29988k502322
565G11491704j170993J479030J328230j223147k057314R3639J671135J38819k013504
583.3G09737599j484454Q06868J205981r05394k201796q19087J026809O29544j285195
601.7G06710875j622617J35481J242042J09911j481355j161515O22034J420438L63112
620G06338406m98891N57005K118349J868189J93595m12225Q90791J970172J014710
638.4G14040101n59688m21584J048088J425326l0756j146257k62081J149594Q78513
656.8G16121256n46455p56323N62489J015305m95791j175285Q89778K008021J770437
675.1G19393432M63486m37915M05490J700640J379907j55688n56707O37770J296758
$$ y = [713842034, 713305950, 715206087, 715869188, 713639557, 711576045, 712479174, 714424014, 713994026, 711491704, 710320711, 711799741, 713127971, 711904824, 709847510, 709941149, 711612284, 711751103, 709737599, 708253145, 709060013, 710265994, 709360600, 707158804, 706339717, 707366526, 707996070, 706710875, 705088258, 705223739, 706465781, 706575692, 705094337, 703932822, 704554856, 705975294, 706338406, 705839515, 706396520, 708514869, 710383058, 710576653, 710164428, 711055219, 713025391, 714040101, 713480413, 713058829, 714106917, 715532243, 715501487, 714355230, 714093149, 715242743, 716121256, 715574801, 714818478, 715380967, 716396272, 715900481, 714725196, 715614974, 717622995, 719393432, 719856918, 719419003, 719824493, 721525133, 722905040, 722749352, 722192645, 722830415, 724127173]
693.5G24127173J81497j120866n17130J368046K068997R90808J60992J007378K224862
711.8G30491757J902283M99308J12116J445174K816439K581775J687229J995385L199458
730.2G46730924L165006J497627L14653R00864J963258J716554O57082P67767K185464
748.5G59899199K848804J728535L85165O51181J797855J667976K25306m40658N24879
766.9G69288242J510143J066625m112J10089J504898K260685J451016O68526J470625
785.3G79326737K845049K755821J387417R00149J936794K684772J753747L43204L92556
803.6G94326246J575053J971244J069546N28395J522243K814710K638758J401603R94623
822H08842421J764118J995802P37488o15537m37617O22928P31170j22189k07961J128614
$$ y = [724127173, 724308670, 723187804, 722670674, 724038720, 726107717, 727098525, 727259517, 728266895, 730491757, 732394040, 732893348, 733005464, 734450638, 737267077, 739848852, 741536081, 743531466, 746730924, 749895930, 751393557, 751708210, 752609074, 754572332, 756288886, 756945968, 757713735, 759899199, 762748003, 764476538, 764861703, 765512884, 767310739, 768978715, 769204021, 768763363, 769288242, 770798385, 771865010, 771860898, 771970987, 773475885, 775736570, 777187586, 777856112, 779326737, 782171786, 784927607, 786315024, 787215173, 789151967, 791836739, 793590486, 793933690, 794326246, 795901299, 797872543, 798942089, 799470484, 800992727, 803807437, 806446195, 807847798, 808842421, 810606539, 812602341, 813339829, 812724292, 812286675, 812909603, 813640773, 813518584, 813310623, 814439237]
842.4H14439237K348483J970470Q31425P36236J692296K018928J017630Q7679N19037
860.7H25661421J396000J041830l70264j013339k46346L43621l66449j240015p80344
879.1H24426115M29093O15538l69609q78990o3478Q33272M02272p47740q95977J25170
899.5H23875666O90996l7372q21829l07321Q33273R39846p7605o48618j1564N92411
919.9H25027883r3102j242519j224577k27630J02162p60615j509607j024186o8605
938.2H18979204k49684j537979k184391j433134p13766j379013k588570k755999k064169
956.6H04072499k143979l475010m549504m152178l192723l238618m115403m332066
972.9G74873018l429651k747655l364742m350483m185557l116072k735197l519416
$$ y = [814439237, 816787720, 818758190, 819589615, 820325851, 822018147, 824037075, 825054705, 825142384, 825661421, 827057421, 828099251, 827728987, 826715648, 826469302, 826812923, 826446474, 825206459, 824426115, 824855208, 825470746, 825101137, 824222147, 824158669, 824991941, 825394213, 824646473, 823750496, 823875666, 824566662, 824529290, 823707461, 823400140, 824233413, 825173259, 825095654, 824447036, 824435472, 825027883, 824934781, 823692262, 822467685, 822240055, 822342217, 821581602, 820071995, 819047809, 818979204, 818729520, 817191541, 815007150, 813574016, 812860250, 811481237, 808892667, 806136668, 804072499, 801928520, 798453510, 793904006, 789751828, 786559105, 783320487, 779205084, 774873018, 771443367, 768695712, 765330970, 760980487, 756794930, 753678858, 750943661, 747424245]
989.2G47424245m171908l622592k694487k844036l910660m415155l831685l374040
1005.5G18559682m111945n254507n320669m376232l870189m369855m800022m216552
1021.8F82239711l256559l189087l906131m008591k952337j923084k053679k773404
1038.2F58176839k820789k147973j872659k529681l224968k947390k083004j826644
1054.5F38723731k387643k660990j971066j157999j273393j969457k020121j129686
1070.8F24153376k80321j87099k13623O16789K083838L000438K920151K745628L304064
1089.2F38143241M124761M231811L664732L471493M112542M613459L984988K750814
1105.5F69097841K138436K231121J969993Q97646J7881L87073J507997K041579J662075
$$ y = [747424245, 743252337, 739629745, 736935258, 734091222, 730180562, 725765407, 721933722, 718559682, 714447737, 709193230, 703872561, 699496329, 695626140, 691256285, 686456263, 682239711, 678983152, 675794065, 671887934, 667879343, 664927006, 663003922, 660950243, 658176839, 655356050, 653208077, 651335418, 648805737, 645580769, 642633379, 640550375, 638723731, 636336088, 633675098, 631704032, 630546033, 629272640, 627303183, 625283062, 624153376, 623873055, 623685956, 623472333, 624089122, 626172960, 629173398, 632093549, 634839177, 638143241, 642268002, 646499813, 650164545, 653636038, 657748580, 662362039, 666347027, 669097841, 671236277, 673467398, 675437391, 676335037, 676352918, 676739991, 678247988, 680289567, 681951642]
1123.8F81951642J353979J801372K257347J549899k9862r29296o37054k70247o00279
1142.2F86447501r02891k22802J097619J830638J605034J438260K216220L364742L723800
1160.5G00598121L328561L333331M190564M979312M884124M470170M848718N892217
1176.9G36525118O213487N168855L858089L537774L859043L445626K011716Q39830
1193.2G65459538P71820R00328N365j526475k255202j811981j427472k066135l000855
1211.5G55048931k975643k202332k045393k884626l580094l195345k376437k345741
1227.9G33443320l026545l157556k242148j269639j186013j499593j054228K12551
1244.2G20220149J130104R77039N07653P60019J506447J601160Q22782L35873R42647
$$ y = [681951642, 683305621, 685106993, 687364340, 688914239, 688884377, 687955081, 687318027, 687047780, 686447501, 685544610, 685321808, 686419427, 688250065, 689855099, 691293359, 693509579, 696874321, 700598121, 703926682, 707260013, 711450577, 716429889, 721314013, 725784183, 730632901, 736525118, 742738605, 747907460, 751765549, 755303323, 759162366, 762607992, 764619708, 765459538, 766231358, 767131686, 767137051, 765610576, 763355374, 761543393, 760115921, 758049786, 755048931, 752073288, 749870956, 747825563, 744940937, 741360843, 738165498, 735789061, 733443320, 730416775, 727259219, 725017071, 723747432, 722561419, 721061826, 720007598, 720220149, 721350253, 722327292, 722834945, 723594964, 725101411, 726702571, 727525353, 727861226, 728803873]
1262.5G28803873J834989J795888R63807N58555J020074J262724M52042o08921o02186
1280.9G35480845L81172R06467L07977m20034k38180L54767J78814q54015j526118
1299.2G34571695j084983l81112n80907j360536j433491n47767L01957K61247l2425
1317.6G29713678O66798J941859K265930J400829M99725M59969O87599j609j464009
1336G36170769k196491j077294M80413M77612l47614l99649L78310P28846L6538q11935
1356.4G33439505j047611j169384j655340k450228l277778l189802k272487k542794
1372.7G15834081l649115l614366k962590k920687l724456m461884l828287j872301
1389F88800395j143635k435148l359377k200782l73185O26206M61400P27832K008438
$$ y = [728803873, 730638862, 732434750, 733398557, 733957112, 734977186, 736239910, 736691952, 736083031, 735480845, 735862017, 736768484, 737076461, 736656427, 736418247, 736773014, 736951828, 736097813, 734571695, 733486712, 733105600, 732524693, 731164157, 729730666, 729182899, 729484856, 729746103, 729713678, 730380476, 732322335, 734588265, 735989094, 736488819, 736948788, 737636387, 737634778, 736170769, 733974278, 732896984, 733377397, 733855009, 733507395, 733107746, 733486056, 734214902, 734251440, 733439505, 732391894, 731222510, 729567170, 727116942, 723839164, 720649362, 718376875, 715834081, 712184966, 708570600, 705608010, 702687323, 698962867, 694500983, 690672696, 688800395, 687656760, 685221612, 681862235, 679661453, 679288268, 679914474, 680375874, 681103706, 683112144]
1407.3F83112144K566636K021551J030326K30432M53829K340913L075242J979232J406551
1425.7F98216856R20414n8472j142561k422869l184915j592398j25646p98583j538575
1444.1F88273251j400769n85913o3122q23438j819670q32975L893614N640447L534794
1462.4F95816219K820730M698634N806864N720078P179320Q738458P520199M512310
1478.7G42812812Q61645j930237l891170o239176q694112r189844q135438r361565
1495F96232915j1669874j0934472r260595r221792j2187779j4937878r410858o594956
1511.4F12014711p408798p563710o570220n278409m725992l151596k209008k544701
1527.7E72562277k692043l193439k794802j530170k362609l375948J41383L321707
$$ y = [683112144, 685678780, 687700331, 688730657, 688961089, 689414918, 691755831, 694831073, 696810305, 698216856, 699137270, 699078798, 697936237, 695513368, 692328453, 690736055, 690610409, 689811826, 688273251, 686872482, 686286569, 686223447, 685400009, 683580339, 682747364, 686640978, 692281425, 695816219, 698636949, 703335583, 709142447, 714862525, 722041845, 730780303, 738300502, 742812812, 743674457, 741744220, 737853050, 731613874, 722919762, 713729918, 705594480, 696232915, 684563041, 673628569, 664367974, 655146182, 642958403, 628020525, 618609667, 612014711, 604605913, 597042203, 590471983, 585193574, 580467582, 577315986, 575106978, 572562277, 569870234, 566676795, 563881993, 562351823, 559989214, 556613266, 556754649, 560076356]
1544E60076356L650188K938807K685547L190577L319621K333165L105521Q312285P865369
1562.4E97477436N698025M719079M089534M994393M825592L421843L745913M229367
1578.7F33201182L263771K444387J767874P27057k14815p20501j082718j775444k599835
1597F35010958l323734l920257m494965n491138o866574p982910q415699r138584j1683106
1615.4E73693991j3932467j1722505j1919200j5394569j5699446j4199018j2067676
1629.7D78759110q704096p191300o614864l236056j050055j069367j591086j683593
1646D47618693P45Q46267L75390K818942M732192L871619L656835M664182N821884
1664.3D74406749N151629N072266O935239P317275P435828Q386255P741749O354928
$$ y = [560076356, 563726544, 566665351, 569350898, 572541475, 575861096, 578194261, 581299782, 589612067, 597477436, 603175461, 607894540, 611984074, 616978467, 621804059, 625225902, 628971815, 633201182, 636464953, 638909340, 640677214, 641404271, 641189456, 640468955, 639386237, 637610793, 635010958, 631687224, 627766967, 623272002, 617780864, 610914290, 602931380, 594515681, 585377097, 573693991, 559761524, 548039019, 536119819, 520725250, 505025804, 490826786, 478759110, 470055014, 462863714, 456248850, 453012794, 451962739, 450893372, 449302286, 447618693, 447619438, 448465705, 448841095, 451660037, 456392229, 460263848, 463920683, 468584865, 474406749, 479558378, 484630644, 491565883, 498883158, 506318986, 514705241, 522446990, 528801918]
1680.7E28801918O524682J0482848J1902511J0503471J0925054J0272444J1349082
1694.9F00762010J4026582J5515447J8885850J5795768J2166917J2315869J0920287
1709.2G00388730Q438348N844891M095793N476415P679463O182253L780961K402365
1725.5G44289219J325608J48058j564324l293574k565920k167821l630221l690005
1741.9G28851020k162158N36L373742Q209825J2095094J1726617J0881484J0595858
1758.2G83572018Q679986P021785N637407L986597K724946J561582J618981L197193
1774.5H18000495L438414K430021J532197J191974J394987J778245J075924m08829
1790.8H30433428P5400J969636K106011J052498N71132J088321J555562J281023M76778
$$ y = [528801918, 535326600, 545809448, 557711959, 568215430, 579140484, 589412928, 600762010, 614788592, 630304039, 649189889, 664985657, 677152574, 689468443, 700388730, 708827078, 714671969, 718767762, 724244177, 731923640, 738105893, 741886854, 744289219, 745614827, 745762885, 744198561, 740904987, 738339067, 736171246, 732541025, 728851020, 726688862, 726689398, 730063140, 738272965, 750368059, 762094676, 772976160, 783572018, 792252004, 799273789, 804911196, 808897793, 811622739, 813184321, 814803302, 818000495, 821438909, 823868930, 825401127, 826593101, 827988088, 829766333, 830842257, 830433428, 830508828, 832478464, 834584475, 835636973, 836208105, 837296426, 838851988, 840133011, 840609789]
1809.2H40609789K17080Q52644J362741J218379O38962p0214k50102L76285M57882
1827.5H45413446K1816Q17775J596213J265108O84321k9385p73132m35412J141370
1845.9H49702120J398563N95272M38928P79272P49886J63555j38104K05278L10898
1864.2H54205668n17786r31859L96669J525224J230716M17650j57416r9897L55661
1882.6H56424630M51505j46449o33597O0320Q29577N86152J47939K1398K13802M44889
1903H58400166K10822l41952l47793L76820O88434n6803p30276k21551M33087N26727
1923.4H58937681L97443Q1718L9578L11196L05712o5505l48390l57687j85371J31846
1943.8H59248221J97947P5340K14398L46482R7632k39491k10643J24097K38359j73867
$$ y = [840609789, 840826869, 841679513, 843042254, 844260633, 844899595, 844829381, 844579279, 844955564, 845413446, 845435262, 846253037, 847849250, 849114358, 849798679, 849769294, 848996162, 848560750, 849702120, 851100683, 851695955, 852134883, 852914155, 853664041, 853827596, 853689492, 853894770, 854205668, 853687882, 852756023, 853152692, 854677916, 855908632, 856326282, 856168866, 856068969, 856424630, 856876135, 856729686, 856096089, 856156409, 856985986, 857572138, 857720077, 857741475, 857955277, 858400166, 858610988, 858269036, 857921243, 858298063, 858986497, 858929694, 858199418, 857977867, 858410954, 858937681, 859335124, 859416842, 859456420, 859767616, 860073328, 860007823, 859659433, 859301746, 859116375, 859248221, 859446168, 859521508, 859735906, 860082388, 860180020, 859940529, 859729886, 859853983, 860092342, 859918475]
1964.2H59918475n30839j15454M97103M39107n5134l31581j08182K29358J49608k54750
1984.6H59837711m04000j40667Q2254P4148n7280j17659J17003K77222m4167l77834
2005H59246731k03848K19881K56777k16424n70178k37048L10958K03371k87831l50774
2025.4H58371615N9903L14832L1411l89337l08216J40012K22683j72079m06444r7573
2045.8H57766807L34561K62022k24829l97742k7298K87771O5207l72588l48688J61231
2066.2H57506454L96967k384l77476j63675K86818K92301j42396l35633K0921L82423
2086.6H57864320J92166k37108k50399J58012L55840L2663l24368j48475L14712L67403
2106.9H58324766n5849l14176k9088L42250K28763j70887k01165J95205M01854R6322
$$ y = [859918475, 859387636, 859272182, 859769285, 860208392, 860153258, 859821677, 859713495, 859942853, 860092461, 859837711, 859433711, 859293044, 859375298, 859449446, 859392166, 859274507, 859391510, 859668732, 859624565, 859246731, 859042883, 859262764, 859519541, 859303117, 858732939, 858495891, 858806849, 859010220, 858722389, 858371615, 858431518, 858746350, 858777761, 858388424, 858080208, 858220220, 858442903, 858270824, 857864380, 857766807, 858101368, 858363390, 858138561, 857740819, 857713521, 858001292, 858066499, 857693911, 857345223, 857506454, 857903421, 857901037, 857523561, 857359886, 857646704, 857939005, 857796609, 857460976, 857481897, 857864320, 858056486, 857819378, 857568979, 857726991, 858082831, 858115494, 857791126, 857642651, 857957363, 858324766, 858268917, 857954741, 857925653, 858267903, 858496666, 858325779, 858124614, 858319819, 858721673, 858817995]
2127.3H58817995k59340j29700K49922L01838l2663k28226L3855L63767K65062r8884
2147.7H59283626j65701J45495L20613Q2016j83939n6625K88785L45349M5538j48594
2168.1H59956563M4047K93970K01583p1227r6500J74880L30627J27494j20342m4524
2188.5H60796571K05636K33054K1219q7082P1347K55048J77681l7789m8995J42276
2208.9H61728966K26200P5459q6009q524J84298J90675J9312n2631Q2731J89543R3281
2231.4H62643301l9875j2636J14679J27792J0133m5478K5153R5487L9756o9678n6863
2253.8H62831771O9023J24096K0326q5831l9995N4479L4094m8757o1810J0669Q3089
2276.2H62991154O8307K2233K2590J2517p5579j96993k30551j63734j14322j45912
$$ y = [858817995, 858558655, 858428955, 858678877, 858980715, 858948052, 858719826, 858753681, 859117448, 859382510, 859283626, 859117925, 859263420, 859584033, 859666049, 859482110, 859425485, 859714270, 860059619, 860105157, 859956563, 860000610, 860294580, 860496163, 860424936, 860328436, 860503316, 860833943, 860961437, 860841095, 860796571, 861002207, 861235261, 861256480, 861169398, 861240745, 861495793, 861673474, 861635685, 861586690, 861728966, 861955166, 862030625, 861944616, 861936092, 862120390, 862311065, 862330377, 862277746, 862360477, 862550020, 862643301, 862603426, 862590790, 862705469, 862833261, 862843394, 862797916, 862823069, 862918556, 862958312, 862888634, 862831771, 862900794, 863024890, 863045216, 862959385, 862919390, 862973869, 863007963, 862959206, 862897396, 862908065, 862991154, 863059461, 863081694, 863104284, 863116801, 863041222, 862844229, 862613678, 862449944, 862335622, 862189710]
2296.6H62189710k19166k51830k38061l09705m76063n72085n27382m31776m05967n53370
2317H58204305p75754p84040n97179n32865o82175p17998m34101j88648k57552l40521
2337.4H52893472k33829q7500J93656Q74996J133382J70291j205445j895964j689255
2355.8H50153804j158118n81801p4923L88383Q70646J238048J393377J407743J390219
2374.1H55027378J341521J222611J051664Q11100N12779K40385P8083M291n5671j23918
2394.5H60110223j67548j47403r9957j19388k08616k24888j14978k3544p3850j97827
2414.9H58732224k35260j81794j61827j96397k33829k00510q7977n5670j70470k73168
2435.3H56935322k40922j51992j39832k21550k67029j78695q3864j51574k93494k98142
$$ y = [862189710, 861970544, 861718714, 861480653, 861170948, 860694885, 860122800, 859595418, 859163642, 858757675, 858204305, 857428551, 856644511, 856047332, 855514467, 854832292, 854114294, 853680193, 853491545, 853233993, 852893472, 852659643, 852572143, 852765799, 853640795, 854774177, 854944468, 853739023, 851843059, 850153804, 848995686, 848413885, 848338962, 848727345, 849597991, 850836039, 852229416, 853637159, 855027378, 856368899, 857591510, 858643174, 859454274, 859967053, 860207438, 860285521, 860289812, 860234141, 860110223, 859942675, 859795272, 859695315, 859575927, 859367311, 859142423, 859027445, 859003901, 858930051, 858732224, 858496964, 858315170, 858153343, 857956946, 857723117, 857522607, 857434630, 857378960, 857208490, 856935322, 856694400, 856542408, 856402576, 856181026, 855913997, 855735302, 855651438, 855499864, 855206370, 854908228]
2455.7H54908228k01225j90616k78473l14891k34545j21772j24395k73943l65138k77281
2476.1H52525949j69992k15888l56674l68774j89185q1957k36570m20452l54230j63853
2496.5H49968374j50740l13819l90470k58446j10566j60575l34025l70860j96993p5817
2516.9H47606063j97590l74197l40403j34229n2810k18809l81946k89619q8334j03534
2537.3H45424592l05533l65078j90258l9578j31369l48567l64423j51694n9009k15113
2557.7H43253970l54946k62916p0333p8142k89202l89814k42889r9718k01285l78192
2578.1H40886533l37779j22488m9948k36393m25338l76463j71542j29283l29256m47988
2598.5H38260055l01183j13189j77622m22179n00560l18766j68145k79069m60028m23551
$$ y = [854908228, 854707003, 854516387, 854237914, 853923023, 853688478, 853566706, 853442311, 853168368, 852803230, 852525949, 852355957, 852140069, 851783395, 851414621, 851225436, 851143479, 850906909, 850486457, 850132227, 849968374, 849817634, 849503815, 849113345, 848854899, 848744333, 848583758, 848249733, 847878873, 847681880, 847606063, 847408473, 847034276, 846693873, 846559644, 846506834, 846288025, 845906079, 845616460, 845528126, 845424592, 845119059, 844753981, 844563723, 844524145, 844392776, 844044209, 843679786, 843528092, 843469083, 843253970, 842899024, 842636108, 842565775, 842487633, 842198431, 841808617, 841565728, 841466010, 841264725, 840886533, 840548754, 840426266, 840376318, 840139925, 839714587, 839338124, 839166582, 839037299, 838708043, 838260055, 837958872, 837845683, 837668061, 837245882, 836745322, 836426556, 836258411, 835979342, 835519314, 835095763]
2618.9H35095763k46525k03192l55124m82083m12404k60651k71499m32373m80949l43442
2639.3H31607521k24531k93970m53949m94361l75033k91645l95179n20110m56095k81572
2659.7H27821076k27630l60787m91500m22001k61485k58983m12881m61638k97010j68622
2680.1H24458539k66730m32074m29631k68101j93239l25977m40181l51488k16306k48014
2700.5H21286798m26591n21839m20928l28302m30524o05882o47664n23686m08769m73857
2720.9H16498756o18875o15596n12541n30779o23822o24240n09560l65734l69132n39481
2741.2H11188996o26981n09561l93271m80831o58929o72042n10812m19438n32866o80565
2761.6H05703700o70433n74112n53012o23823o81757o48380n90324o35505p67290q35002
$$ y = [835095763, 834849238, 834646046, 834290922, 833808839, 833396435, 833135784, 832864285, 832431912, 831950963, 831607521, 831382990, 831089020, 830635071, 830140710, 829765677, 829474032, 829078853, 828558743, 828102648, 827821076, 827593446, 827232659, 826741159, 826319158, 826057673, 825798690, 825385809, 824924171, 824627161, 824458539, 824191809, 823759735, 823330104, 823062003, 822868764, 822542787, 822102606, 821751118, 821534812, 821286798, 820860207, 820338368, 819917440, 819589138, 819158614, 818552732, 817905068, 817381382, 816972613, 816498756, 815879881, 815264285, 814751744, 814220965, 813597143, 812972903, 812463343, 812097609, 811728477, 811188996, 810562015, 810052454, 809659183, 809178352, 808519423, 807847381, 807336569, 806917131, 806384265, 805703700, 805033267, 804459155, 803906143, 803282320, 802600563, 801952183, 801361859, 800726354, 799959064, 799124062]
2782G99124062p76946o81460o70851p96377q97229q15690p26163q31962r97424r90510
2802.4G90939450r00984r34839j059592j154959j151502j100123j158774j342535j480818
2820.8G80655324j525044j630723j856804k092958k258777k397776k659917l210604
2837.1G63022721m160524n501389p099390q822680j0359287j0979950r837747o688356
2853.4F99573398k421558J427114L668964L978073K822519J017630o59645j526534
2869.7G07879961j275719l83854M39346R27091J034379P38621J24752o43313j399576
2888.1G07441688k052129k607465l071725l475070l852129m147470m407823m784763
2904.4F79043114n331516o035268o894768p942617r107232j0030389j0240316r386122
$$ y = [799124062, 798347116, 797665656, 796994805, 796198428, 795301199, 794485509, 793759346, 792927384, 791929960, 790939450, 790038466, 789103627, 788044035, 786889076, 785737574, 784637451, 783478677, 782136142, 780655324, 779130280, 777499557, 775642753, 773549795, 771291018, 768893242, 766233325, 763022721, 758862197, 753360808, 746261418, 737438738, 727079451, 716099501, 706261754, 699573398, 697151840, 698578954, 702247918, 706225991, 709048510, 710066140, 709406495, 707879961, 706604242, 706220388, 706659734, 707586825, 708621204, 709359825, 709484577, 708841264, 707441688, 705389559, 702782094, 699710369, 696235299, 692383170, 688235700, 683827877, 679043114, 673711598, 667676330, 660781562, 652838945, 643731713, 633701324, 623461008, 614074886]
2920.7F14074886p378876m605592j642167J083672L294766N032718O391227P225335
2937F23475969P489979P279396O521106N060196L060341J100421l57032j282215j560092
2955.4F50788069r67384L09825J838565L245235M362821N194724N731821N957425N843520
2973.8F82304621N488038N190313N003512M649221M142464L730297L422320L063917
2990.1G16994703K452969J601279Q54910L14116j84894n95390p68364o20484k02000
3008.4G19846845K45809M82381N16235N12362M48763J79291k47180o18637q13425r15408
3028.8G19637036j037657j154244j235425j255274j234234j316309j480817j528859
3045.1G09394217j454354j429081j510322j602173j562833j416207j351356j375616
$$ y = [614074886, 606696010, 602090418, 600448251, 601531923, 604826689, 609859407, 616250634, 623475969, 630965948, 638245344, 644766450, 649826646, 652886987, 653987408, 653630376, 652348161, 650788069, 649820685, 650130510, 651969075, 655214310, 659577131, 664771855, 670503676, 676461101, 682304621, 687792659, 692982972, 697986484, 702635705, 706778169, 710508466, 713930786, 716994703, 719447672, 721048951, 721903861, 722217977, 722033083, 721437693, 720669329, 720048845, 719846845, 720092654, 720575035, 721091270, 721603632, 722052395, 722231686, 721984506, 721365869, 720552444, 719637036, 718599379, 717445135, 716209710, 714954436, 713720202, 712403893, 710923076, 709394217, 707939863, 706510782, 705000460, 703398287, 701835454, 700419247, 699067891, 697692275]
3061.5F97692275j272678r98497q06272q24988q85606p92205n60403m23610n12422
3079.8F90615594o01112m97878l66032l37720l67344m02510l81350l18945l50892m96805
3100.2F86495006n57065m77612m64141o08087p97093q51631p81298p95960r51946j152277
3120.6F79057896j265466j250565j263201j374007j482665j514852j492918j517951
3136.9F67896271j633406j755178j803517j851559j944065j953185j895189j971364
3153.2F53088808k168417k263188k226055k183378k199173k276957k355754k365708
3169.6F35050178k346754k384127k470612k508998k429783k377809k460360k542138
3185.9F15529597k529025k458573k420544k465487k500534k436578k339542k280891
$$ y = [697692275, 696419597, 695421100, 694614828, 693789840, 692904234, 692112029, 691551626, 691128016, 690615594, 690014482, 689516604, 689150572, 688812852, 688445508, 688042998, 687661648, 687342703, 686991811, 686495006, 685937941, 685460329, 684996188, 684388101, 683591008, 682739377, 681958079, 681162119, 680210173, 679057896, 677792430, 676541865, 675278664, 673904657, 672421992, 670907140, 669414222, 667896271, 666262865, 664507687, 662704170, 660852611, 658908546, 656955361, 655060172, 653088808, 650920391, 648657203, 646431148, 644247770, 642048597, 639771640, 637415886, 635050178, 632703424, 630319297, 627848685, 625339687, 622909904, 620532095, 618071735, 615529597, 613000572, 610541999, 608121455, 605655968, 603155434, 600718856, 598379314, 596098423]
3202.2E96098423k286255k318263k307654k245247k192259k186060k165198k135218
3218.5E78262269k119004k139151k231956k279043k198041k107977k148092k318442
3234.8E60720563k416074k372384k378762k456188k479494k476752k549648k636075
3251.1E40955186k648115k625406k619743k621353k607048k584874k512276k367259
3267.5E20369112k219617k136826k081275j962483j765490j578033j490116j417458
3283.8E05717814j260579j107871r97067q66770p63774p07567o31243n36084m52310
3302.1D98394549l89546l56585l57539l76462l76434l46154l23265l20614l40312m01944
3322.5D94805694m40419m45724n00798n85556o48618o68645o71148p27981q33541r19223
$$ y = [596098423, 593812168, 591493905, 589186251, 586941004, 584748745, 582562685, 580397487, 578262269, 576143265, 574004114, 571772158, 569493115, 567295074, 565187097, 563039005, 560720563, 558304489, 555932105, 553553343, 551097155, 548617661, 546140909, 543591261, 540955186, 538307071, 535681665, 533061922, 530440569, 527833521, 525248647, 522736371, 520369112, 518149495, 516012669, 513931394, 511968911, 510203421, 508625388, 507135272, 505717814, 504457235, 503349364, 502352297, 501485527, 500721753, 500014186, 499382943, 498846859, 498394549, 498005003, 497648418, 497290879, 496914417, 496537983, 496191829, 495868564, 495547950, 495207638, 494805694, 494365275, 493919551, 493418753, 492833197, 492184579, 491515934, 490844786, 490116805, 489283264, 488364041]
3342.9D88364041r72331r74536r44972j016736j159966j183986j087606j062841j149803
3361.3D78811264j187593j096487j000076j046270j186610j208931j064241r45270
3377.6D70075786r22412r25242q65579p23064n58704m57972n23180o71804o59466m14103
3398D63354260k44886m44323p00027n89549l36051k38270k36421k73854k98262k21401
3418.4D59771216r9540K0057J99944M07517N23090N02438O08295Q31723P43479M22179
3438.8D63930398L69489O44625Q82655R96649J108766J181751J166791J169682J286238
3457.1D72737044J411915J357138J356661J653254J862586J619756J232177J252055
3473.4D84482586J545936J746059J721561J578658J664490J892030J914084J878113
$$ y = [488364041, 487391710, 486417174, 485472202, 484455466, 483295500, 482111514, 481023908, 479961067, 478811264, 477623671, 476527184, 475527108, 474480838, 473294228, 472085297, 471021056, 470075786, 469153374, 468228132, 467362553, 466639489, 466080785, 465622813, 465099633, 464427829, 463768363, 463354260, 463109374, 462665051, 461965024, 461375475, 461039424, 460801154, 460564733, 460290879, 459992617, 459771216, 459671676, 459691733, 459891677, 460299194, 460822284, 461324722, 461933017, 462764740, 463508219, 463930398, 464299887, 464944512, 465827167, 466823816, 467932582, 469114333, 470281124, 471450806, 472737044, 474148959, 475506097, 476862758, 478516012, 480378598, 481998354, 483230531, 484482586, 486028522, 487774581, 489496142, 491074800, 492739290, 494631320, 496545404, 498423517]
3489.8D98423517J950562J966238J969516J979411J944899J969993K034724J997173
3506.1E14236033K004027K262593K571642K519786K228797K155185K295434K492070
3522.4E32765567K492309K335250K504051K902746L019214K960801K945602K880096
3538.7E54805636K877772K931476K958238K990007L037572L099740L293097L466785
3555E79460323L403306L302395L149152K694190K459645L588080M967094M738748L986656
3573.4F11749589L773332L903866M087448M113793L693223L180802L706396M820287
3589.7F43028736M620493M013240M177332M488230M504561M517853M172266L430247
3606F76952958L375352L911137M076421M085064L799796L750861M792512N009889L592074
$$ y = [498423517, 500374079, 502340317, 504309833, 506289244, 508234143, 510204136, 512238860, 514236033, 516240060, 518502653, 521074295, 523594081, 525822878, 527978063, 530273497, 532765567, 535257876, 537593126, 540097177, 542999923, 546019137, 548979938, 551925540, 554805636, 557683408, 560614884, 563573122, 566563129, 569600701, 572700441, 575993538, 579460323, 582863629, 586166024, 589315176, 592009366, 594469011, 598057091, 603024185, 607762933, 611749589, 615522921, 619426787, 623514235, 627628028, 631321251, 634502053, 638208449, 643028736, 647649229, 651662469, 655839801, 660328031, 664832592, 669350445, 673522711, 676952958, 680328310, 684239447, 688315868, 692400932, 696200728, 699951589, 704744101, 709753990, 713346064]
3624.4G13346064J972377K227366M626155N096078M257679L749192L354669L078222
3640.7G41707802K602756J391411J73211J341522M482388M686832L131271L014564
3657G62531757L469289K805233J903414J158178J28329j66476R93431R71198Q43644
3675.4G74637997K933979L735364K857983J775265N59449k75851M82023K363026K848089
3693.7G91917324J974166R11533J82808L39329J082718P32661o11604j122713O14703
3712.1G96020925K411485J838922M86672k38716k41816J65760O81698O30737n05030
3730.4H01250637j640618r52602J352549K246499P53581j239120j280725K73466l6002
3748.8H00727665m3273J961768K267957R25541M18067R95993Q58546N4598k36512J09375
$$ y = [713346064, 715318441, 717545807, 722171962, 727268040, 731525719, 735274911, 738629580, 741707802, 744310558, 745701969, 745875180, 747216702, 751699090, 756385922, 759517193, 762531757, 766001046, 768806279, 770709693, 771867871, 771996200, 771829724, 772823155, 773794353, 774637997, 777571976, 781307340, 784165323, 785940588, 786500037, 786224186, 786706209, 789069235, 791917324, 793891490, 794803023, 794985831, 795325160, 796407878, 797140539, 796528935, 795406222, 796020925, 798432410, 800271332, 800758004, 800519288, 800277472, 800443232, 801124930, 801755667, 801250637, 799610019, 798657417, 800009966, 802256465, 803010046, 801770926, 800490201, 800763667, 800727665, 800684392, 802646160, 804914117, 805839658, 806257725, 807253718, 808112264, 808166862, 807930350, 808039725]
3769.2H08039725R37998J241267M52757l84152k81513L92735M47333L17037N32270
3787.5H11695457N00857M6373o70493j106620r37760r67204l97086R13918R01758R89199
3807.9H10968399J358330L90888j115799j506448q64983n90324O66320J702666R95398
3826.3H12004447K74301k49327o30498p03394r88066o38247P67112J581132J559556
3844.6H12977016Q29458p30514k586007k737880J005709K950430J475990k06530q28445
3863H12149227k24591o2227o15179l1174R93908J157164M62652o21558m93347J99914
3883.4H12914789K82168M17173N0724j26422O05404M02570q90076j511574p97033M42564
3903.8H11790287J482189J548827P83682Q8274l95119o95527l19302K83182J88410
$$ y = [808039725, 808977723, 810218990, 810671747, 810287595, 810006082, 810398817, 810846150, 811163187, 811695457, 812196314, 812242687, 811572194, 810465574, 809527814, 808560610, 808163524, 809077442, 809979200, 810968399, 812326729, 812717617, 811601818, 810095370, 809230387, 808640063, 809306383, 811009049, 812004447, 812278748, 812029421, 811398923, 810695529, 809707463, 809069216, 809836328, 811417460, 812977016, 813806474, 813075960, 810489953, 807752073, 808757782, 811708212, 813184202, 812977672, 812149227, 811924636, 811862409, 811247230, 811216056, 812209964, 813367128, 813829780, 813208222, 812714875, 812914789, 813196957, 813614130, 813664854, 813538432, 814143836, 814546406, 813656330, 812144756, 811347723, 811790287, 813272476, 814821303, 815604985, 815693259, 815298140, 814602613, 814283311, 814566493, 814754903]
3922.1H14754903j08480M5121O7174j84715O1512N44965M40419n305l52144l58641
3942.5H14904809j073R9540J7643K00808K56359Q2970J7107L0219O259K4497M9770
3965H15688908L0577K2471j6987n2989L7015J42813Q9109J8060K6583j311n2988o5625
3989.5H15865636n7817k8789L8505Q1479
3997.6H15899014
$$ y = [814754903, 814646423, 814691544, 814758718, 814574003, 814635515, 815180480, 815620899, 815615594, 815263450, 814904809, 814903736, 815003276, 815020919, 815221727, 815478086, 815561056, 815578163, 815608382, 815614641, 815639138, 815688908, 815719485, 815741956, 815724969, 815671980, 815708995, 815851808, 815940917, 815958977, 815985560, 815984249, 815931261, 815865636, 815807819, 815779030, 815817535, 815899014]
##END=$$ End of the data block
