##TITLE=Lut 1P1 $$ Begin of the data block
##JCAMP-DX=5.00 $$ ACD/SpecManager v 10.08
##SPECTROMETER/DATA SYSTEM=Alpha
##DATE=09 Oct 2014 08:27:22
##DATA TYPE=INFRARED SPECTRUM
##DATA CLASS=XYDATA
##ORIGIN=
##OWNER=
##NPOINTS=1765
##FIRSTX=399.76428223
##LASTX=3997.64282227
##MAXX=3997.64282227
##MINX=399.76428223
##MAXY=0.78514487
##MINY=0.17257379
##XFACTOR=1.0000000000
##YFACTOR=1.000000000000000e-9
##FIRSTY=0.75994754
##DELTAX=2.03961372
##XUNITS=1/CM
##YUNITS=ARBITRARY UNITS
##XYDATA=(X++(Y..Y))
399.8G59947538j207828l318072k755999k13921R43422r65059l259778k805709q37207
418.1G45527387K50756n39898k225817k519726o27399Q29458N7936j682222k166569
436.5G36903906r46164L34382n484j675665k717674k006471m78327j76788j276254
454.8G27955461k225399j785875k68578M99427k87890j531065j421213J1384Q59022
473.2G21805274M9770j071393j200497m44651L06666N8353j065612j733124j101554
491.5G15603232J02461K62320q52049j783013j577437o48677q5533o81102j819670
509.9G08520532j981557q88049J65343k02537j731217k444565j347959K29299L43502
528.3G00662792j010597k120018j709402k43306N48065l79324j858592j886785l73423
$$ plain form
399.8 759947538 758739710 755421638 752665639 752451718 753395140 752430081 749170303 746364594 745527387
418.1 745527387 745778143 745238245 743012428 740492702 739865303 740694761 740752697 739070475 736903906
436.5 736903906 735957742 736292124 736286640 734610975 731893301 729886830 729408503 729231715 727955461
454.8 727955461 725730062 723944187 723675609 724175036 723887146 722356081 720934868 720946252 721805274
473.2 721805274 721855044 720783651 719583154 719138503 719445169 719503522 718437910 716704786 715603232
491.5 715603232 715705693 715968013 715115964 713332951 711755514 711106837 711021304 710340202 708520532
509.9 708520532 706538975 705650926 705816269 705613732 703882515 701437950 700089991 700319290 700662792
528.3 700662792 699652195 697532177 695822775 695579469 696127534 695748210 693889618 692002833 691629410
546.6F91629410P86662J16050j425087j763940n07534P89464N19156j076817k085507
565F86981857j269341L09885N27561q92997k081394j622022p2062P74145m5835j372755
585.4F81237042j420140j02878R43720L35813j161754j534462l24130Q94069O47665
603.7F79514945o52016j305759m19736J040817J428962L73184o36995o9260J537621
622.1F80811763K305150J332223j40607k56777J055479K077758J495421o9201q56638
640.4F87754571o2704J127005R64820m82916j496435r60469L95835Q27550k43187j444697
660.8F86379373j349330m61936j0252l9160n40078j027345n74470L64840J90139j142860
681.2F81788921k044737j401722o7711K34902r62496k300680k200603p53820L37839
$$ plain form
546.6 691629410 692416072 692532122 691107035 689343095 688835561 689625025 690144181 689067364 686981857
565 686981857 685712516 686022401 686549962 685656965 683575571 681953549 681881487 682655632 682609797 681237042
585.4 681237042 679816902 679714024 680657744 680993557 679831803 678297341 677973211 678867280 679514945
603.7 679514945 678862929 677557170 677137434 678178251 679607213 679980397 679343402 679274142 680811763
622.1 680811763 683116913 684449136 684308529 684051752 685107231 687184989 688680410 688611209 687754571
640.4 687754571 687691867 688818872 689783692 689300776 687804341 686843872 687239707 688067257 687824070 686379373
660.8 686379373 685030043 684568107 684557855 684518695 683978617 682951272 682376802 682741642 682931781 681788921
681.2 681788921 679744184 678342462 678274751 678509653 677547157 675246477 673045874 672292054 672629893
699.6F72629893n3942j125515j339912m48346K53737m30525k125978l325403l223956
717.9F60810053k008557j2219K238214M228056N887687P101476P255852N992294M214704
736.3F95707560L463864M158020N060732M835964L660500K895772L360570M168152
752.6G27311134L656507J730084K00391M02808J621604K099574J176000j1743P7308
771G38263667J480341K643168K307713J117348Q20101J973390L299594L291667J975357
789.3G57172346R43840J467406K736450K909243J523196J7286p6652J047313J827896
807.7G69568324J324296L21627K48611J450240K652705K425194R55999j80066k9206
826G78737724O61254N58793o04331j638055j357973k5689J007676Q77440J81079J59561
$$ plain form
699.6 672629893 672575951 671450436 670110524 669662178 669915915 669485390 667359412 664034009 660810053
717.9 660810053 658801496 658789277 661027491 665255547 671143234 678244710 685500562 691492856 695707560
736.3 695707560 699171424 703329444 708390176 713226140 716886640 719782412 723142982 727311134
752.6 727311134 730967641 732697725 732898116 733300924 734922528 737022102 738198102 738186359 738263667
771 738263667 739744008 742387176 744694889 745812237 746632338 748605728 751905322 755196989 757172346
789.3 757172346 758116186 759583592 762320042 765229285 766752481 766769767 766693115 767740428 769568324
807.7 769568324 770892620 771214247 771462858 772913098 775565803 777990997 778946996 778766930 778737724
826 778737724 779398978 779957771 779353440 777715385 776357412 776331723 777339399 778216839 778397918 778557479
846.4G78557479J060486J837075J492560L76820k12192K55704R66489Q10445l14236
864.8G84830630j283288j172304l47615Q6844m28259j198471j193583l62277L73245
883.2G79304922J71661o78480j125931o52850J79708L19064m57466j217902j094818
901.5G74747908k51830K97726q8871p88629p77185L5465P57635N48422l73662r62317
921.9G73144662o69598j00911k18093j133502j967430j912296j233875r52900j579165
940.3G63376892k529860k869248k420783j976431k355993l373861m115462m136265
956.6G39598989l927469m225433n013942n410195m833042l706456k952635l124177
972.9G06405640l774882m045605l732026l408313l642738m195273m333734l853798
$$ plain form
846.4 778557479 779617965 781455040 782947600 783324420 783112228 783367932 784334421 785144866 784830630
864.8 784830630 783547342 782375038 782027423 782114267 781686008 780487537 779293954 778931677 779304922
883.2 779304922 779476583 778798103 777672172 777019322 777199030 777518094 777060628 775842726 774747908
901.5 774747908 774496078 774793804 774704933 773916304 773139119 773174584 773932219 774480641 774106979 773144662
921.9 773144662 772475064 772374153 772156060 771022558 769055128 767142832 765908957 764956057 763376892
940.3 763376892 760847032 757977784 755557001 753580570 751224577 747850716 743735254 739598989
956.6 739598989 735671520 731446087 726432145 721021950 716188908 712482452 709529817 706405640
972.9 706405640 702630758 698585153 694853127 691444814 687802076 683606803 679273069 675419271
989.2F75419271l307641l337442l949047m479765m432857m050375m006087m619360
1005.5F43236697n412162n645871n240142m815519m849911n164623n193353m692554
1021.8F02222562m089773l890812l985942l865957l242195k355337j776695j825273
1038.2E77190578k229095k495169k491057k524972k903640l441334l641248l316939
1054.5E54147124k761066k384066k340317k346635k056241j568377j270115j419723
1070.8E38000584j850784k109111k018868j795173j608968j391470j027942n62787
1087.1E25635481j19746K13444N63026J303375K605378M162848N374849N775213N282402
1105.5E50796270M099608K495408O86586j011670k024829j689852K00451K844989M682362
$$ plain form
989.2 675419271 672111630 668774188 664825141 660345376 655912519 651862144 647856057 643236697
1005.5 643236697 637824535 632178664 626938522 622123003 617273092 612108469 606915116 602222562
1021.8 602222562 598132789 594241977 590256035 586390078 583147883 580792546 579015851 577190578
1038.2 577190578 574961483 572466314 569975257 567450285 564546645 561105311 557464063 554147124
1054.5 554147124 551386058 549001992 546661675 544315040 542258799 540690422 539420307 538000584
1070.8 538000584 536149800 534040689 532021821 530226648 528617680 527226210 526198268 525635481
1087.1 525635481 525515735 525729179 526292205 527595580 530200958 534363806 539738655 545513868 550796270
1105.5 550796270 554895878 557391286 558077872 557066202 555041373 553351521 553551972 556396961 561079323
1123.8E61079323M519224K390445p50006l974437o754220q661210r185791q138657
1140.1E30524671o081521m072071l000617k999484l442884l643632l442764l023267
1156.5E00818431k438634j488954M1783J998961L845811N194068O211698P324099Q633197
1174.8E30140460R695470R977758R451687Q627117Q067667P809818P377923O484687
1191.1E97632587N411506M642665M253268L710985K516807R15169l06308p12633o85036
1209.5F17379010r56476j720607k493739k842665k915383l256440m076183m838168
1225.8E94279349m834235m155516l530026l379881l369093k770603j331449M08411
1242.1E71316957J757861K573371L163397L660262L729641L070772J956284J152634
$$ plain form
1123.8 561079323 565598547 567988992 567238986 563264549 556510329 547849119 538663328 530524671
1140.1 530524671 524443150 520371079 517370462 514370978 510928094 507284462 503841698 500818431
1156.5 500818431 498379797 496890843 496932626 498931587 502777398 507971466 514183164 521507263 530140460
1174.8 530140460 539835930 549813688 559265375 567892492 575960159 583769977 591147900 597632587
1191.1 597632587 603044093 607686758 611940026 615651011 618167818 619082987 618776679 618064046 617379010
1209.5 617379010 616422534 614701927 612208188 609365523 606450140 603193700 599117517 594279349
1225.8 594279349 589445114 585289598 581759572 578379691 575010598 572239995 570908546 571316957
1242.1 571316957 573074818 575648189 578811586 582471848 586201489 589272261 591228545 592381179
1258.4E92381179J166404J686096K062619K009451J732290J564622J520991J284420
1274.8F05408072P15673K62440O61373J994192L290892L414214K244770Q71420L01957
1293.1F19165003L93987L24309k47657p58946n77331Q7798M72784K01761l12507l39269
1313.5F18409932L40402J269281J873552K069355K285122K726317K947390K317607
1329.8F34238958Q42512o96838j584470j851976j802862j625061j470327j231432p18832
1348.2F24099672j93834q9229m54425r45628j177848j355290k115250l346443m069566
1366.6F10352159l890217l217101l657997n715608o284058l378988L98636J964569
1382.9E86571395J602531J042783N74052J27078k57373p80881j267850j375437n82337
$$ plain form
1258.4 592381179 593547583 595233679 597296298 599305749 601038039 602602661 604123652 605408072
1274.8 605408072 606123745 606386185 607047558 609041750 612332642 615746856 617991626 618863046 619165003
1293.1 619165003 619558990 619883299 619635642 618876696 618299365 618387163 618859947 619061708 618749201 618409932
1313.5 618409932 618750334 620019615 621893167 623962522 626247644 628973961 631921351 634238958
1329.8 634238958 635081470 634384632 632800162 630948186 629145324 627520263 626049936 624818504 624099672
1348.2 624099672 623905838 623816609 623362184 622416556 621238708 619883418 617768168 614421725 610352159
1366.6 610352159 606461942 603244841 599586844 593871236 587587178 584208190 584606826 586571395
1382.9 586571395 588173926 589216709 589790761 589917839 589660466 588879585 587611735 586236298 585653961
1401.2E85653961J162767K892316L029882J438559o25313j842558j393080L90470K456248
1419.6E93163252K913475K138138Q32855j151323l587067n410671n737782n950510
1435.9E77210367n700469m231036l475785l323734l127873l484964m795790o639361
1452.2E42431355p452846o152093k285541M17948N19753J066088O219149J6019821
1468.5E50783634K6306331L2343924K4844170J2965798O694854L134012K63572k489329
1484.9F54846966n237400p990659r602010q933902r141922j1154592j1427223r567082
1501.2E81792176p789791q376181j1657059j0579646q016646o955087n732477m574120
1517.5E18111169l648817l509820l231823k643287k642751k534390k301335j967817
$$ plain form
1401.2 585653961 586816728 589709044 592738926 594177485 593552172 591709614 590316534 590707004 593163252
1419.6 593163252 596076727 598214865 599047720 597896397 594309330 588898659 583160877 577210367
1435.9 577210367 571509898 567278862 563803077 560479343 557351470 553866506 549070716 542431355
1452.2 542431355 534978509 528826416 526540875 526958823 527478576 528544664 534763813 550783634
1468.5 550783634 577089965 609433889 634278059 647243857 653938711 657072723 657336295 654846966
1484.9 654846966 649609566 641618907 632016897 623082995 613941073 602786481 591359258 581792176
1501.2 581792176 574002385 565626204 553969145 543389499 535372853 528417766 522685289 518111169
1517.5 518111169 514462352 510952532 507720709 505077422 502434671 499900281 497598946 495631129
1533.8D95631129j068861j54525K94715M83096J117379K077907K944052L641427L923535
1552.2E08889854M094958M468620O296516P284283M525960L756106M303574M933596
1568.5E48553467N216896L943563L071368L218233K802551K259850J715303Q44657
1584.8E71625888J05441j72257m42207j093865k129018k970636l248990l407955l979742
1603.2E54286659n090177o331802p402003p816076p844865r355188j2318879j1976212
1619.5D86151457j1886686j4738769j5611887j4472574j2287318q352906n450010m627496
1635.8C98723811l735662k714395k079576j377494p07924k47329n9814L41148J247882
1654.1C89390647J837284K271056L076196L954053M436552M386902N091339N869598
$$ plain form
1533.8 495631129 494562268 494407743 494702458 495185554 496302933 498380840 501324892 504966319 508889854
1552.2 508889854 512984812 517453432 523749948 531034231 535560191 539316297 543619871 548553467
1568.5 548553467 553770363 557713926 560785294 564003527 566806078 569065928 570781231 571625888
1584.8 571625888 571731329 571559072 571116865 570023000 567893982 564923346 561674356 558266401 554286659
1603.2 554286659 549196482 542864680 535462677 527646601 519801736 510446548 498127669 486151457
1619.5 486151457 474264771 459526002 443914115 429441541 417154223 408801317 403351307 398723811
1635.8 398723811 394988149 392273754 390194178 388816684 388108760 387861431 387801617 388142765 389390647
1654.1 389390647 391227931 393498987 396575183 400529236 404965788 409352690 414444029 420313627
1670.5D20313627N191504N352885O037951N715787N330086N800664P126212O637305
1686.8D67506021O133169O884247P140249Q914024J1166900J1922062J3350904J0587573
1703.1E43605149Q122682P533312O165207N278110M735589M262507L733397K496898
1719.4E85932851N73993j958907n666733j0144889j4891982k0129562l1338930l8242668
1735.7D64133173l4155071l5499543l2941043k1770418q851885O070971K3862451L9138198
1752C99986833M4471950M8251897M8832863M1631580L4855962K5966227J8053174J4052987
1768.4F76103473J0729074Q254767O270289M858911M432142M023492L098428K470673
1784.7G20241249K400755K606631K587318K145887J415193J311719J736641J943052
$$ plain form
1670.5 420313627 425505131 430858016 436895967 442611754 447941840 453742504 460868716 467506021
1686.8 467506021 473639190 480523437 487663686 496577710 507744610 519666672 533017576 543605149
1703.1 543605149 551727831 559261143 565426350 570704460 575440049 579702556 583435953 585932851
1719.4 585932851 586506844 584547937 578881204 568736315 553844333 533714771 502375841 464133173
1735.7 464133173 429978102 394478559 361537516 339767098 330915213 336986184 360848635 399986833
1752 399986833 444458783 492710680 541543543 583175123 618031085 643997312 662050486 676103473
1768.4 676103473 686832547 695087314 701357603 706216514 710648656 714672148 717770576 720241249
1784.7 720241249 722642004 725248635 727835953 729981840 731397033 732708752 734445393 736388445
1801G36388445J550913R46998Q56698J205981J573562J364649Q22127M95255P36892
1819.4G45941520J212001J322448R18150L92973L82662P97570J100182Q27611L06964
1837.7G53202081J41084N26607R98914Q74877K71499p3790J60992O43849Q21889L98099
1858.1G57966101j01566q7500M05967P66695N18560j23202l57390P0393N80967N91516
1878.5G60230541N6744l68297j86026M05848O86288K99632k53498l50476J15395N73814
1898.9G61209965M31597j82688m78983j29998M01914M79043J7881m13060l27170J95146
1919.3G61203647M71711J39952m27664n38349o9380M32551L25203k75910o01232k90751
1939.7G60369778K57849L78669p8619n61774m90963N6267M34518J82688m06385n98907
$$ plain form
1801 736388445 737939358 738886356 739743054 740949035 742522597 743887246 744709373 745204628 745941520
1819.4 745941520 747153521 748475969 749394119 749787092 750169754 750967324 752067506 752895117 753202081
1837.7 753202081 753343165 753869772 754868686 755743563 756015062 755941272 756102264 756746113 757568002 757966101
1858.1 757966101 757864535 757777035 758183002 758949697 759468257 759345055 758987665 759058058 759639025 760230541
1878.5 760230541 760287285 759918988 759732962 760138810 760825098 761124730 760871232 760520756 760636151 761209965
1898.9 761209965 761641562 761458874 760979891 760849893 761251807 761730850 761748731 761335671 761008501 761203647
1919.3 761203647 761675358 761815310 761387646 760849297 760779917 761212468 761537671 761261761 760660529 760369778
1939.7 760369778 760627627 761006296 760927677 760365903 759874940 759931207 760365725 760548413 760142028 759543121
1960.1G59543121j69754L49939L08394k53856o47485m21584J46806L71158m2855n80669
1980.5G58603215n74350m8041L65734J59978m53412p51257l44694K46823K95639k26319
2000.9G57273316o85989n26727M1068K93791r7751o49691o84857j89007K27988P2479
2021.3G55074620m64856p34032l78906J76251K63929k01106o33001m97103M5538L35216
2041.7G52986550O974n18858n92947j07766L44456K03371l43919o24359l07619K30014
2062.1G51275897L56197r3579n44548m40776Q0645L88205R4473m42862n58079j18851
2082.5G49996722L37362K76625k26319n50866l06844K10940L79384o974m61340m22418
2102.9G49226272L5703L43621J42694l33608n02705j53184K91705K78473j64092m78565
$$ plain form
1960.1 759543121 759373367 759723306 760031700 759777844 759130359 758708775 758855581 759226739 759183884 758603215
1980.5 758603215 758028865 757980824 758346558 758506536 758053124 757301867 756957173 757203996 757499635 757273316
2000.9 757273316 756587327 756060600 756101668 756395459 756297708 755648017 754963160 754774153 755002141 755074620
2021.3 755074620 754609764 753875732 753496826 753673077 753937006 753735900 753102899 752605796 752651334 752986550
2041.7 752986550 752993524 752474666 751881719 751773953 752118409 752321780 751977861 751353502 751045883 751275897
2062.1 751275897 751632094 751538515 750993967 750553191 750633836 751022041 751116514 750673652 750115573 749996722
2082.5 749996722 750334084 750610709 750384390 749833524 749526680 749737620 750117004 750110030 749648690 749226272
2102.9 749226272 749261975 749605596 749748290 749414682 748911977 748758793 749050498 749328971 749164879 748686314
2123.3G48686314l02971J33872L07381J1981m03404m19677k9444K75552J13130l19183
2143.7G48053551m79818j85668J97172K10643j37508m28736l18647Q1122L04222Q1003
2164.1G47377336l06904m10796j12652K58684K47240j42396m29332k53618J48476K62737
2184.5G46638775l8028l78966l56436l815K65420J37388k47001m47810k07901J77801
2204.8G45539427K22266j16349m26292l45409L3736K62857N3465l33965m20511j17719
2225.2G44351506J93179J36316k27154m83393l41773L7253J82330j06454m63485m46856
2245.6G42831469p9096J87814J9432l80159n49793k99513Q7201J29640k39610n45025
2266G41162360l98696L696J72078q9168m72903n04733j48713J41799K384m36782o61910
$$ plain form
2123.3 748686314 748383343 748517215 748824596 748836577 748433173 748013496 747984052 748259604 748372734 748053551
2143.7 748053551 747573733 747388065 747585237 747795880 747658372 747229636 746910989 746992111 747296333 747377336
2164.1 747377336 747070432 746659636 746546984 746805668 747052908 746910512 746481180 746227562 746376038 746638775
2184.5 746638775 746600747 746221781 745865345 745861530 746126950 746264338 746017337 745569527 745361626 745539427
2204.8 745539427 745761693 745645344 745219052 744873643 744907379 745170236 745223701 744889736 744469225 744351506
2225.2 744351506 744544685 744681001 744453847 743970454 743628681 743665934 743848264 743741810 743278325 742831469
2245.6 742831469 742752373 742940187 742959619 742579460 742029667 741730154 741817355 741946995 741707385 741162360
2266 741162360 740763664 740767360 740939438 740850270 740377367 739872634 739723921 739865720 739868104 739431322 738769412
2288.5G38769412m11391k9981J7523l17335o56903n83946j79231K205l00407p18475
2308.9G35591471p35819l37660m8459k43306p09415r08315n98073j54734j17301m62652
2329.3G31275737o82115n05865j63138j5795k53201n99443m75526K34008O64711J97768
2349.7G29677141p01607j308322j157164n50330j45077k34604l81709j10983L77774
2368G25465119O14285M27723J09256P9095L63409N84782M11987m8697l86655l38495
2388.4G27281809p9930j6510k63989n19038m94241k51949q5712k05636m77075n55098
2408.8G24332631l40104j04428j12653l58820n73873n09381k48134j04368k53797n05388
2429.2G21221685n40554l16560j08779j74641m48823o04511m50968j95146j66535l89100
$$ plain form
2288.5 738769412 738358021 738328040 738345563 738028228 737371325 736787379 736608148 736610353 736309946 735591471
2308.9 735591471 734855652 734517992 734469533 734226227 733516812 732608497 732010424 731855690 731738389 731275737
2329.3 731275737 730593622 730087757 729924619 729908824 729655623 729056180 728580654 728814662 729479373 729677141
2349.7 729677141 728975534 727667212 726510048 725959718 725814641 725580037 725198328 725087345 725465119
2368 725465119 726079404 726507127 726616383 726695478 727058887 727643669 728055656 728006959 727620304 727281809
2388.4 727281809 727201879 727185369 726921380 726402342 725908101 725656152 725570440 725364804 724887729 724332631
2408.8 724332631 723992527 723888099 723775446 723416626 722842753 722333372 722085238 721980870 721727073 721221685
2429.2 721221685 720681131 720364571 720255792 720081151 719632328 719027817 718576849 718381703 718215168 717826068
2449.6G17826068o04987n73635l17275j47283k77281n45562o18100m22239k19822k44498
2470G13855386m81189o60121n46992k76208j91867l85344o20127o37173m15862k20120
2490.4G09420383l05116n63145o67155n01454k49505k13861m52101o56665n70655l08811
2510.8G04931915k08020m00365o52551o49989l85642j73152k57551n28097o52075m70758
2531.2G00553715j98543j64509l92139n92708n31316k76864j33872k86936n43774n69224
2551.6F96863830l31163j45495k45989n04195o29843m79042k33114k03907m32015o34014
2572F93025053n54264l20435k43008m11808o42479o54101m25100k38061l09527n38886
2592.4F88687384o64592n64336l56615l07500n10812p04229o32346m05013l10362m59492
$$ plain form
2449.6 717826068 717221081 716647446 716330171 716182888 715905607 715360045 714741945 714319706 714099884 713855386
2470 713855386 713374197 712714076 712167084 711890876 711699009 711313665 710693538 710056365 709640503 709420383
2490.4 709420383 709115267 708552122 707884967 707383513 707134008 706920147 706468046 705811381 705240726 704931915
2510.8 704931915 704723895 704323530 703670979 703020990 702635348 702462196 702204645 701676548 701024473 700553715
2531.2 700553715 700355172 700190663 699798524 699205816 698674500 698397636 698263764 697976828 697433054 696863830
2551.6 696863830 696532667 696387172 696141183 695636988 695007145 694528103 694294989 694091082 693659067 693025053
2572 693025053 692470789 692150354 691907346 691495538 690853059 690198958 689773858 689535797 689226270 688687384
2592.4 688687384 688022792 687458456 687101841 686794341 686283529 685579300 684946954 684541941 684231579 683772087
2612.8F83772087o69479o77884m94957l80397m80056o62565p42137o60181m84765m13418
2633.2F78106248n47230o93977o38127m59492l93391n08249o61850o89327n84484m97460
2653.5F72432661n46753p16627q22186p07984n49496n57482o69718p31706o45280m52697
2673.9F66032732l27349l76523n04732n40554m09782k23041j96516l09170l86417l62038
2694.3F62396610k54095k07484l37183n16772n71728n10097m66346n50390p27951q31843
2714.7F57422721p70807o42240o16491p39157q64387q47578p07089n51463m83215n23388
2735.1F50676906n59211m76002l73483m35889o08623o83486o17922n26428n27441o54161
2755.5F45214260p90120p90834o66738o09338p21395q61227r01103q35061p68722q61465
$$ plain form
2612.8 683772087 683102608 682424724 681929767 681549370 681069314 680406749 679664612 679004431 678519666 678106248
2633.2 678106248 677559018 676865041 676226914 675767422 675374031 674865782 674203932 673514605 672930121 672432661
2653.5 672432661 671885908 671169281 670347095 669639111 669089615 668532133 667862415 667130709 666485429 666032732
2673.9 666032732 665705383 665328860 664824128 664283574 663873792 663650751 663454235 663145065 662758648 662396610
2694.3 662396610 662142515 661935031 661597848 661081076 660509348 659999251 659532905 658982515 658254564 657422721
2714.7 657422721 656651914 656009674 655393183 654654026 653789639 652942061 652234972 651683509 651200294 650676906
2735.1 650676906 650117695 649641693 649268210 648832321 648223698 647540212 646922290 646395862 645868421 645214260
2755.5 645214260 644424140 643633306 642966568 642357230 641635835 640774608 639873505 639038444 638269722 637408257
2775.9F37408257j089395j259565j248896j121581j072347j190185j374781j443685
2792.2F27607822j341998j281202j425564j659215j777589j757622j763522j936436
2808.6F14664674k274394k611578k797127k921819l225506l782212m450560n098462
2824.9E87503016n764902o552815p468999q496880r808183j1975944j5779316k1544397
2841.2E00111580k8628171l5308301l9231777l8250834l0992329j7758191j560479
2855.5C08381498J3019085K2463023K5663257K3451358J7644286J0715723N631328
2869.7D26969558M460871O261617P795483P041216M452705J284391j758009m458100
2886.1D52049732o677121q304536r389103j0132968j0760575j1404902j2082786j2872904
$$ plain form
2775.9 637408257 636318862 635059297 633810401 632688820 631616473 630426288 629051507 627607822
2792.2 627607822 626265824 624984622 623559058 621899843 620122254 618364632 616601110 614664674
2808.6 614664674 612390280 609778702 606981575 604059756 600834250 597052038 592601478 587503016
2824.9 587503016 581738114 575185299 567716300 559219420 549411237 537435293 521655977 500111580
2841.2 500111580 471483409 436175108 396943331 358692497 327700168 309941977 308381498
2855.5 308381498 321400583 343863606 369526863 392978221 410622507 421338230 426969558
2869.7 426969558 431430429 437692046 445487529 452528745 456981450 458265841 456507832 452049732
2886.1 452049732 445372611 437068075 427678972 417546004 406785429 395380527 383297741 370424837
2902.4C70424837j3937652j5384466j7235368j9416571k1751910k3739338k4442584
2916.6B34516948k2992447j9122347j3281360o545976j028N774528J0623559J4749095
2933B03720972J8204674K0582363K1521643K0947814J8886328J5370607J0633558N583257
2949.3C35451216J646697j31398N11676L060341O503671R986848J3003558J5255808
2965.6C85288417J6475380J6495734J5587271J4195650J2653500J1293024J0135651
2979.9D82124627Q892804P549554O243646M928708L507316J787425l27528k519309
2996.2E12187243m420102n672932n869120m960239l087282m07487K669155N487174
3012.5D95926410P407278Q148610P818222O730199N333245M001856K843857J888454
$$ plain form
2902.4 370424837 356487185 341102719 323867351 304450780 282698870 258959532 234516948
2916.6 234516948 211524501 192402154 179120794 172574818 172573790 178348318 188971877 203720972
2933 203720972 221925646 242508009 264029652 284977466 303863794 319234401 329867959 335451216
2949.3 335451216 337097913 336966515 337478191 340538532 347042203 357029051 370032609 385288417
2965.6 385288417 401763797 418259531 433846802 448042452 460695952 471988976 482124627
2979.9 482124627 491017431 498566985 504810631 509739339 513246655 515034080 514706552 512187243
2996.2 512187243 507767141 502094209 496225089 491264850 488177568 487770081 490439236 495926410
3012.5 495926410 503333688 511482298 519300520 526030719 531363964 535365820 538209677 540098131
3028.8E40098131J195252P27474L67880O8605j59979l70621n62966o60539o99758p78437
3049.2E39225042q98540r80020r92059r89080r86993r65953q88467p12991n02646l56972
3069.6E30951321k95281k54631j80304r4533p1287j43230k36094k51651j61946m8161
3090E29214203j9848q6308j57773j77801j94490k38180k91407l45826m13418m80771
3110.4E26808381m60803m06862m96804o68705p80106q62956r23931r63867j052320
3128.8E20192027j125753j096666j050710j094222j213253j339436j386165j372636
3145.1E10513186j414716j461983j468598j548708j654446j671374j677632j714200
3161.4D97901529j741588j755089j761138j793563j863093j911848j883120j829982
$$ plain form
3028.8 540098131 541293383 542020857 542388737 542457342 542297363 541926742 541363776 540703237 540003479 539225042
3049.2 539225042 538326502 537346482 536354423 535365343 534378350 533412397 532523930 531810939 531308293 530951321
3069.6 530951321 530656040 530401409 530221105 530126572 530055285 529912055 529675961 529424310 529262364 529214203
3090 529214203 529194355 529108047 528950274 528772473 528577983 528339803 528048396 527702570 527289152 526808381
3110.4 526808381 526347578 525940716 525443912 524775207 523995101 523132145 522208214 521244347 520192027
3128.8 520192027 519066274 517969608 516918898 515824676 514611423 513271987 511885822 510513186
3145.1 510513186 509098470 507636487 506167889 504619181 502964735 501293361 499615729 497901529
3161.4 497901529 496159941 494404852 492643714 490850151 488987058 487075210 485192090 483362108
3177.7D83362108j843065j931577k001495j957774j855194j834065j925796k000809
3194D68012333j971901j876920j790255j765788j784593j793593j764387j709610j712143
3212.4D51843143j776457j797945j766085j720339j697779j742393j809597j821458
3228.7D37711090j768559j743704j867593k035975k069742k023726j993716k016634
3245D22191441k121299k241403k259702k190411k172470k233595k289176k293259k227425
3263.4D02162701k114236j996279j897216j847863j779586j632750j505584j435131
3279.7C87954056j346409j211047j045555q97944q02904p52986p22080o61344n67019
3298C79946768m72098m01706l36051k79963k79933l01361l06755k89828k49922k30968
$$ plain form
3177.7 483362108 481519043 479587466 477585971 475628197 473773003 471938938 470013142 468012333
3194 468012333 466040432 464163512 462373257 460607469 458822876 457029283 455264896 453555286 451843143
3212.4 451843143 450066686 448268741 446502656 444782317 443084538 441342145 439532548 437711090
3228.7 437711090 435942531 434198827 432331234 430295259 428225517 426201791 424208075 422191441
3245 422191441 420070142 417828739 415569037 413378626 411206156 408972561 406683385 404390126 402162701
3263.4 402162701 400048465 398052186 396154970 394307107 392527521 390894771 389389187 387954056
3279.7 387954056 386607647 385396600 384351045 383453101 382650197 381897211 381175131 380513787 379946768
3298 379946768 379474670 379072964 378736913 378456950 378177017 377875656 377568901 377279073 377029151 376798183
3318.4C76798183k41012k50935k87712l38137l28213k99096l59237m52847m77224m95821
3338.8C73267949n69761o27846o63101o94126o57469o47158p36475p99179p94053p68363
3359.2C66310418p56443p55608p35909p62641q76486r46343q72821p56532p11828o89418
3379.6C58446389o35683n61178n06073m69625m30375m69655n62698n22733l30925k11954
3400C53745490l33309m88371m18037k59131j78516j63734k04384k08438q9108K0623
3420.4C51423085K6703P8320K38866L75598L91126M31836N54412N31316L75867L98099
3440.8C54825228O01054P43389P83801P59184P39634P75546Q30591R01073R79632R86696
3461.2C62925828R97245J120865J192331J112789J069963J173765J270920J325399
$$ plain form
3318.4 376798183 376557171 376306236 376018524 375680387 375352174 375053078 374693841 374240994 373763770 373267949
3338.8 373267949 372698188 372070342 371407241 370713115 370055646 369408488 368672013 367872834 367078781 366310418
3359.2 366310418 365553975 364798367 364062458 363299817 362423331 361476988 360604167 359847635 359135807 358446389
3379.6 358446389 357810706 357249528 356743455 356273830 355843455 355373800 354811102 354288369 353957444 353745490
3400 353745490 353412181 352923810 352505773 352246642 352068126 351904392 351700008 351491570 351402462 351423085
3420.4 351423085 351449788 351528108 351766974 352142572 352533698 352965534 353519946 354051262 354427129 354825228
3440.8 354825228 355426282 356169671 356953472 357712656 358452290 359227836 360058427 360959500 361939132 362925828
3461.2 362925828 363923073 365043938 366236269 367349058 368419021 369592786 370863706 372189105
3477.5C72189105J395404J441866J462609J522779J574457J532227J505047J541495
3493.8C84164989J569182J572728J588017J607179J590878J551926J573742J627534
3510.2C96846175J645148J629680J619816J672834J765311J849473J786708J689703
3526.5D10504848J778126J925379K019256K090305K043962J939059K040863K230048
3542.8D26571846K241224K046168J950174K083540K199591K207905K232313K324998
3559.1D43857759K359867K288580K298147K508163K602965K498299K487123K571434
3575.4D63472337K636075K731382K855152K916158K845823K676547K609193K646536
3591.7D85389203K740472K843708K871961K783477K647400K602756K627551K679885
$$ plain form
3477.5 372189105 373584509 375026375 376488984 378011763 379586220 381118447 382623494 384164989
3493.8 384164989 385734171 387306899 388894916 390502095 392092973 393644899 395218641 396846175
3510.2 396846175 398491323 400121003 401740819 403413653 405178964 407028437 408815145 410504848
3526.5 410504848 412282974 414208353 416227609 418317914 420361876 422300935 424341798 426571846
3542.8 426571846 428813070 430859238 432809412 434892952 437092543 439300448 441532761 443857759
3559.1 443857759 446217626 448506206 450804353 453312516 455915481 458413780 460900903 463472337
3575.4 463472337 466108412 468839794 471694946 474611104 477456927 480133474 482742667 485389203
3591.7 485389203 488129675 490973383 493845344 496628821 499276221 501878977 504506528 507186413
3608.1E07186413K656162K589523K587974K546251K544761K580464K366423K138973
3624.4E27196944K107620K244353K266050J997828J918137J970113J921892J824677
3640.7E43447614J749336J676321J634241J725077J637995J271844J107455J266360
3657E55516243J394808J221717R71019R18329R51886R23395R45628Q62837N83112N17785
3677.4E64806759O86348P91371R00864R98795R57609O11662L29197M54545N61833M84586
3697.8E71583569L72291L19719L43323L63171L10659J86265P8797J51932K04623J09196
3718.2E74023545M768k7299k9266l934J32740K12014J66118J30296P8380M5716O8903
3740.6E74801981p3075k40445O2883K32637r179o0141J24573J67251O9499M5657P0572
$$ plain form
3608.1 507186413 509842575 512432098 515020072 517566323 520111084 522691548 525057971 527196944
3624.4 527196944 529304564 531548917 533814967 535812795 537730932 539701045 541622937 543447614
3640.7 543447614 545196950 546873271 548507512 550232589 551870584 553142428 554249883 555516243
3657 555516243 556911051 558132768 559103787 560022116 560974002 561897397 562843025 563705862 564288974 564806759
3677.4 564806759 565493107 566284478 567185342 568184137 569141746 569753408 570082605 570537150 571098983 571583569
3697.8 571583569 571955860 572275579 572618902 572982073 573292732 573478997 573557794 573709726 573914349 574023545
3718.2 574023545 574028313 574001014 573971748 573967814 574100554 574312568 574478686 574608982 574687362 574733078 574801981
3740.6 574801981 574728906 574488461 574551344 574783981 574774802 574714661 574839234 575006485 575075984 575121641 575192213
3763.1E75192213Q345l5227n0008n4300q523M1902P7307l457j36077j50145j47461
3785.5E74734569j35065p7664k9743l4034j06633j10447j54675k73287j16646n6148
3805.9E73640227j83403r1911M9174k324j08421n1975j83404l32117j21117o5624j51217
3828.3E72397888j74702r9599J10805O3300k89082l44873j82509j05083j4544N1678
3848.7E71413279j20581o24179n90623O8307J48654q0824k10404j99318j29879j70529
3869.1E69503903k15470k20597k11954q1778o2227r4533o4194k24412k86162j76489
3889.5E67866087k23517k11180q9705j14500k26259k60890k76446k66672j59621r7215
3909.9E65940082j01447j24335k13564k84910k13146j18554j36614j76727j90974k42531
$$ plain form
3763.1 575192213 575200558 575165331 575115323 575061023 575052500 575094402 575171709 575168252 575032175 574882030 574734569
3785.5 574734569 574599504 574521840 574492097 574458063 574351430 574240983 574086308 573813021 573696375 573640227
3805.9 573640227 573456824 573364913 573414087 573411763 573303342 573251367 573067963 572735846 572614729 572549105 572397888
3828.3 572397888 572223186 572123587 572234392 572297692 572008610 571663737 571481228 571376145 571361601 571413279
3848.7 571413279 571292698 570668519 570077896 570146203 570294857 570214033 570003629 569804311 569674432 569503903
3869.1 569503903 569288433 569067836 568855882 568774104 568711877 568617344 568553150 568328738 568042576 567866087
3889.5 567866087 567642570 567431390 567341685 567227185 567000926 566740036 566463590 566196918 566037297 565940082
3909.9 565940082 565838635 565714300 565500736 565215826 565002680 564884126 564747512 564570785 564379811 564137280
3930.3E64137280k57969k02596j90079k01047j94490k24590j97470j07050j56939k67267
3950.7E62137783k15114j15871j30594j77800k10941k70248k67327j73032j29104j76012
3971.1E60271740j93179j35719r1970j17064j65999j98185k18451j98186j55687j71602
3991.5E58625698k38418k63453j88172
3997.6E57935655
$$ plain form
3930.3 564137280 563879311 563676715 563486636 563285589 563091099 562866509 562669039 562561989 562405050 562137783
3950.7 562137783 561922669 561806798 561676204 561498404 561287463 561017215 560749888 560576856 560447752 560271740
3971.1 560271740 560078561 559942842 559850872 559733808 559567809 559369624 559151173 558952987 558797300 558625698
3991.5 558625698 558387280 558123827 557935655
3997.6 557935655
##END=$$ End of the data block
