##TITLE=Lona PVC Banner - Lado cinza lavado com etanol $$ Begin of the data block
##JCAMP-DX=5.00 $$ ACD/SpecManager v 10.08
##SPECTROMETER/DATA SYSTEM=Alpha
##DATE=25 Aug 2016 08:41:54
##DATA TYPE=INFRARED SPECTRUM
##DATA CLASS=XYDATA
##ORIGIN=
##OWNER=
##NPOINTS=1667
##FIRSTX=599.57470703
##LASTX=3997.16503906
##MAXX=3997.16503906
##MINX=599.57470703
##MAXY=0.97210264
##MINY=0.60428578
##XFACTOR=1.0000000000
##YFACTOR=1.000000000000000e-9
##FIRSTY=0.77812248
##DELTAX=2.03937006
##XUNITS=1/CM
##YUNITS=ARBITRARY UNITS
##XYDATA=(X++(Y..Y))
599.6G78122485j1117101p535040l319145K98441K093077K609968L300249M051328
$$ 778122485 767005384 759470344 756151199 756449640 758542717 761152685 764452934 768504262
615.9G68504262M455328M558325L731072K206683R79245l98994k050757k719164j777411
$$ 768504262 772959590 777517915 781248987 783455670 784434915 784035921 781985164 779266000 777488589
634.2G77488589J345396N848170Q778929Q641065P256209O360710N755365N602956
$$ 777488589 778833985 784682155 793461084 802102149 809358358 815719068 821474433 827077389
650.6H27077389O164253O238222M508674J964569n901j340330k029240l282487n581141
$$ 827077389 833241642 839479864 843988538 845953107 845947206 844606876 842577636 839295149 833714008
668.9H33714008m735291l277242k817452k257049j588046j187504j328409j625657
$$ 833714008 828978717 825701475 822884023 820626974 819038928 817851424 816523015 814897358
685.2H14897358j795351j713812j227200k18332Q97467J422107R83119o99520k912462
$$ 814897358 813102007 811388195 810160995 809942663 810840130 812262237 813245356 812545836 809633374
703.6H09633374n953491j3008177j9600034o896436K4175108L8946926K6183188R146571
$$ 809633374 803679883 790671706 771071672 764175236 788350344 827297270 853480458 862627029
719.9H62627029o98089o552100r477377o142736L805101J1333883R374797K536476
$$ 862627029 861928940 855376840 845899463 839756727 843561828 854895711 864270508 866806984
736.2H66806984k197862l111183j502753J125753L709197N197227N032301L869415
$$ 866806984 864609122 861497939 859995186 861120939 864830136 870027363 875059664 878929079
752.5H78929079K628862J434625M39643k03669o64055j048207j140595p15196j20938
$$ 878929079 881557941 882992566 883432209 883228540 882564485 881516278 880375683 879660487 879539549
770.9H79539549J94729K27391K60175M16338O81043R19044R44912P58529M22537J15574
$$ 879539549 879734278 879961669 880221844 880638182 881319225 882238269 883183181 883941710 884364247 884479821
791.3H84479821R1016J88589M88639J266181K055169K344370K016723J424491Q24511
$$ 884479821 884570837 884759426 885248065 886514246 888569415 890913785 892930508 894354999 895179510
809.6H95179510J97590m02987q53718j354098k274335l132045l640532m131735m356324
$$ 895179510 895377100 894974113 894120395 892766297 890491962 887359917 883719385 879587650 875231326
828H75231326l727913k569258j826406j811922k137839k928675m711806q209587j0013937
$$ 875231326 871503413 868934155 867107749 865295827 863157988 860229313 855517507 847307920 837293983
846.3H37293983n470336k080739m947423q625925j3906837k1149158k7035236l1684161
$$ 837293983 831823647 829742908 824795485 816169560 802262723 781113565 754078329 722394168
862.7G22394168l5300254l6679805l1792223j4336109J3205945L5895348M4204592
$$ 722394168 687093914 650414109 618621886 604285777 617491722 653387070 697591662
876.9F97591662M1559637L5640419L4086644L5940051L1572700K0196020J0103047
$$ 697591662 739151299 774791718 808878362 844818413 876391113 896587133 906690180
891.2I06690180M562915J775384J99198q59141j547575j719415j739443j962363j936674
$$ 906690180 911253095 913028479 913227677 912368536 910820961 909101546 907362103 905399740 903463066
909.6I03463066j628936j591682j834393k097130k241075k102196j790106j632750
$$ 903463066 901834130 900242448 898408055 896310925 894069850 891967654 890177548 888544798
925.9H88544798j854479k187849k235829k223432k455771k641082k604783k764940
$$ 888544798 886690319 884502470 882266641 880043209 877587438 874946356 872341573 869576633
942.2H69576633l044248l140509l310025l483951l309846k665877j515448k21550Q10444
$$ 869576633 866532385 863391876 860081851 856597900 853288054 850622177 849106729 848885179 849695623
960.5H49695623J508892J863598K086759K358079K640426K815723K767683K625107
$$ 849695623 851204515 853068113 855154872 857512951 860153377 862969100 865736783 868361890
976.9H68361890K470553K120555J594722J108348P47443L84271j1325j35124j2278
$$ 868361890 870832443 872952998 874547720 875656068 876403511 876787782 876776457 876641333 876629055
995.2H76629055J30116J37628n6923k18510l53814n86271q88646j237690j423359j442850
$$ 876629055 876759171 876896799 876839876 876621366 876267552 875681281 874792635 873554945 872131586 870688736
1015.6H70688736j450419j308322j091659r95636j004338j114369j398205j911700
$$ 870688736 869238317 867929995 866838336 865842700 864838362 863723993 862325788 860414088
1031.9H60414088k382159k379001j677990n27799L94762O53803L25680l78251j127124
$$ 860414088 858031929 855652928 853974938 853447139 853841901 854495704 854821384 854443133 853316009
1050.3H53316009j543283j766503k228260k955139l655791m266441m857421n230129
$$ 853316009 851772726 850006223 847777963 844822824 841167033 836900592 832043171 826813042
1066.6H26813042m852414l223538n21005K444983M651666N316674M566908L159881
$$ 826813042 821960628 818737090 818216085 820661068 825312734 830629408 835196316 838356197
1082.9H38356197J736104O89209R0659j42634j58191j51992k05100l50475l67701r9361
$$ 838356197 840092301 840781510 840872169 840729535 840571344 840419352 840214252 839863777 839496076 839396715
1103.3H39396715J60217l4153r46343k257526l334761l694117l087818j714707m5955
$$ 839396715 839556932 839522779 838576436 836318910 832984149 829290032 826202214 824487507 824441552
1121.7H24441552J437664K440453K957344K976417K574623J982450J410842J131773
$$ 824441552 825879216 828319669 831277013 834253430 836828053 838810503 840221345 841353118
1138H41353118J131535R40740K36571q23498j853466k640724l270268l891767m481554
$$ 841353118 842484653 843425393 843661964 842838466 840985000 838344276 835074008 831182241 826700687
1156.3H26700687m756569m378200l143370j357198R0838P30931Q48949Q92580R92656
$$ 826700687 821944118 817565918 814422548 813065350 813156188 813887119 814736068 815628648 816621304
1174.7H16621304J017212J017094R49979P43866M45306J9610l27587m13299l20911
$$ 816621304 817638516 818655610 819605589 820349455 820794761 820814371 820486784 820073485 819752574
1193H19752574j58966j7583J2875r7752k90096n10335q03649j216054j658678k099037
$$ 819752574 819593608 819576025 819588900 819491148 819201052 818690717 817887068 816671014 815012336 812913299
1213.4H12913299k677143l643870n077899o676376p971883q287489p154405n277515
$$ 812913299 810236156 806592286 801514387 794838011 786866128 778578639 771424234 766146719
1229.7G66146719l940224l625035l784121l665387l110647k466560k013743j778006
$$ 766146719 762206495 758581460 754797339 751131952 748021305 745554745 743541002 741762996
1246.1G41762996j754821j759708j082718R45628L416061M523397M206955L472746
$$ 741762996 740008175 738248467 737165749 738111377 741527438 746050835 750257790 753730536
1262.4G53730536K694189J986861J415849J033664R86993J207411J514614J721799
$$ 753730536 756424725 758411586 759827435 760861099 761848092 763055503 764570117 766291916
1278.7G66291916J515925Q61049M7565m04716m0650R75847J879811K102196J725495
$$ 766291916 767807841 768668890 768716455 768311739 768271089 769246936 771126747 773228943 774954438
1297G74954438J044095L66509j75238p08342j354753k110243k768636l116727l350019
$$ 774954438 775998533 776365042 776189804 775481462 774126709 772016466 769247830 766131103 762781084
1315.4G62781084l589094l611863l464818l282904l028870k672732k264857j815975
$$ 762781084 759191990 755580127 752115309 748832405 745803535 743130803 740865946 739049971
1331.7G39049971j160324l07142L56912L02554q21829k542973l986060m666806m597246
$$ 739049971 737889647 737582505 737939417 738241971 737420142 734877169 730891109 726224303 721627057
1350.1G21627057m119039l657520l443420l543675l884017m158259m065573m033148
$$ 721627057 717508018 713850498 710407078 706863403 702979386 698821127 694755554 690722406
1366.4F90722406m332841m480898m456758m112244l338873k757252k476752k471685
$$ 690722406 686389565 681908667 677451909 673339665 670000792 667243540 664766788 662295103
1382.7F62295103k864301l190577k952278k760351k774477k210438j095176l55422
$$ 662295103 659430802 656240225 653287947 650527596 647753119 645542681 644447505 644092083
1399F44092083n30601j399040j683473j059652l21686M75109J207888J542270K096653
$$ 644092083 643561482 642162442 640478969 639419317 639097631 639572740 640780628 642322898 644419551
1417.4F44419551L506362L939510M150271M942000M764736M376113M216075L884554
$$ 644419551 647925913 651865423 656015694 660957694 665722430 670098543 674314618 678199172
1433.7F78199172M793942O146669M948318L800929L584743L576815M134833M576624
$$ 678199172 682993114 689139783 694088101 697889030 701473773 705050588 709185421 713762045
1450G13762045M120469L436506M596472P282912O450951N004943N843282O894171O079018
$$ 713762045 717882514 721319020 725915492 733198404 739649355 744654298 750497580 757391751 763470769
1468.4G63470769N477190O917179Q240699P976473P481217P061958O805897O098628
$$ 763470769 768947959 775865138 784105837 792082310 799563527 806625485 813431382 819530010
1484.7H19530010N593658O314635P549644O702244N544662O238103O763220N814910
$$ 819530010 825123668 831438303 838987947 845690191 851234853 857472956 864236176 870051086
1501H70051086M227579L466665N156577O198466N312145M563808L933907L857612L722072
$$ 870051086 874278665 877745330 882901907 889100373 894412518 898976326 902910233 906767845 910489917
1519.3I10489917M035413M263401L490806L349781K997041K341032K595484K654791
$$ 910489917 914525330 918788731 922279537 925629318 928626359 930967391 933562875 936217666
1535.7I36217666J709938J607775K529145K921939L025233K297759J614333J436472
$$ 936217666 937927604 939535379 942064524 944986463 948011696 950309455 951923788 953360260
1552I53360260J094877K97010j8894J819551K234518J127303M72545K13981M61161
$$ 953360260 954455137 954752147 954733253 956552804 958787322 959914625 960387170 960601151 961062312
1570.3I61062312M83275k62857o62744r0480M15325O26564P12991N75900L97146L06487
$$ 961062312 961545587 961282730 960619986 960529506 960944831 961571395 962284386 962860286 963257432 963563919
1590.7I63563919J59502n0366j60813o7353J67608M60267M51147J96934J99139L68834
$$ 963563919 963723421 963673055 963512242 963444889 963612497 964072764 964523911 964720845 964919984 965288818
1611.1I65288818J92523k21908j72794J79708K1875l4571K90752K14040J252j95980
$$ 965288818 965481341 965259433 965086639 965266347 965288222 965253651 965544403 965758443 965759695 965563715
1631.5I65563715o40214n95391M34518O91891J69158m68672q93950k12312K07901o71446
$$ 965563715 964923501 964328110 964762628 965454519 965623677 965155005 964261055 964048743 964256644 963585198
1651.9I63585198k71559J255274Q02517j11461l99649m9412j82808p39276m39942R3460
$$ 963585198 963313639 964568913 965371430 965259969 964860320 964810908 964628100 963888824 963448882 963542342
1672.3I63542342j20640j98662l27527r40323j501918r05693L15309J65939k44021
$$ 963542342 963421702 963223040 962895513 961955190 960453272 959547579 959862888 960028827 959784806
1690.7I59784806o95169j636565k100825k034128k327323k394199l257156m547655
$$ 959784806 959089637 957453072 955352247 953318119 950990796 948596597 945339441 940791786
1707I40791786n169452n808413o543099p019401o822109n212367l955841m146576m284620
$$ 940791786 935622334 929813921 923270822 916251421 909429312 904216945 900261104 896114528 891829908
1725.3H91829908l789783l102541j845359J151084N089939O742478R494602J2007952
$$ 891829908 888040125 884937584 883092225 884243309 889333248 896075726 905570328 917578280
1741.6I17578280J1666715J0269940Q234561O602406N426109L611803J943946J286506
$$ 917578280 929244995 939514935 947749496 954351902 959778011 963389814 965333760 966620266
1758I66620266Q99792O77288O28054J22070k70366j37270O0082K74837K48849q3864
$$ 966620266 967520058 968197346 968825400 968947470 968677104 968539834 968599916 968874753 969123602 969039738
1778.4I69039738k11954k42114n05209r49860j773417k576112j963437l88622M40776
$$ 969039738 968827784 968585670 968080461 967130601 965357184 962781072 960817635 960429013 960869789
1796.7I60869789J009643J839817K426564J928628Q65579K01761J33157K88963K14816
$$ 960869789 961879432 963719249 966145813 968074441 968940020 969141781 969274938 969563901 969778717
1815.1I69778717R1493J07586r2566l51906j16050J75953J93357M14849M71472J98901
$$ 969778717 969870210 969977796 969885230 969533324 969417274 969593227 969786584 970201433 970672905 970871806
1835.5I70871806Q2612r715l24846m29749Q9526M94719L86714J44840k0623n6625n6803
$$ 970871806 970954418 970944703 970619857 970190108 970279634 970774353 971161067 971305907 971285284 971228659 971171856
1857.9I71171856l7015n8054k18392m79042m47631K08854N99563L26396O0737J7523
$$ 971171856 971134841 971076787 970858395 970379353 969931722 970140576 970740139 971066535 971127272 971144795
1878.3I71144795m5597j34289j42277j72555k04027J9789J67429J0252M1008J82808
$$ 971144795 971099198 970964909 970822632 970650077 970446050 970465839 970633268 970643520 970684528 970867336
1898.7I70867336Q3089q4699j32381j06395j7583P5221M0889j50860l03030j87873
$$ 970867336 970950425 970865726 970733345 970626950 970609367 970684588 970725477 970574617 970271587 970083714
1919.1I70083714j09554j2755K72155K56598L337r7990k5987P2002J3054k46108l74377
$$ 970083714 969974160 969961405 970233560 970490158 970493495 970395505 970369518 970441520 970454574 970208466 969834089
1941.5I69834089n4419K38419J75535O7056J3351k2590j8477R059k2769p4923j59919
$$ 969834089 969779670 970018089 970193624 970260680 970274031 970251441 970232964 970242023 970219254 970144331 969984412
1963.9I69984412k16484O795J95324P6056K9266O8962n1498j10507L994N4001l3557
$$ 969984412 969767928 969774723 969970047 970046103 970075369 970144331 970092833 969982326 969986320 970040321 970006764
1986.4I70006764j44363j83939p2241J11341J90258J58668L0994m8280j0371l1054
$$ 970006764 969862401 969678462 969606221 969717562 969907820 970066488 970097482 970049202 970038831 970007777
2006.8I70007777r7275p5519l4153j18494j56880k8014M6909Q3745J22964J4663j02639
$$ 970007777 969910502 969834983 969800830 969682336 969525456 969497442 969544351 969628096 969751060 969765723 969663084
2029.2I69663084n1797K8253J1682n3048q1777l3319K026o795P7486J68622N9962j24693
$$ 969663084 969611287 969639540 969651222 969598174 969516397 969483078 969485104 969478309 969555795 969724417 969784379 969659686
2053.7I69659686j60932l3081Q8155M9949k9445k4020O198N663j8597k7358m0651l6537
$$ 969659686 969498754 969465673 969553828 969603777 969574332 969550312 969556510 969562173 969543576 969516218 969475567 969439030
2078.1I69439030J2576K3783j073j5319l9458j1027M5300l100q6486q1122O080O6340
$$ 969439030 969451606 969475389 969474316 969458997 969419539 969408512 969453812 969450712 969364226 969283104 969289184 969355524
2102.6I69355524L4213L1232O4850l5286j75595j43349R835R0182K8491l6061m6313
$$ 969355524 969389737 969420969 969485819 969450533 969274938 969131589 969141424 969231606 969260097 969224036 969177723
2125.1I69177723l6061O199O914j9848j6332l1590l9041j6153L2127J07526R6620j9253
$$ 969177723 969141662 969147861 969154775 969134927 969118595 969087005 969047964 969031811 969063938 969171464 969268084 969248831
2149.5I69248831r0420o9737o9082j06752n8830N1856P1347N2988N6863L1591N5611
$$ 969248831 969158411 969088674 969019592 968912840 968854010 968905866 968977213 969030201 969087064 969118655 969174266
2172I69174266O7651Q822Q046J0550m5657q6903j04011n7458J1801N245O0J0431q583
$$ 969174266 969241917 969250739 969258785 969269335 969223678 969136775 969032764 968975306 968987107 968992352 968992412 969002843 968994260
2198.5I68994260o020K3722M5419K1637q0288j34945o6578M4644J18911M5121q5652
$$ 968994260 968988240 969011962 969057381 969079018 968998730 968863785 968797207 968841851 968960762 969005883 968920231
2220.9I68920231j00494J3411J14561M2259l7670J9968M1604m7207r5606n1379j967
$$ 968920231 968819737 968833148 968947709 968989968 968952298 968972266 969013870 968966663 968871057 968819678 968817711
2243.3I68817711M3332J02461O8188r2447j52707p9930m2260j4603L8266M4227J8656
$$ 968817711 968861043 968963504 969031692 968939245 968786538 968706608 968664348 968649745 968688011 968732238 968750894
2265.8I68750894P987m4405o8367L755M4823J3411k2411m6909j07646r3699m232R597
$$ 968750894 968758881 968714476 968646109 968649864 968694687 968708098 968685687 968638778 968531132 968437433 968433201 968442798
2290.2I68442798L1769Tm8160q0884o8128p4267j10150j49309j28210n9366L1948J19150
$$ 968442798 968474567 968506336 968458176 968377292 968309164 968234897 968124747 967975438 967847228 967787862 967819810 967938960
2314.7I67938960J2159k31743k75016Q822M29511N23627K13265O8605J60933J00553
$$ 967938960 967951119 967719376 967444360 967453182 967882693 968406320 968619585 968688190 968849123 968949676
2335.1I68949676M6312J89305K03550j19687m50491m96090j74165K91229M15265J87993
$$ 968949676 968995988 969185293 969388843 969269156 968818665 968322575 968148410 968439639 968854904 969042897
2355.5I69042897Q9884J00434J20640O2048l03328o78599n21362j05321J6510j05679
$$ 969042897 969132781 969233215 969353855 969415903 969112575 968433976 967912614 967807293 967823803 967718124
2375.9I67718124j15335o437P8797J50562K11596J81854L9995p5758q4519n3167j0968
$$ 967718124 967602789 967596352 967675149 967825711 968037307 968219161 968259156 968183398 968098879 968045712 968034744
2398.3I68034744P1705P8499l8028q9049J907R6321K2054j20759p7844N3525M0293
$$ 968034744 968106449 968184948 968146920 968057871 968059778 968156099 968178153 968057394 967979550 968033075 968073368
2420.7I68073368Q94L1293L4749J6451l755j133k5272q7798r1970l7372j2517j0788
$$ 968073368 968074262 968105555 968140304 968156755 968153000 968151867 968126595 968038797 967946827 967909455 967896938 967886150
2445.2I67886150N7816O6162l2664o4790j1861k921n6207q9526p5221l1770o3836j61886
$$ 967886150 967943966 968010128 967977464 967912674 967900813 967897892 967841685 967752159 967676938 967645168 967581332 967419446
2469.7I67419446j51814n6028m8160j03295j30534j31965j02103j16289j92463k32041
$$ 967419446 967267632 967211604 967163444 967060149 966929615 966797650 966695547 966579258 966386795 966154754
2490.1I66154754k41041k99871l80814l97027l60190m01676n28217n09977k88069q4996
$$ 966154754 965913713 965613842 965233028 964836001 964475811 964074135 963545918 963035941 962747872 962662876
2510.5I62662876m5061l0280P3493J37985J37686J94073L16084M08351M27306L79622
$$ 962662876 962617815 962587535 962661028 962799013 962936699 963130772 963446856 963855207 964282513 964662135
2530.9I64662135K94327K50340K72810K41399J13368K6524M7088J32859J64389J07050
$$ 964662135 964956462 965206802 965479612 965721011 965834379 965860903 965907991 966040850 966205239 966312289
2551.3I66312289Q6665P9573k0743r5725q523J31309J19149q702N782P0810j2398l6657
$$ 966312289 966398954 966478527 966457784 966362059 966353536 966484845 966603994 966595292 966601074 966671884 966659486 966622829
2575.7I66622829O3956P0095k7060l6776L3736O735o6817k8848M5121P4386J21415
$$ 966622829 966686785 966756880 966729820 966693044 966726780 966733515 966666698 966637850 966682971 966757357 966878772
2598.2I66878772J30594L7193m9710j1027P2002O3956j550j1444Q5652J24454K0385
$$ 966878772 967009366 967046559 966996849 966985822 967057824 967121780 967120230 967108786 967194438 967318892 967339277
2620.6I67339277o5446n5313M4942J06037K8789K1160J42633J37449k0445n4717J1266
$$ 967339277 967273831 967218518 967263460 967369497 967398286 967419446 967562079 967699528 967679083 967624366 967635632
2643I67635632K7477O5923N9009j2517p5877j14560l2485M8220O1155R7573L4034q7381
$$ 967635632 967663109 967729032 967788041 967775524 967699647 967585087 967552602 967600822 967661977 967759550 967793584 967706203
2667.5I67706203j08361k8252N9545J6093o4015o9917m5895J3470K5094o3539r1374
$$ 967706203 967597842 967569590 967629135 967645228 967581213 967511296 967465401 967478871 967503965 967440426 967349052
2689.9I67349052k1338M4882M5657j6629n1797k2173m410q5116j10984l2723k9385
$$ 967349052 967327714 967372596 967418253 967401624 967349827 967327654 967323244 967238128 967127144 967094421 967065036
2712.4I67065036l1113k9207p8976p1108p212n37l6120k4617N961k6882j03593q5056
$$ 967065036 967033923 967004716 966925740 966854632 966847420 966846883 966810763 966786146 966792107 966765225 966661632 966576576
2736.8I66576576M590L8504O1751M1008j8597p927J251l6895j1027J08898Q1778j05143
$$ 966576576 966581166 966619670 966681421 966722429 966703832 966695905 966697156 966660261 966649234 966758132 966839910 966734767
2761.3I66734767j09732J8000L6061m3630q7798o2048n5969o4075o3837n0187k7299
$$ 966734767 966625035 966643035 966679096 966635466 966547668 966485620 966429651 966365576 966301739 966251552 966224253
2783.7I66224253p4744j40429j51097j50562j45614j58310j36316l5941m2737k07960
$$ 966224253 966149509 966009080 965857983 965707421 965561807 965403497 965267181 965231240 965188503 964980543
2804.1I64980543l05355k92182k99752k96354k27690j66118j73688j74165j31547j09375
$$ 964980543 964675188 964383006 964083254 963786900 963559210 963393092 963219404 963045239 962913692 962804317
2824.5I62804317j48117k82049m47512n20587o04212q69632j151860j314819j459240
$$ 962804317 962656200 962374151 961926639 961406052 960801840 959932208 958780348 957465529 956006289
2842.9I56006289j572729j582145j550615j358271q85963n48005n01514m30584l32057
$$ 956006289 954433560 952851415 951300800 949942529 949056566 948508561 948007047 947576463 947244406
2861.2I47244406l47972m44353o40094q80957q09431k08914P80761J686216J877009
$$ 947244406 946896434 946452081 945811987 944931030 944121599 943912685 944693446 946379662 948256671
2879.6I48256671J412631Q71598M01676j43647p25210j153648j359820j471937j607060
$$ 948256671 949669302 950540900 950942576 950798929 950073719 948920071 947560251 946088314 944481254
2897.9I44481254j717031j696766j606762j489222j362086j322507j237393j007438
$$ 944481254 942764223 941067457 939460695 937971473 936609387 935286880 934049487 933042049
2914.3I33042049p72178o42836o08921n58555n58019n72264l52859J14381P00951J285016
$$ 933042049 932269871 931627035 931018114 930459559 929901540 929329276 928976417 929090798 929791749 931076765
2934.7I31076765J794636J993060J670838J077592M42326k93314j158297j948357k388000
$$ 931076765 932871401 934864461 936535299 937612891 938055217 937761903 936603606 934655249 932267249
2953I32267249k316535j709938o63161O44922J892209K794147L260910L367365L307938
$$ 932267249 929950714 928240776 927577615 928222537 930114746 932908893 936169803 939537168 942845106
2971.4I42845106L229976L071844K773226K452314K127170J872480J713693J459778
$$ 942845106 946075082 949146926 951920152 954372466 956499636 958372116 960085809 961545587
2987.7I61545587J189351J063108Q94249O09338M92036N07713M07219K70128K41816
$$ 961545587 962734938 963798046 964692295 965301633 965793669 966301382 966708601 966978729 967220545
3006I67220545K33710J17659P4208J49250J49965Q4818K5391O4910J28686R358j43707
$$ 967220545 967454255 967571914 967646122 967795372 967945337 968030155 968055546 968120456 968249142 968258500 968114793
3028.5I68114793j12891L8087J62185K05159J73926M5538o0975m6790p2360j37925
$$ 968114793 968001902 968039989 968202174 968407333 968581259 968626797 968565822 968519032 968446672 968308747
3048.9I68308747o2883Q9347J21832M888j16468p5757J6689K5451K3246Q822m1545
$$ 968308747 968245864 968335211 968457043 968461931 968345463 968269706 968286395 968311846 968335092 968343914 968302369
3071.3I68302369p1406m0114N4300J36196O9201q762J6332j669j6808k1577m4287l0756
$$ 968302369 968230963 968190849 968245149 968381345 968450546 968441784 968458116 968456447 968439639 968418062 968373775 968343019
3095.8I68343019q0943p8857P8917P9572j18851k04742q7023M8637J18375J69933Q6248
$$ 968343019 968262076 968183219 968262136 968341708 968222857 968018115 967931092 967979729 968098104 968268037 968354285
3118.2I68354285j03414j58251O56J13249l3140j73986o0320J52945J80662J0729j06990
$$ 968354285 968250871 968092620 968093276 968206525 968173385 967999399 967939079 968092024 968272686 968283415 968176425
3140.6I68176425n5910j0907j6332J4126l993j23024k31564j33455O8545K98j97947
$$ 968176425 968120515 968109608 968093276 968107402 968103409 967980385 967748821 967615366 967683911 967684209 967486262
3163.1I67486262o9141K03609K15531K1815j37865j24693q0884r1493m7028M351O5327
$$ 967486262 967417121 967620730 967836261 967858076 967720211 967595518 967514634 967423141 967376113 967380464 967445791
3185.5I67445791J16884J9134r1434r5904j29342j33693L2484J45972j4424k17915
$$ 967445791 967562675 967581809 967490375 967394471 967265129 967131436 967163920 967309892 967295468 967077553
3205.9I67077553j53124O3062J34229O5208k8789k3723o6996j87575m6552N9128L338
$$ 967077553 966924429 966987491 967121720 967186928 967158139 967134416 967067420 966879845 966833293 966892421 966895759
3228.3I66895759Q8751J85013J44482l0100j71543j43885p1049p8976l6478Q2075m1842
$$ 966895759 966984510 967169523 967314005 967283905 967112362 966968477 966897428 966818452 966781974 966864049 966822207
3250.7I66822207k07484p5102L1770N1438J51277J50025n782j08063N901J10030o3598
$$ 966822207 966614723 966539621 966571391 966622829 966774106 966924131 966918349 966810286 966816187 966926217 966862619
3273.2I66862619j91450q0407o4671p7128O4313J72615J11640p7963j34886k6404O55
$$ 966862619 966671169 966590762 966526091 966448963 966513276 966685891 966797531 966719568 966584682 966558278 966558933
3295.6I66558933n8293q8871p8678m7445Q225Q6368J16765j430j24515j27196q0824
$$ 966558933 966500640 966411769 966333091 966285646 966293871 966380239 966497004 966495574 966371059 966243863 966163039
3318I66163039J550Q4281J14143N6088m2320M18Q6605k7954j22190l5524R179m6194
$$ 966163039 966164589 966248870 966363013 966419101 966376781 966377199 966463804 966435850 966313660 966278136 966287315 966241121
3342.5I66241121q5890o6757K7001J55627J12534q3268q1122R6620J10328k0445j19924
$$ 966241121 966155231 966088474 966115475 966271102 966383636 966300368 966219246 966315866 966426194 966405749 966285825
3364.9I66285825q6069K9742O020n8412j9968P1049J61469J21594k861l9757o437m2260
$$ 966285825 966199756 966229498 966235518 966177106 966157138 966228187 966389656 966511250 966508389 966468632 966462195 966419935
3389.4I66419935q5950j18255j23442P9692K03192R6440k622m9472J490L9637N2273
$$ 966419935 966333985 966215730 966092288 966171980 966375172 966471612 966468990 966419518 966421008 966460645 966512918
3411.9I66512918P9334p5102k69472j29879J87457J76728q0943j24932M4942J02580
$$ 966512918 966592252 966517150 966247678 966117799 966305256 966481984 966401041 966276109 966321051 966423631
3432.2I66423631M0829M3809M5657l3378j04189j49727p7724J38223J55747P3135J06215
$$ 966423631 966464460 966508269 966553926 966520548 966416359 966266632 966188908 966327131 966482878 966556013 966662228
3454.7I66662228N7697J5080L9637O6162J00016P9513J21474J70469N0187m1723m4048
$$ 966662228 966719925 966735005 966774642 966840804 966940820 967020333 967141807 967312276 967362463 967320740 967276692
3477.1I67276692j29878j23024M3929R5248J11460J67370J7882j55032p9393L7908
$$ 967276692 967146814 967023790 967067719 967162967 967274427 967441797 967459679 967304647 967225254 967263162
3497.5I67263162L0995n8651m9353j609m8757J25527L06726J65760J0372n4002j16825
$$ 967263162 967294157 967235506 967186153 967184544 967135787 967261314 967568040 967733800 967744172 967690170 967573345
3519.9I67573345k38240k66850m9710J73151K82347K26021q762m8577K17139K42353
$$ 967573345 967335105 967068255 967018545 967191696 967474043 967700064 967691302 967642725 967859864 968102217
3540.3I68102217k18272n59390k23041K30909K82466K77758K05934n1499j45316l7372
$$ 968102217 967883945 967324555 967101514 967332423 967614889 967892647 968098581 968047082 967901766 967864394
3560.7I67864394l15130r13858m85480Q95262J196563O35505K22862n37n2273k6524
$$ 967864394 967549264 966635406 966149926 967045188 968241751 968877256 969100118 969099581 969047308 969020784
3581.1I69020784l10838q13306o08921M28200O41465J16170j2637J86027J94013J49727
$$ 969020784 968709946 967896640 967287719 967715919 968357384 968473554 968460917 968646944 968840957 968990684
3601.5I68990684J60276j94370n08666j32442J0491j73033m3869J49489N22554O79910
$$ 968990684 969150960 968956590 968447924 968315482 968325973 968152940 968109071 968258560 968781114 969461024
3621.9I69461024K02358n49555q45731J81735R03249O63698L32474J4782j83582k70486
$$ 969461024 969663382 969113827 968268096 968449831 969353080 970016778 970349252 970364034 970180452 969909966
3642.3I69909966n48363j051306r68218K97069J054406P23184L71038M44830N51104
$$ 969909966 969361603 968310297 967342079 967639148 968693554 969416738 969787776 970232606 970783710
3660.6I70783710L72649j35899p59601q87871k22802n6386l33906K90156R10818P27475
$$ 970783710 971156359 971020460 970260859 969372988 969150186 969093800 968759894 969050050 969960868 970688343
3681I70688343J53244l46244o26325l81470L83198N45323L71218K74539k3306j97947
$$ 970688343 970841587 970495343 969869018 969487548 969870746 970416069 970787287 971061826 971038520 970840573
3701.4I70840573J1802N3644k24054m75526j97947M11988N02527J31905l01183n06878
$$ 970840573 970852375 970906019 970681965 970206439 970008492 970420480 970923007 971054912 970753729 970246851
3721.8I70246851m47511l6478M16636J16289r09686j278579P3373J074791N56528l00943
$$ 970246851 969799340 969762862 970179498 970295787 969386101 968107522 968180895 969255686 969812214 969511271
3742.2I69511271n44191J41919K89500j9253J85251L12567J73867L56019N75780J60456
$$ 969511271 968967080 969108999 969398499 969379246 969564497 969877064 970050931 970406950 970982730 971143186
3762.6I71143186k78294j85490L2664K88784M03285J26839j49548j73032n5731o9141
$$ 971143186 970864892 970679402 970712066 971000850 971404135 971530974 971381426 971208394 971152663 971083522
3783I71083522o1155J53840L33071L14295q762l66211l80575l60072l09825M9531J46926
$$ 971083522 971022367 971176207 971509278 971823573 971814811 971448600 971068025 970707953 970398128 970447659 970594585
3805.4I70594585J95622L37124O5148l45409m46141k09987n8055M9293J83165J88709
$$ 970594585 970790207 971127331 971192479 970847070 970400929 970190942 970132887 970182180 970365345 970554054
3825.8I70554054J51396m5181k78830k58088k19643l01242j57595K14517N63502M02213
$$ 970554054 970705450 970660269 970381439 970123351 969903708 969602466 969444871 969659388 970222890 970625103
3846.2I70625103j83166n70297n77092J63198N60581J71602j07765l05951j64807J75476
$$ 970625103 970441937 969871640 969294548 969457746 970018327 970189929 970082164 969776213 969611406 969786882
3866.6I69786882J18852K57075M65870L29494P9572k71141k41280J073m530J91272
$$ 969786882 969905734 970162809 970628679 970958173 971037745 970766604 970525324 970526397 970521867 970713139
3887I70713139J87099L755J83224J21177m57943r86636r21249j13666J044929J332760
$$ 970713139 970900238 970903993 971087217 971208394 970750451 969763815 968842566 968728900 969773829 971106589
3907.4I71106589N35190j32799l43263n09739k30432L98994L68952j56641j53601L3736
$$ 971106589 971641779 971508980 971165717 970655978 970425546 970824540 971193492 971036851 970883250 970916986
3927.8I70916986j70290j3053M02569L53575Q8155j45673j43588J35899O9379j89840
$$ 970916986 970746696 970733643 971136212 971489787 971577942 971432269 971288681 971424580 971493959 971304119
3948.2I71304119P1704L89218K43545q7380l25621k47955J48833L86774J49548j34050
$$ 971304119 971375823 971765041 972008586 971921206 971595585 971347630 971496463 971883237 972032785 971898735
3968.6I71898735j47522r0957N842L9219Q35J64866K31624k6703k27392k50816j33216
$$ 971898735 971751213 971660256 971666098 971705317 971706152 971871018 972102642 972075939 971848547 971597731 971464515
3991I71464515N8710J76728K70248
$$ 971464515 971523225 971699953 971970201
3997.1I71970201
$$ 971970201
##END=$$ End of the data block
