##TITLE=Lona PVC Banner - Lado cinza com adesivo $$ Begin of the data block
##JCAMP-DX=5.00 $$ ACD/SpecManager v 10.08
##SPECTROMETER/DATA SYSTEM=Alpha
##DATE=25 Aug 2016 08:41:54
##DATA TYPE=INFRARED SPECTRUM
##DATA CLASS=XYDATA
##ORIGIN=
##OWNER=
##NPOINTS=1667
##FIRSTX=599.57470703
##LASTX=3997.16503906
##MAXX=3997.16503906
##MINX=599.57470703
##MAXY=0.99336153
##MINY=0.50052315
##XFACTOR=1.0000000000
##YFACTOR=1.000000000000000e-9
##FIRSTY=0.84754211
##DELTAX=2.03937006
##XUNITS=1/CM
##YUNITS=ARBITRARY UNITS
##XYDATA=(X++(Y..Y))
599.6H47542107m157245k718866l33130J271844J182735J025259J231074J144350J475275
617.9H47663403J914560J730919J596868J698375J317322N57125J04189J55031J010955
636.3H57748747K370000L373325L572225L036022K254188J483143J328111K368032
652.6H77533793L296435K612293J168728K50697j92940k94209l63707j265109j586735
671H81159246r51052l73065j7643O4313l2842n35905j317382j808524j763284j269043
691.3H73154819n07772J40965L00944j21951j115978j890361j838088k449274l713489
709.7H61959815j39952Q768440J2635946P779479J417577k592206n207538p154227
726H77467334p677495o728590p251799j0252654j1311472p439792j472116K783359
$$ y = [847542107, 843384862, 840665996, 840332866, 841604710, 842787445, 843812704, 845043778, 846188128, 847663403, 849577963, 851308882, 852905750, 854604125, 855921447, 856478572, 856582761, 856737792, 857748747, 860118747, 863492072, 867064297, 870100319, 872354507, 873837650, 875165761, 877533793, 880830228, 883442521, 884611249, 884861946, 884669006, 884374797, 884011090, 882745981, 881159246, 880208194, 879835129, 879817486, 879881799, 879848957, 879313052, 877995670, 876187146, 874423862, 873154819, 872647047, 872788012, 873088956, 872967005, 871851027, 869960666, 868122578, 865673304, 861959815, 861819863, 870588303, 883224249, 891003728, 892421305, 889829099, 884621561, 877467334, 869789839, 863061249, 855809450, 845556796, 834245324, 826805532, 825333416, 828116775]
742.3H28116775M834353N979002O563008O325722N701482N239904M441082L141344
758.6H70342672K035618J457989J310587J335203J445175J641392J822174J946747
775H83337557J870871J657367J624584J530170J349747J332701J286566J092851O22153
793.3H95704567q6903o55890p33018l64005L5286M88818J214683J896858K019942J508832
813.7I01029170P55786m20570k088666l206372l440380l562331l892482m317939n156994
832.1H75699222o450236p156431o083787l297985J5378K370477L684342N013526M864692
850.4H68659198K711058N12600j806975m216015o202698p919728r227991r823382q396685
868.8H24289382l336669M638970J1698068J4666259J3846695J1662364J0758758J0897875
$$ y = [828116775, 832951128, 838930130, 845493138, 851818860, 857520342, 862760246, 867201328, 870342672, 872378290, 873836279, 875146866, 876482069, 877927244, 879568636, 881390810, 883337557, 885208428, 886865795, 888490379, 890020549, 891370296, 892702997, 893989563, 895082414, 895704567, 895617664, 894961774, 894228756, 893864751, 893900037, 894388855, 895603538, 897500396, 899520338, 901029170, 901784956, 901364386, 899275720, 896069348, 892628968, 889066637, 885174155, 880856216, 875699222, 869248986, 862092555, 856008768, 852710783, 852726161, 855096638, 858780980, 863794506, 868659198, 871370256, 871882856, 870075881, 865859866, 859657168, 851737440, 842509449, 832686067, 824289382, 820952713, 825591683, 837289751, 851956010, 865802705, 877465069, 888223827, 899121702]
885.1H99121702R204745N555093K392710M44650q14080j519740j775503j524210q35478
903.4I10249889l32177j67548j35422l36111q28564j601696k632856l667832m487395
921.8H96060288n266190o353020p922709r561003j0610759j0696232r683907p583559
938.1H28382909m631757j624287O16730J776993K026677J807928J215994J5736j554727
956.5H28032196k400816j488447J102567M333317O960273Q072912P566512O122708
972.8H58301222M426301K907097J642108M67956n35071j451492k461970l273129l500104
991.1H56522918l107369k371907j612127j065135r66907j421213k226174l130734m181742
1009.5H36439610n476058o855905p735014p106781m925847k343178k81811P00534N90384
$$ y = [899121702, 908326447, 913881540, 916274250, 916718900, 915904820, 914385080, 912609577, 911085367, 910249889, 909917712, 909750164, 909614742, 909278631, 908450067, 906848371, 904215515, 900547683, 896060288, 890794098, 884441078, 876518369, 866957366, 856346607, 845650375, 835966468, 828382909, 823751152, 822126865, 822743595, 824520588, 826547265, 828355193, 829571187, 829586923, 828032196, 825631380, 824142933, 825245500, 829578817, 836539090, 844612002, 852178514, 858301222, 862727523, 865634620, 867276728, 867744684, 867209613, 865758121, 863296151, 860023022, 856522918, 853415549, 851043642, 849431515, 848366380, 847399473, 845978260, 843752086, 840621352, 836439610, 830963552, 824107647, 816372633, 809265852, 804340005, 801996827, 801715016, 802415550, 803005934]
1027.8H03005934k5809n92291q24452o15775J91569J546442K689064K505481O93381
1046.2H08573544k310216o084204j0257244j4352381j7130614j6749680j2963235p902205
1062.5G20823765l669501n37395K561450O428242J0443210J3303101J4236033J2925208
1078.8G76514113R730637N980909K845287P84815k91408r60469j708805k733648l957033
1097.2G86204398n047322n955934o894052p946253r132385j0486186j1803508j2166381
1113.5G16772377j0178983n118012J483023O613612Q897424R026527P766545N121470
1129.8G40383983J092016l769338q852422j4236867k0530880k7297854l1932116l1756341
1146.1F03100181k7432621k2364855j8582821j4899611r700656l239453L215552Q450746
$$ y = [803005934, 802980125, 802387834, 801563382, 800947607, 801139176, 802685618, 805374682, 807880163, 808573544, 806263328, 800179124, 789921880, 775569499, 758438885, 741689205, 728725970, 720823765, 717154264, 716616869, 719178319, 725606561, 736049771, 749352872, 763588905, 776514113, 786244750, 792225659, 795070946, 795855761, 795564353, 794603884, 792895079, 790161431, 786204398, 781157076, 775201142, 768307090, 760360837, 751228452, 740742266, 728938758, 716772377, 706593394, 701475382, 702958405, 709572017, 718469441, 727495968, 735262513, 740383983, 741475999, 737706661, 728854239, 714617372, 694086492, 666788638, 634856522, 603100181, 575667560, 553302705, 534719884, 519820273, 510119617, 506880164, 510095716, 518546462]
1162.4E18546462J1931062J3790548J4522552J4998496J5967726J7375291J8540442
1176.7F25672579J9097626J8963158J8077374J6656279J4891267J2839019J0697842
1191G36895144Q725345O895065N184472L663480K247513R93430J8418p67469j458645
1209.4G62396753k076030k584159k969146l434301m098534m792392n325973n602718
1225.7G31513500n619049n541622n516053n463004n389809n172909m366517k855003
1242F91589534j131654O5268M19855K70188K46584P19726J601279K609491L520847
1260.3F99911118M028677L978730L889441M482448O217361Q841932J1413455J2954354
1276.7G55717516J2906372J1384964R009183O624460N106568M861832N391717N758762
$$ y = [518546462, 530477524, 544268072, 558790624, 573789120, 589756846, 607132137, 625672579, 644770205, 663733363, 681810737, 698467016, 713358283, 726197302, 736895144, 745620489, 752515554, 757700026, 761363506, 763611019, 764604449, 764622867, 763855398, 762396753, 760320723, 757736564, 754767418, 751333117, 747234583, 742442191, 737116218, 731513500, 725894451, 720352829, 714836776, 709373772, 703983963, 698811054, 694444537, 691589534, 690457880, 690523148, 690943003, 691213191, 691459775, 692179501, 693780780, 696390271, 699911118, 703939795, 707918525, 711807966, 716290414, 722507775, 731349707, 742763162, 755717516, 768623888, 780008852, 789018035, 795642495, 800749063, 805610895, 811002612, 816761374]
1293H16761374N320907M184187L059506K573133K680659K930939L138602L237188L225624
1311.3H47112119L122509K674699J832902Q54671j60098q93414r87470o99342m21047
1329.7H52435529k86400k04802l4332L12567R44793J505673J452982R24409J78754
1348H57229173p27773j500010j860678j805306j665830j849473k227902k426923k783596
1366.4H40381682l641009m413605m985154n259692m274011j887620J266003L781140
1382.7H20967734L968060J833320j005173k561927k465844j039624J339316L933549
1399H24969411N726039O426335P212579P041931N596697M062295K608955J333773M47452
1417.4H65425467m5061o83009j674414l048956m847408o895840p642865o403804n031645
$$ y = [816761374, 822082281, 826266468, 829325974, 831899107, 834579766, 837510705, 840649307, 843886495, 847112119, 850234628, 852909327, 854742229, 855596900, 855436802, 854543388, 853555918, 852856576, 852435529, 852149129, 851944327, 851909995, 852222562, 853167355, 854673028, 856126010, 857050419, 857229173, 856501400, 855001390, 853140712, 851335406, 849669576, 847820103, 845592201, 843165278, 840381682, 836740673, 832327068, 827341914, 822082222, 817808211, 815920591, 817186594, 820967734, 824935794, 826769114, 825763941, 823202014, 820736170, 819696546, 821035862, 824969411, 830695450, 837121785, 844334364, 851376295, 856972992, 861035287, 863644242, 864978015, 865425467, 865380406, 864697397, 863022983, 859974027, 855126619, 848230779, 840587914, 834184110, 829152465]
1435.7H29152465m385591m980862o938219q537412q266568o227791k748251j39058
1452G86928713N80848J312732L556669M121006L326475M077673P136047J0311067J3255298
1470.4H34606528J6972781J6718924J3527929J1923492J0595799Q636832O097078M230023
1486.7I23309386L700852L789962L095924K287209K238512K166093J697659J062394
1503I43347991N04016O57082J305044J258731Q63909O27697P51853P82430Q04424Q25167
1523.4I51728344N55515N45323M80175J17600J2815K14815P2241k04205O7055N52833
1543.8I54142511Q24988P20799O04689O74367O73950M20987K07663R56893J174628
1562.2I60401475O11067K53260N2035m5836r9063n68926j236796r55403m1425P21693
$$ y = [829152465, 824766874, 819786012, 812847793, 804310381, 796043813, 789816022, 787067771, 786928713, 787509561, 788822293, 792378962, 796499968, 799826443, 803904116, 811040163, 821351230, 834606528, 851579309, 868298233, 881826162, 893749654, 904345453, 912982285, 919079363, 923309386, 927010238, 930800200, 933896124, 936183333, 938421845, 940587938, 942285597, 943347991, 943852007, 944509089, 945814133, 947072864, 947936773, 948564470, 949316323, 950098753, 950903177, 951728344, 952283859, 952829182, 953309357, 953426957, 953439772, 953654587, 953726828, 953522623, 953589678, 954142511, 954967499, 955688298, 956292987, 956967354, 957641304, 958062291, 958269954, 959226847, 960401475, 961012542, 961265802, 961317837, 961272001, 961172938, 960604012, 959367216, 958411813, 958370388, 959092081]
1582.6I59092081J095175R19938N35369J36793l06249p33852j025498q47876j85430
1600.9I58680451M75883N46754J76191j57773l46125n36441q78215j073599q01623
1619.3I56085503p47323r28163q04902p09354p70569p69556q32438q65102l91245j26779
1639.7I49140072m17292p65443r84967o02722j63496l82900q8453P54356O26803J89662
1660.1I47305620j9014j1206k16424o44565p28249o91474j100957j592517j946032
1678.4I40355182k510667l560186m841387m135966l301561l511906l375411m092157
1694.7I11025941n063414o117165q947075r563803j1254013j5740871j9249738k3619592
1711.1H11470270l0128896l9956033n5576027n9337616m5836627l6470533k7233481
$$ y = [959092081, 960187256, 961107194, 961642563, 961779356, 961473107, 960739255, 959713757, 958865881, 958680451, 959156334, 959703088, 959879279, 959721506, 959375381, 958838940, 957960725, 956887126, 956085503, 955338180, 954410017, 953605115, 952895761, 952125192, 951355636, 950523198, 949658096, 949266851, 949140072, 948722780, 947957337, 946972370, 946369648, 946206152, 945823252, 945734799, 946489155, 947115958, 947305620, 947286606, 947275400, 947058976, 946414411, 945686162, 944994688, 943893731, 942301214, 940355182, 937844515, 934284329, 929442942, 925306976, 922005415, 918493509, 915118098, 911025941, 905962527, 899845362, 890898287, 881334484, 870080471, 854339600, 835089862, 811470270, 781341374, 741385341, 685809314, 626471698, 580635071, 544164538, 516931057]
1725.3E16931057j4042377k365530P814348K2127568L4948349L7179769M7128915N5511177
1741.6G05233276N2645802M7483087M0876448L4606815K7054190J7757654J1714638
1755.9I37371910Q726835O198883M839361L625393K469480J972675J755953J568317
1772.2I68528807J406312J261056R67860Q35955P45475O53982M56870K36571O6280
1790.6I75159168L08693O32465O44087O23763O84679R45210R05454O30319L93927L30091
1811I81257856L59476L86178L48747K94089J58191o378J15097K40206K78771L77953
1831.4I83810186L49045J68443J33932Q1956o4433n0962J70529L57688K82585P7725
1851.8I85316694m3333L4869O7651M8280M2677N603j29283j94907J58370L75211J93834
$$ y = [516931057, 502888680, 500523150, 508337498, 530465066, 565413415, 602593184, 649722099, 705233276, 757879078, 805362165, 846238613, 880845428, 907899618, 925657272, 937371910, 946098745, 952297628, 957136989, 960762382, 963231862, 965204537, 966960490, 968528807, 969935119, 971196175, 972164035, 972999990, 973745465, 974399447, 974856317, 975092888, 975159168, 975467861, 976100326, 976744413, 977368176, 978052855, 978998065, 979903519, 980533838, 980927765, 981257856, 981617332, 982003510, 982352257, 982646346, 982804537, 982798159, 982913256, 983153462, 983432233, 983810186, 984159231, 984327674, 984461606, 984543562, 984479129, 984428167, 984598696, 984956384, 985238969, 985316694, 985273361, 985308230, 985375881, 985424161, 985466838, 985472441, 985343158, 985148251, 985306621, 985681832, 985875666]
1874.2I85875666P5400R9182J6391n2809p4625j12474q8513J5735O8188j0133N424
1896.6I85817432R7692J00732p689n9306j4842K205L7134R9421K9802j13070r5248
1919.1I85894263k7538O1453J95920J77324L5405o6876r7096m8101K7120J192j05917
1941.5I86047149n2691Q5712J5795o6698Q226J35123J47462m291j67370j49965o1751
1963.9I85936701j20580r3043P7367J19627Q7618R1553M2975q523m232l3200o6936
1986.4I86029327o7711r0539q0765J5438N5969r954p2718k8193K8253l2664n8353P5400
2010.8I85763490J12415p2897j30832J252P3969Q4758P1347J7821r179J7524J8895
2033.3I85948563j9193l9101l5405m470M5597O3062J09375J76370J02043l4869j01626
$$ y = [985875666, 985951066, 986050248, 986066639, 986013830, 985939205, 985826731, 985738218, 985753953, 985822141, 985812008, 985817432, 985915124, 986015856, 986008167, 985948861, 985934019, 985936224, 985973358, 986072779, 986102581, 985989511, 985894263, 985866725, 985928178, 986124098, 986301422, 986336827, 986269951, 986172855, 986124754, 986151874, 986153066, 986047149, 985994458, 986080170, 986095965, 986029267, 986037493, 986172616, 986320078, 986315787, 986148417, 985998452, 985936701, 985816121, 985723078, 985800445, 985920072, 986007690, 986099243, 986142218, 986133695, 986129463, 986096263, 986029327, 985961616, 985871077, 985790312, 985805750, 985861719, 985851765, 985779047, 985750854, 985779107, 985746443, 985688090, 985763490, 985875905, 985803008, 985672176, 985673428, 985747397, 985832155, 985903502, 985921323, 985912144, 985929668, 985948563, 985929370, 985890269, 985854864, 985850394, 985895991, 985959053, 986068428, 986244798, 986346841, 986311972, 986210346]
2055.7I86210346p3373N2035J19984P9214L6121K6584J0669k5630m1545l0815j1385
2078.1I86352205R895M3630N3048M888p1824q9943j1206L6717K2173J4722Q822k1101
2102.6I86352026m3273J0074Q5056P7962J0074o8367j4067J25230P7486J4364P5818
2125.1I86702383P2240K5690K325J1980M7267O6995R0838R2983O3956N5670K9088l2902
2149.5I87228513m3035k2590l5286j3590J9729N067J073O2823P4565j6570j7583M7028
2174I87290144K2292J6630J05321Q3089q0764j48833q9765j9669K7001L3617Q464K7656
2198.5I87275183Q1957R9718O6400K5630m0293r4116j0431Q6248P0930L8087j0669
2220.9I87588644j08540q9288M1247P8618O8665O2525K38n5670l1591K6763N0187M7862
$$ y = [986210346, 986136973, 986189008, 986308992, 986388206, 986424327, 986450911, 986461580, 986435950, 986394405, 986363590, 986352205, 986362100, 986405730, 986458778, 986463666, 986391842, 986301899, 986290693, 986327410, 986349583, 986364305, 986373127, 986352026, 986308753, 986318827, 986403883, 986481845, 986491919, 986423552, 986409485, 986534715, 986612201, 986626565, 986702383, 986774623, 986800313, 986802638, 986814618, 986861885, 986928880, 987019718, 987112701, 987176657, 987232327, 987261415, 987228513, 987185478, 987162888, 987127602, 987114012, 987133741, 987138808, 987139881, 987202704, 987277269, 987260699, 987243116, 987290144, 987312436, 987329066, 987434387, 987517476, 987436712, 987287879, 987198114, 987178445, 987205446, 987239063, 987247527, 987275183, 987357140, 987456858, 987523258, 987548888, 987508595, 987414479, 987404048, 987490296, 987561226, 987599313, 987588644, 987480104, 987390816, 987432063, 987510681, 987579346, 987641871, 987642109, 987586439, 987554848, 987581611, 987631798, 987679660]
2245.4I87679660N6386Tn4717j91092j53423k4259K7240J4782K1874L4392K1994k8193
2269.8I87461030q5175o258O9678m9651j25527l9101P212J967J5378K5988K7954m2140
2294.3I87261355j40131j11103q404r656j08659j73569r9122K4914K742k8670J6988
2316.7I86626685n9605j60336m8817J10388J56641J74463J14024O55J0073J09375R1970
2339.2I87125516m0114j2994L5465j81317k25962Q3805K92360J40906P4804L8504j06692
2361.6I87224281j8358j1385j77741p6652K8790j51158k52008j20163J5616P3612Q7202
2384I86622036J20759J50084O3658q1122j66774j30236j5020L9398K4319J3173N483
2406.5I86645758M1664J12414N9605n3525n7280N603O0260N6624n9J013M0293j1981
$$ y = [987679660, 987736046, 987792432, 987737715, 987546623, 987393200, 987368941, 987396181, 987410963, 987432837, 987467229, 987489223, 987461030, 987375855, 987369597, 987439275, 987389624, 987264097, 987224996, 987232208, 987234175, 987249553, 987275541, 987303495, 987261355, 987121224, 987010121, 987001717, 986992061, 986883402, 986709833, 986610711, 986635625, 986638367, 986609697, 986626685, 986567080, 986406744, 986357927, 986468315, 986624956, 986799419, 986913443, 986914098, 986924171, 987033546, 987125516, 987085402, 987072408, 987107873, 986926556, 986700594, 986784399, 987076759, 987217665, 987292469, 987330973, 987224281, 987205923, 987194538, 987016797, 986940145, 986968935, 986817777, 986565769, 986445606, 986461222, 986534834, 986622036, 986742795, 986892879, 986956537, 986875415, 986708641, 986578405, 986563385, 986602783, 986627102, 986640275, 986645758, 986687422, 986799836, 986859441, 986805916, 986748636, 986754239, 986814499, 986871123, 986871064, 986872077, 986912370, 986900389]
2430.9I86900389m4167K8253K4616l9219k861N0664L2424J6094M7266L3975p8261n1022
2455.4I86918151J22786Q6188q7559q7142M3452P8261m888m9293o4254r2685l8266
2477.9I86824751J6868o0797r6142k2113l4035p9095q0943j27792j48237n0903L0280
2500.3I86171842n6446j91808k02059p7427L4094l517o2644n841R1254R1076J8418
2522.7I85806942j4842l7431l6121M2618P1108O4492J38283J21236K622l7014l3498
2545.1I86088395N186O1810J6570j03295j66833j15753k7120j073l2544o5684p2897
2567.6I85586762J4842J05917l5941j56880k3067O2347j0073q1480o3360k3663n8233
2590I85317171q7619m8220M6312J48356J02461j11222k09690n2273R7692M8339k1636
$$ y = [986900389, 986856222, 986884475, 986909091, 986869872, 986867011, 986917675, 986950099, 986966193, 987013459, 987047434, 986969173, 986918151, 987040937, 987127125, 987039566, 986952424, 986995876, 987074137, 987069249, 987019956, 986955702, 986863017, 986824751, 986841619, 986780822, 986684680, 986662567, 986628532, 986549437, 986468494, 986340702, 986192465, 986141562, 986171842, 986115396, 985923588, 985721529, 985644102, 985678196, 985674679, 985612035, 985606194, 985697448, 985788524, 985806942, 985792100, 985754669, 985718548, 985761166, 985832274, 985896766, 986035049, 986156285, 986158907, 986121893, 986088395, 986093581, 986155391, 986171961, 986068666, 985901833, 985786080, 985758960, 985757887, 985725343, 985659659, 985586762, 985601604, 985707521, 985671580, 985514700, 985491633, 985553980, 985543907, 985462427, 985399067, 985375404, 985317171, 985229552, 985181332, 985227644, 985376000, 985478461, 985367239, 985157549, 985105276, 985202968, 985251307, 985229671]
2612.4I85229671K5392N9723K7776o139k5928J3232R2387N8055l8266P15P7546N2750
2636.9I85566914n3108j25408n6207J8477K98l7491p1227j51456k22087j40726j0491
2659.3I84717488j0252j05262j33931k8372M8161N0187N1558K6703K0861k324q6427
2681.8I84548390j06156r6142j42515r9182K1934K5034o7770j16110o6817L9041J00911
2704.2I84040618j4663j78873j81258j37448j20283j14202j59264k02894j72615j55866
2724.6I82603252k00927k39075k28464j60873j06812l3080J08182J79887J20342L2365
2745I82074797O5029J60932J27137K0623J9789Q0705J7762j24633j80245j34647l9160
2767.4I82088089m3094j60814j95562r9600m9531j39475j73688r7752j18911k40803
$$ y = [985229671, 985255063, 985314786, 985342562, 985336423, 985310495, 985323727, 985416114, 985474169, 985435903, 985436618, 985514164, 985566914, 985513806, 985388398, 985332191, 985350668, 985350966, 985313475, 985242248, 985090792, 984868705, 984727979, 984717488, 984707236, 984601974, 984468043, 984439671, 984487832, 984538019, 984589577, 984616280, 984637141, 984634817, 984548390, 984442234, 984346092, 984203577, 984104395, 984126329, 984151363, 984083593, 983967483, 983900666, 983939707, 984040618, 984025955, 983847082, 983665824, 983528376, 983408093, 983293891, 983134627, 982931733, 982759118, 982603252, 982402325, 982163250, 981934786, 981773913, 981667101, 981634021, 981742203, 981922090, 982042432, 982074797, 982139826, 982300758, 982427895, 982448518, 982468307, 982549012, 982566774, 982442141, 982261896, 982127249, 982088089, 982044995, 981884181, 981688619, 981589019, 981539488, 981400013, 981226325, 981128573, 981009662, 980768859]
2787.8I80768859k79307k29478k35617l10540l41356k84016k87652l73423l72589l39210
2808.2I77715671l75032m72367o02901o78480p57456q09848p21335p32184r73046j206875
2828.6I70386147j330196j483858j848459k478123l230572m036128m826546n297482
2844.9I45854783n238473m693628l950774l534973l814697m645884n498708n870759
2861.2I08606887n692482n387843n520880o004930n489885k340913L289163Q664846
2877.6H90123963J0816813R448826O331146L033817J76310j975536l187001l542602
2893.9I11225736l353238k949953k695799k763390l119112l725171m482984n201042
2910.2H82935047n619764n680084n574763n497456n618453n920350o198943o163776
$$ y = [980768859, 980489552, 980260074, 980024457, 979713917, 979372561, 979088545, 978800893, 978427470, 978054881, 977715671, 977340639, 976868272, 976265371, 975586891, 974829435, 974019587, 973298252, 972566068, 971593022, 970386147, 969055951, 967572093, 965723634, 963245511, 960014939, 955978811, 951152265, 945854783, 940616310, 935922682, 931971908, 928436935, 924622238, 919976354, 914477646, 908606887, 902914405, 897526562, 892005682, 886000752, 880510867, 878169954, 881459117, 890123963, 900940776, 910389602, 916720748, 919754565, 919930875, 917955339, 914768338, 911225736, 907872498, 904922545, 902226746, 899463356, 896344244, 892619073, 888136089, 882935047, 877315283, 871635199, 866060436, 860562980, 854944527, 849024177, 842825234, 836661458]
2926.5H36661458n438685l766656j250983J795769M696489O238222N651772L261029
2942.8H47848415q7142l816008p716954j1137783j2825907j1749446p501602q62241
2959.1G92151332O194353J1911690J5535176J7132819J7161369J6117334J4573753
2973.4H90777826J2832165J0955513R269416P884204O705463N736232M937351M350006
2989.7I53448176L839732L257155K676547K246379K005220J756132J415789J128256
3006I71773386J004875R28878Q41022P52449O05047M55379L27885L00706L82542L07858
3026.4I77680027J31250J39654K12729J54376J00672J34528R9062M8757R2149O3479
3046.8I78856683k8312K6047J38521N8591n7518k444Q1003P4565K8670M1783O8128
$$ y = [836661458, 831222773, 827456117, 826205134, 828000903, 832697392, 838935614, 844587386, 847848415, 847761273, 843945265, 836228311, 825090528, 812264621, 800515175, 793013573, 792151332, 798345685, 810257375, 825792551, 842925370, 860086739, 876204073, 890777826, 903609991, 914565504, 923834920, 931719124, 938424587, 944160819, 949098170, 953448176, 957287908, 960545063, 963221610, 965467989, 967473209, 969229341, 970645130, 971773386, 972778261, 973707139, 974548161, 975300610, 975905657, 976361036, 976688921, 976989627, 977372169, 977680027, 977811277, 977950931, 978163660, 978318036, 978418708, 978553236, 978652298, 978701055, 978793204, 978856683, 978828371, 978854418, 978992939, 979051530, 978994012, 978991568, 979072571, 979147136, 979175806, 979217589, 979285717]
3069.2I79285717K623m9711j1265J23024K96056K14815K8670L5346L397n7697Q941
3091.7I79879916K9385n4717r0122J2159J53303R6083r4831j40906l8266O7949R9183
3114.1I79919136J31547P4863j69634k15471O5565J50561j10984k15053r1791l159
3134.5I79535580K2471r3878j90735r0420k7299j11937j51515r4712j30355k37346
3154.9I78429854j99020m8876j18851l11614j31189J50382L5763j92225k39492k27093
3175.3I77147639j56462n2095j00911j94668j34886n5492j04963j28031o7175n1617
3195.7I76101339q5771j10030r5725j12951k22862k36869o1989J1146p7724r9838m4405
3218.1I74964321n7280j13905n2094n246o0617n5373j6272m1724j32381k11358k07305
$$ y = [979285717, 979288340, 979238629, 979227364, 979350388, 979646444, 979861259, 979889929, 979925275, 979928672, 979870975, 979879916, 979909301, 979854584, 979764462, 979776621, 979929924, 980026007, 979931176, 979790270, 979752004, 979819953, 979919136, 980050683, 980125546, 979955912, 979740441, 979806006, 979956567, 979845583, 979630530, 979538739, 979535580, 979558051, 979464173, 979273438, 979183018, 979155719, 979043782, 978892267, 978797555, 978667200, 978429854, 978230834, 978181958, 978063107, 977751493, 977620304, 977770686, 977806449, 977614224, 977374732, 977147639, 976991177, 976939082, 976838171, 976643503, 976508617, 976453125, 976348162, 976220131, 976152956, 976101339, 976015568, 975905538, 975809813, 975696862, 975474000, 975237131, 975175142, 975186288, 975108564, 975008726, 974964321, 974907041, 974793136, 974741042, 974735796, 974675179, 974619806, 974603534, 974561810, 974429429, 974218071, 974010766]
3240.6I74010766j42336j06514j09732j00672j18196j00076l0995j10924k53141j94430
3260.9I72743750m4525l3915j01626o8367n96m2438o1751m1544p9155m7266N8472J25587
3285.4I72406626Q9228j2934q7142r2924q583J21772J36137n6803j18673P9870K05815
3307.8I72662389J54972M0830m113R656Q0406J22071K6226p630r834p0453K1934K14041
3332.3I73240495K11000R3222Q4400Q2850R597r8169j27077N5432L02911L59654J47522
3354.8I74361837l517Q4937J67668K15828K11358J17660Q6367O9499m0710k8372K23458
3377.2I75466013L67165J72674l6239N126J07765R8169Q4102J06573M9114r775n1498
3399.6I76359189m7207P3552J61767J66535O3718O198P5520n603j58549o1392J64210
$$ y = [974010766, 973868430, 973761916, 973652184, 973551512, 973433316, 973333240, 973302245, 973191321, 972938180, 972743750, 972699225, 972665310, 972563684, 972495317, 972494721, 972452283, 972390532, 972348988, 972269833, 972222567, 972281039, 972406626, 972495854, 972482920, 972395778, 972302854, 972294271, 972416043, 972552180, 972495377, 972376704, 972456574, 972662389, 972817361, 972858191, 972854078, 972863734, 972944140, 973066211, 973092437, 973084807, 973074973, 973004520, 973026454, 973240495, 973451495, 973544717, 973629117, 973711967, 973721564, 973623395, 973496318, 973551750, 973854661, 974214315, 974361837, 974358320, 974443257, 974610925, 974826753, 975038111, 975155771, 975242138, 975311637, 975270927, 975242555, 975466013, 975833178, 976005852, 975969613, 975974739, 976082504, 976180673, 976264775, 976371348, 976420462, 976410687, 976359189, 976311982, 976385534, 976547301, 976713836, 976777554, 976783752, 976859272, 976853669, 976695120, 976633728, 976797938]
3422I76797938J67370o5088k17676j65165j63793k75553j93953R1791J21057l6836
3442.4I76060092n8710k2352J82450L61562L70681M32432L77714K68519L17633L52562
3462.8I78642583K56061J32442K51353N09381M57048K26200Q3983o9141j41323N066
3483.2I80353653J54078K05040K65718J73092k3842k5094J13607J80006J27852J03354
3503.6I81627464O1214o3538N9068L00050K49922J23084Q0704K2710l2545j26540j06156
3526.1I82195437J69456L33369K18272J27196K21670K69890O0737j19031p5876L9816
3546.4I83440936J29461J46389J47462J46031R8586R2685J04845q6248l19719q166
3566.8I83892262N59747O18160M81307M25399L26931J61350j1563k06590l38316j28209
$$ y = [976797938, 976965308, 976900220, 976682544, 976517379, 976353586, 976078033, 975884080, 975975871, 976096928, 976060092, 976001382, 975979030, 976161480, 976523042, 976893723, 977326155, 977703869, 977972388, 978290021, 978642583, 978898644, 979031086, 979282439, 979791820, 980248868, 980475068, 980559051, 980489910, 980348587, 980353653, 980507731, 980712771, 980978489, 981151581, 981127739, 981102645, 981216252, 981396258, 981524110, 981627464, 981688678, 981625140, 981684208, 981984258, 982234180, 982357264, 982437968, 982460678, 982428133, 982301593, 982195437, 982364893, 982698262, 982916534, 983043730, 983265400, 983535290, 983596027, 983476996, 983401120, 983440936, 983570397, 983716786, 983864248, 984010279, 984108865, 984201550, 984306395, 984220147, 983900428, 983892262, 984452009, 985070169, 985551476, 985976875, 986303806, 986465156, 986453593, 986247003, 985908687, 985780478]
3587.2I85780478L80516N81979L63052P6056K0802J05381J52468J15574j23859k80380
3607.6I87172067o199J25349o4612n6028J79470L70681K80559P5340j27911j87517
3628I87761199J59622L61919M03464M06980J10984j54376j00195j05560m05908m49597
3648.4I87988532K20000O85871O18517M43817L27467L12388K11239o4194k88546k75016
3668.8I90180075j2994L4571l8087K82049M85003K87294N2095l4333k40385l78072
3689.2I90617216J25348N01633L91483K22206J00017N1558R0063N2869k5332n4956
3709.6I92072105n0723O1691K57551J90020j72257l51847k95996p8738L11673L43501
3730I92286980k43902o00457k8730L26634Q8155k47180l06547J78277L01540n1856
$$ y = [985780478, 986160994, 986742973, 987106025, 987182081, 987202883, 987308264, 987460732, 987576306, 987452447, 987172067, 987165868, 987291217, 987226605, 987170577, 987350047, 987720728, 988001287, 988076627, 987948716, 987761199, 987920821, 988282740, 988686204, 989093184, 989204168, 989049792, 988949597, 988844037, 988438129, 987988532, 988208532, 988894403, 989512920, 989956737, 990284204, 990596592, 990807831, 990743637, 990455091, 990180075, 990167081, 990201652, 990163565, 990445614, 990930617, 991217911, 991270006, 991235673, 990995288, 990617216, 990742564, 991244197, 991635680, 991857886, 991957903, 992009461, 992099524, 992152393, 992127061, 992072105, 992021382, 992083073, 992340624, 992530644, 992358387, 992006540, 991710544, 991631806, 991943479, 992286980, 992043078, 991442621, 991413891, 991740525, 991828680, 991581500, 991274953, 991453230, 991754770, 991702914]
3750.4I91702914j35898J44124K73823L83497M72426K08140j71066k38359q0883q822
3770.8I92549896J08838K18153P7963j22070o7234R0718J18375P8440P4029P5876m0233
3793.2I93162751k14875l20196m00543k45035P8559P4447K30729M37856J43111k03610
3813.6I92743194l41952k85029o2645J78934J99019L5823p4744j23144r6619L0697
3834I92203534R894k43247k44498J81496M86970K85983q3088l41356m75228J4543L46005
3856.4I92141008P2658k5570k3305M9948J43469o2347k9206K22266N1319j56522r0301
3878.9I92293417J27316K40445R7931j11461j52946n7876P9453J41263q9824m98891
3899.2I92068827n45502q4638N78999P02024J97291j18971j08659j29521j10507j013
$$ y = [991702914, 991567016, 991711140, 991984963, 992368460, 992840886, 993049026, 992877960, 992639601, 992558718, 992549896, 992658734, 992876887, 992954850, 992832780, 992765546, 992856264, 992974639, 993053079, 993127108, 993202984, 993162751, 992947876, 992627680, 992227137, 991982102, 992060661, 992135108, 992365837, 992803693, 992946804, 992743194, 992401242, 992116213, 992053568, 992232502, 992431521, 992467344, 992392600, 992269456, 992172837, 992203534, 992213428, 991970181, 991725683, 991907179, 992394149, 992680132, 992597044, 992255688, 991780460, 991795003, 992141008, 992213666, 992188096, 992164791, 992214739, 992358208, 992295861, 992266655, 992488921, 992540240, 992383718, 992293417, 992420733, 992661178, 992759109, 992647648, 992494702, 992436826, 992516279, 992657542, 992567718, 992068827, 991523325, 991438687, 992017686, 992719710, 992917001, 992798030, 992689371, 992559850, 992449343, 992448330]
3919.6I92448330m8101j12295J84834L40342k0206k15649m2439O8903O1512K4319L7789
3942.1I92727339k3842j91807j32799J44898K70784J22547q6784j22309K206K50756
3962.5I92960989M00544o318m29213k09690K2948k3126l2664n9783m4644L4511J1146
3984.9I92624700p6175j28865m4048O5029J46449K65240
3997.1I92852330
$$ y = [992448330, 992400229, 992287934, 992472768, 992813110, 992792904, 992577255, 992534816, 992603719, 992665231, 992689550, 992727339, 992703497, 992511690, 992378891, 992523789, 992794573, 992917120, 992830336, 992708027, 992710233, 992960989, 993361533, 993355215, 992926002, 992716312, 992739260, 992716134, 992683470, 992623687, 992579043, 992613554, 992624700, 992548525, 992419660, 992375612, 992440641, 992587090, 992852330]
##END=$$ End of the data block
