##TITLE=Lona PVC Banner - Lado branco $$ Begin of the data block
##JCAMP-DX=5.00 $$ ACD/SpecManager v 10.08
##SPECTROMETER/DATA SYSTEM=Alpha
##DATE=25 Aug 2016 08:41:54
##DATA TYPE=INFRARED SPECTRUM
##DATA CLASS=XYDATA
##ORIGIN=
##OWNER=
##NPOINTS=1667
##FIRSTX=599.57470703
##LASTX=3997.16503906
##MAXX=3997.16503906
##MINX=599.57470703
##MAXY=0.97756690
##MINY=0.23037076
##XFACTOR=1.0000000000
##YFACTOR=1.000000000000000e-9
##FIRSTY=0.36053771
##DELTAX=2.03937006
##XUNITS=1/CM
##YUNITS=ARBITRARY UNITS
##XYDATA=(X++(Y..Y))
599.6C60537708q619875m026502P72863L997535N365491N594015N391329N304397N526751
$$ 360537708 351917833 347891331 348664194 352661729 358027220 363621235 369012564 374316961 379843712
617.9C79843712N408823M355848K674431Q39382r97186k143293j519829R74536N272597
$$ 379843712 385252535 389608383 392282814 393122196 392125010 389981717 388461888 389436424 394709021
636.3C94709021R941548J2106806J0825872Q455188P119238O481111O364256P024467
$$ 394709021 404650569 416757375 427583247 436038435 443157673 449638784 456003040 463027507
652.6D63027507O868959M294842R07421j489967k951920l273875l639131m777521l455341
$$ 463027507 469896466 474191308 475098729 473608762 470656842 467382967 463743836 458966315 455510974
671D55510974j838118q85785L12210J346588J832038J700163J267075J068443J635462
$$ 455510974 453672856 452787071 453099281 454445869 456277907 457978070 459245145 460313588 461949050
689.3D61949050K811581M052431N139619N383462M246354K491831J428187N31733l982275
$$ 461949050 464760631 468813062 473952681 479336143 483582497 486074328 487502515 488034248 484051973
707.7D84051973j0120064P61777L0373543M3520987K8571487J0672331J927673j800596
$$ 484051973 473931909 474693686 505067229 548588216 577159703 587832034 589759707 587959111
724E87959111l060282p65502M429162O798029L094553k722263n923867m634917M83692
$$ 587959111 584898829 584133327 588562489 595360518 598455071 595732808 589808941 585174024 585657716
742.3E85657716O870031J1876106J4135957J3725043J1729061R401620P087171M909396
$$ 585657716 592527747 604403853 618539810 632264853 643993914 653395534 660482705 665392101
758.6F65392101L077507K110720K278327K890587L441692M154801N006135N459606
$$ 665392101 668469608 670580328 672858655 675749242 679190934 683345735 688351870 693811476
775F93811476N307257N091012N274236N401254N596876O191790O590664O360829N765140
$$ 693811476 699118733 704209745 709483981 714885235 720482111 726673901 733264565 739625394 745390534
793.3G45390534N376399N932450P341802Q377374Q372187P331193O045043N174279
$$ 745390534 750766933 756699383 764041185 772418559 780790746 788121939 794166982 799341261
809.6G99341261M448951L687858L057421K208828R05455l46303j662434k947509l372848
$$ 799341261 803790212 807478070 810535491 812744319 813649774 813303471 811641037 808693528 805320680
828H05320680k235710j01388J733959K519786K418339J786232J59860m178941q253098
$$ 805320680 803084970 802983582 804717541 807237327 809655666 811441898 811601758 807422817 799169719
846.3G99169719l581226L532648K098620k620399o914556j2750685k0177305l1639993
$$ 799169719 795588493 799121141 801219761 798599362 791684806 778934121 758756816 727116823
862.7G27116823n2590012q9156866j25428677j06935710j8922508O6328496R6829146
$$ 727116823 674526811 585369945 459941268 353005558 334083050 400411546 497240692
876.9D97240692Q8924498O9302261N6017339N2240252M4112385K7872562J4026642
$$ 497240692 586165190 655467451 711484790 763725042 807837427 835709989 849736631
891.2H49736631O785810L228903J186967j95384j307965k180099k699137k822101k495766
$$ 849736631 856522441 859751344 860938311 860742927 859434962 857254863 854555726 851733625 849237859
909.6H49237859k181351k377927l133118l923059m128575l563166k657413k153039
$$ 849237859 847056508 844678581 841545463 837622404 833493829 829930663 827273250 825120211
925.9H25120211k340854k860844l371894l888667m400968n028606n761325o645024
$$ 825120211 822779357 819918513 816546619 812657952 808256984 803228378 797467053 790822029
942.2G90822029p506490q009851q538067r208858r205759p702291m651129j074850
$$ 790822029 783315539 775305688 766767621 757558763 748353004 740650713 735999584 734924734
958.5G34924734J930833M274308N915225O600916O548226O430686O664812P123947
$$ 734924734 736855567 741129875 747045100 753646016 760194242 766624928 773289740 780413687
974.8G80413687P630527P912219P672667O917417N830288M458547L075600K189993
$$ 780413687 788044214 795956433 803629100 810546517 816376805 820835352 823910952 826100945
991.1H26100945K095819K542973K926051K879739K481401K058446J703084J291334
$$ 826100945 828196764 830739737 833665788 836545527 839026928 841085374 842788458 844079792
1007.4H44079792Q55685M89712J1026n85854j013338j128495j105070j169741j231194
$$ 844079792 844935477 845425189 845436215 844850361 843837023 842708528 841603458 840433717 839202523
1025.8H39202523j405895k200603m019499o649732q465648o704807q60095N481422
$$ 839202523 837796628 835596025 831576526 824926794 816461146 809756339 808896244 814377666
1042.1H14377666Q130669O440640K897560k80559k565205m424095o418765q873760
$$ 814377666 822508335 828948975 831846535 831565976 829000771 824576676 818157911 809284151
1058.4H09284151j1929751j5909076k0866334k5284290k6140988k0833671r528876
$$ 809284151 797354400 781445324 760578990 735294700 709153712 688320041 678791165
1072.7F78791165M334450J6250849K2855282K2856354J7891467J1497140O315351K947449
$$ 678791165 683125615 699376464 722231746 745088100 762979567 774476707 780792058 783739507
1089G83739507J002550n5968p73669j438796k098739k492965k320826j938462k672493
$$ 783739507 784742057 784686089 783912420 782473624 780374885 777881920 775561094 773622632 770950139
1107.4G70950139n759895j0859072j6142607j9311905j8773019j4424384p916331j554191
$$ 770950139 765190244 754331172 738188565 718876660 700103641 685679257 677762926 676208735
1123.7F76208735L618776P655502J0251581J0724962R414911Q278191R303272J2349546
$$ 676208735 679827511 687483013 697734594 708459556 717874467 726152658 735455930 747805476
1140G47805476J5214145J5826643J3863981J0531127P239163M749894K952993J047492
$$ 747805476 763019621 778846264 792710245 803241372 810480535 815230429 818183422 819230914
1156.3H19230914j312613l324032l593683j473785J498997L039837K743721J535773
$$ 819230914 817918301 814594269 811000586 809526801 811025798 814065635 816809356 818345129
1172.6H18345129J78993r73820j967371l079355m318297n527079o567836o964266o509006
$$ 818345129 818524122 817550302 815582931 812503576 808185279 802658200 796090364 789126098 782617092
1191G82617092n506992m169226k709269j324416j26481O26088P93159M85360m3511
$$ 782617092 777110100 772940874 770231605 768907189 768780708 769406796 770199955 770685315 770641804
1209.4G70641804n69821j184880k362073m873812r278476j5577019k2552847k7070821
$$ 770641804 770071983 768887103 766525030 761651218 752372742 736795723 714242876 687172055
1225.7F87172055k5966048k0452380j5671969j4447927j5060783j4998316j3949752
$$ 687172055 661206007 640753627 625081658 610633731 595572948 580574632 566624880
1239.9E66624880j2839079j2172580j1960864j2277007j3121545j2835175q155406
$$ 566624880 553785801 541613221 529652357 517375350 504253805 491418630 483263224
1254.2D83263224M76659P073670Q306444O675720M658282K616942O89685o34253o57916
$$ 483263224 483739883 490813553 499119997 505795717 510453999 513070941 513760626 513126373 512468457
1272.6E12468457Q49724L163755N102754N542457M077911J459658j28627J708389P175863
$$ 512468457 513318181 516481936 521584690 527127147 531205058 532664716 532536089 534244478 541420341
1290.9E41420341J3513803J7588019J8304110J6404510J3658583J1344611R394288
$$ 541420341 554934144 572522163 590826273 607230783 620889366 632233977 641628265
1305.2F41628265O987632L817081M73023k235353m115761n347669o197750p041336
$$ 641628265 648615897 652432978 652906001 650670648 646554887 641207218 635009468 627968132
1321.5F27968132p748723p901668p594109p231295o386041m029811N75781O013095
$$ 627968132 620219409 612317741 604723632 597492337 591106296 587076485 587652266 593665361
1337.8E93665361Q520484N731225p4267n865514j0379970j2704492j2572408j0922491
$$ 593665361 602185845 607917070 607842803 601977289 591597319 578892827 566320419 555397928
1354.2E55397928r147108q175671q748591j0825813j2726366j3904184j5784711j7364532
$$ 555397928 546250820 538075149 529326558 518500745 505774379 491870195 476085484 458720952
1370.5D58720952j8417746j9223511j7212420j3784856j1502206j0291875j0342240
$$ 458720952 440303206 421079695 403867275 390082419 378580213 368288338 357946098
1384.7C57946098j2106449j3443470j2486398j1896610j1815548r795755q028656q098990
$$ 357946098 345839649 332396179 319909781 308013171 296197623 286401868 278373212 270274222
1401.1B70274222r187311j0290504r095266o376028l778726j175627J095250K669379
$$ 270274222 261086911 250796407 241701141 235325113 231546387 230370760 231466010 234135389
1417.4B34135389M044652M702106O247282R242759J0503620R491086Q044898P800490
$$ 234135389 238180041 242882147 249129429 258372188 268875808 278366894 286411792 294212282
1433.7B94212282R733408J1056364Q409590O336033N685270N809158O606251O870717
$$ 294212282 303945690 315002054 323411644 329747677 335432947 341242105 347848356 354719073
1450C54719073O519585O465465Q450091J1175722J0115266R659499J2263894J4357000
$$ 354719073 361238658 367704123 376154214 387329936 397445202 407104701 419368595 433725595
1466.3D33725595J3649583J4078498J7663270J9142509J7578214J6861916J6748846
$$ 433725595 447375178 461453676 479116946 498259455 515837669 532699585 549448431
1480.6E49448431J6683876J5800357J5841484J7732203J9059002J6708017J5278935
$$ 549448431 566132307 581932664 597774148 615506351 634565353 651273370 666552305
1494.9F66552305J6873837J6486466J3938486J1574626J1881829J5456914J3580323
$$ 666552305 683426142 699912608 713851094 725425720 737307549 752764463 766344786
1509.1G66344786J0349810R921908R844303R907723R338259R442449Q933604P370472
$$ 766344786 776694596 786616504 796460807 806368530 815706789 825149238 834082842 841453314
1525.5H41453314P071674O236851N576968N779982M972279M022538N229593O370246
$$ 841453314 848524988 854761839 860338807 866118789 871091068 875113606 880343199 886713445
1541.8H86713445N924463N851627N291462M795909M152596L409326K539694J972497
$$ 886713445 892637908 898489535 903780997 908576906 912729502 916138828 918678522 920651019
1558.1I20651019J875579J466334J119494Q62897N73933J41442m05491j553774l323316
$$ 920651019 922526598 923992932 925112426 925975323 926549256 926690698 926285207 924731433 921408117
1576.4I21408117k757847K90870L180444M422069L749192K592265J646638O10471o13153
$$ 921408117 918650270 918941140 922121584 926543653 930292845 932885110 934531748 935142219 934529066
1594.8I34529066j500130q38041J332164L331602L628134K741814J776099J150191
$$ 934529066 933028936 932190895 933523059 936854661 940482795 943224609 945000708 946150899
1611.1I46150899Q81553O80446M65215L29077L18467L67105M99845M79042L37899K23339
$$ 946150899 947032452 947712898 948178113 948507190 948825657 949192762 949692607 950171649 950509548 950732887
1631.5I50732887K16841L63410M62294M34935L51608K47538J06155J09911J31011k9087
$$ 950732887 950949728 951313138 951775432 952210367 952561975 952809513 952915668 953025579 953156590 953127503
1651.9I53127503P5281L74079K45750k1637j62959j92523k67267m93348n58078m39823
$$ 953127503 953202784 953576863 953822613 953800976 953638017 953445494 953178227 952684879 952126801 951686978
1672.3I51686978o24239p73668p02918p43628j000165j237631q86619p46429j118482
$$ 951686978 951062739 950289071 949586153 948842525 947842360 946604729 945718110 944971681 943853199
1690.7I43853199j529634k622902m042745n749046r575665j1333466j4642715k0910144
$$ 943853199 942323565 939700663 935657918 929908872 920333207 908999741 894357026 873446882
1707H73446882k4040044k5353491k5400221k4033249k1159887j2948990l288388L085196
$$ 873446882 849406838 824053347 798653126 774619877 753459990 740511000 737222612 740307808
1723.3G40307808P983029J1896372J4716863J6381860K0606339K2699893J8145918
$$ 740307808 748290837 760187209 774904072 791285932 811892271 834592164 852738082
1737.6H52738082J8093110J8419802J5490472J2913585J0631978Q945883P293582N089283
$$ 852738082 870831192 889250994 904741466 917655051 928287029 937232912 944526494 949615777
1753.9I49615777L519833K794504K201259J799226J375437R27388P19130N89550L90887
$$ 949615777 953135610 955930114 958131373 959930599 961306036 962233424 962952554 963542104 963932991
1772.2I63932991K80917K55167J490l28839p10666j451492k724349m273415n653858
$$ 963932991 964213908 964469075 964470565 964141726 963431060 961979568 959255219 954981804 949327946
1790.6I49327946n113066k009689P35759L179193N616367O119370M509807K630055
$$ 949327946 944214880 942205191 942940950 946120143 951736510 957855880 962365687 964995742
1806.9I64995742J402318P62284M67062M00126M11451L50594K11537J53721K86340
$$ 964995742 966398060 967160344 967627406 968027532 968438983 968789577 969001114 969154835 969441175
1825.3I69441175L28839K57433L38733M04954K66194J01924J8895K1160J08718K21908
$$ 969441175 969770014 970027447 970366180 970771134 971037328 971139252 971158147 971179307 971288025 971509933
1845.7I71509933K60413K29716K08796J50680J07229J05202J04964O2108k7239j01269
$$ 971509933 971770346 972000062 972208858 972359538 972466767 972571969 972676933 972739041 972711802 972610533
1866I72610533j27077J2815J80960J94073R9659K9563M0293O1929N1976O0796M8042
$$ 972610533 972483456 972496271 972677231 972871304 972970963 973000526 973040819 973102748 973154724 973215520 973263562
1888.5I73263562L3259Q9526N9784J4484P4446P1823n066K4498L8385o4313q2195l457
$$ 973263562 973296821 973386347 973446131 973460615 973535061 973606884 973601818 973626316 973664701 973600388 973518193 973514736
1913I73514736K9623J1921K384n0664o2883O0142J11579o496j01269n9545k0087q8214
$$ 973514736 973544359 973556280 973558664 973508000 973445117 973505259 973616838 973610342 973509073 973449528 973429441 973341227
1937.4I73341227j72317j63794l1829J09792J18434M2141K4795J12713J38461Q1420
$$ 973341227 973168910 973005116 972973287 973083079 973201513 973243654 973268449 973381162 973519623 973601043
1957.8I73601043P1407J01566N2214j22726j55390l636M7207L4571P3433O8068K0743
$$ 973601043 973672450 973774016 973826230 973703504 973548114 973544478 973591685 973626256 973699689 973767757 973788500
1980.3I73788500K4319O1213J09971J48475R2685m112K4378J53184J32799o6757r0361
$$ 973788500 973812819 973874032 973984003 974132478 974225163 974221051 974245429 974398613 974531412 974464655 974374294
2002.7I74374294L4452O9082R0420O2465n6028j02520m4882m5300o9916K1219Q9467
$$ 974374294 974408746 974477828 974568248 974630713 974574685 974472165 974427283 974381983 974312067 974333286 974422753
2025.1I74422753L4094j3948O974M6968L3260K086k921j2755L219j550L5524J72794
$$ 974422753 974456847 974442899 974449873 974496841 974530101 974532187 974529266 974516511 974519730 974518180 974553704 974726498
2049.6I74726498J40250o4790j40071m8399L6597O0320Q3744M2856k5451l9637o1989
$$ 974726498 974866748 974801958 974661887 974613488 974650085 974710405 974794149 974837005 974811554 974771917 974709928
2072I74709928l4749P4565J46568P6890l3736m2260r000k325M2558P4029L1352O735
$$ 974709928 974675179 974749744 974896312 974973202 974939466 974897206 974888206 974885881 974928439 975002468 975033820 975040555
2096.5I75040555l5882l8326L1591K1279o676l338o2823j05918m0114R2626J05739
$$ 975040555 975004673 974966347 974997938 975019217 975012541 975009203 974946380 974840462 974800348 974892974 974998713
2118.9I74998713o4373j16587m4227l5703o4552j23918j28090l2544N3823O7472M2677
$$ 974998713 974934340 974817753 974773526 974737823 974673271 974549353 974421263 974388719 974442542 974510014 974552691
2141.4I74552691N8889P6712j6273j08838p4923J4603N5135N1737K7001m9651l0577
$$ 974552691 974611580 974688292 974672019 974563181 974488258 974502861 974557996 974609733 974636734 974587083 974556506
2163.8I74556506J19567J63138J07765R1970M1127m3571m7386k265J1504j0014o1452
$$ 974556506 974676073 974839211 974946976 975038946 975080073 975036502 974989116 974986851 974998355 974988341 974926889
2186.2I74926889k8968O3837L2782l0756m5120r001L7313j9849q8334n1260r596l58
$$ 974926889 974897921 974961758 974994540 974963784 974918664 974909663 974946976 974927127 974838793 974787533 974777937 974777579
2210.7I74777579O0141R7692Q5175O9738j4842j11043n5671O2108P9930L2783n5612
$$ 974777579 974837720 974935412 975020587 975090325 975075483 974964440 974908769 974970877 975050807 975083590 975027978
2233.1I75027978j40369j53481p8738K0027P4506P4804K1457Q405K4855k802j9967
$$ 975027978 974887609 974734128 974655390 974675417 974749923 974824727 974846184 974854589 974879444 974876642 974856675
2255.6I74856675k7776p0274q7738m8697J4007O4075L0160p033N1677N7816l9875m7803
$$ 974856675 974828899 974758625 974670887 974622190 974636197 974700272 974730432 974723399 974775076 974832892 974793017 974745214
2280I74745214J1742k8014k4021M6730L9757K1576L2425L4511J5498K2471J4662p2658
$$ 974745214 974756956 974728942 974704921 974751651 974791408 974812984 974845409 974879920 974895418 974917889 974932551 974859893
2304.5I74859893r8288M3094J54436M2856r2745j17838j63973j88231n4956J55986
$$ 974859893 974761605 974804699 974959135 975001991 974909246 974791408 974627435 974439204 974384248 974540234
2324.9I74540234J46985r2209j54435J1563J46210J50204M5121J0788k5809j95861
$$ 974540234 974687219 974595010 974440575 974452138 974598348 974748552 974793673 974804461 974778652 974582791
2345.3I74582791k63631j00374J52409K30789l0279j91450J8894J25349J0908K9862
$$ 974582791 974319160 974218786 974371195 974601984 974571705 974380255 974399149 974524498 974535406 974565268
2365.7I74565268J6033j11818m7505M5419j4067q9645j21773r5844j6153P3612J13368
$$ 974565268 974581301 974469483 974421978 974467397 974453330 974363685 974241912 974146068 974129915 974203527 974316895
2388.1I74316895K9027p6413n6743m7803p2360o56P3969J9193j26302j56820l2306
$$ 974316895 974345922 974269509 974212766 974164963 974092603 974091947 974165916 974185109 974058807 973901987 973869681
2410.6I73869681O020o9141k6107J25647J28865j7285o5804L6359J34766Q4937n2691
$$ 973869681 973875701 973806560 973780453 973906100 974034965 974017680 973951876 973988235 974123001 974207938 974155247
2433I74155247j25170j17480m3154N6148J08480O0558n007K7895K0326q1599n6267
$$ 974155247 974030077 973912597 973869443 973925591 974034071 974094629 974089622 974117517 974137843 974056244 973999977
2455.4I73999977M8518m1365k30611k32517q6844r9302k31862k37703k25842l06904
$$ 973999977 974048495 974007130 973776519 973544002 973457158 973357856 973125994 972888291 972662449 972355545
2475.8I72355545l28243k48909k71321l71694m10199m51207n30482p40289j047373
$$ 972355545 972027302 971778393 971507072 971135378 970725179 970273972 969743490 969003201 967955828
2494.2I67955828j184464j175225j218438j308202j353324j253605r33170m89593j37150
$$ 967955828 966771364 965596139 964377701 963069499 961716175 960462570 959529400 959039807 958902657
2512.5I58902657P9632K50220L63588M39287O11663Q76426J059234J111269J064301
$$ 958902657 958982289 959232509 959596097 960035384 960647047 961523473 962582707 963693976 964758277
2530.9I64758277R07540P79212P65621O42777L68297J82271J00195R7156K11179K75255
$$ 964758277 965665817 966445029 967210650 967853427 968221724 968403995 968504190 968601346 968812525 969087780
2551.3I69087780K07781J01626k205l1412O0618J70112J62542N8114M2319Q7202P391
$$ 969087780 969295561 969397187 969394982 969363570 969424188 969594300 969756842 969814956 969857275 969944477 969951868
2573.7I69951868r2924k8491Q4043O1572j7584j2278K8431L0577P7546J53303J89185
$$ 969951868 969858944 969830453 969914496 969976068 969958484 969946206 969974637 970005214 970082760 970236063 970425248
2596.1I70425248K11179J64569O4254M1365J22428J67370J27733J14798J64211K05934
$$ 970425248 970636427 970800996 970865250 970906615 971029043 971196413 971324146 971438944 971603155 971809089
2616.5I71809089J83940J10150L8504L3558J28984K43068K43008J82927J33514P7724
$$ 971809089 971993029 972103179 972141683 972175241 972304225 972547293 972790301 972973228 973106742 973184466
2636.9I73184466M0412K9743M4882M8936K8312J1384j192o0379q0168M9471J02759
$$ 973184466 973224878 973254621 973299503 973348439 973376751 973388135 973386943 973326564 973246396 973295867 973398626
2659.3I73398626m470p6175r8229j07050q4042m3214k5153j4066L9517K5690q762P7963
$$ 973398626 973394156 973317981 973219752 973112702 973028660 972985446 972960293 972946227 972985744 973011434 973002672 973080635
2683.8I73080635P4685o3420q5354Q822O9618L4273n1856j11640q6844j430p1764j83821
$$ 973080635 973155320 973091900 973006546 973015368 973084986 973119259 973067403 972955763 972868919 972867489 972795725 972611904
2708.3I72611904j18732q4400q5354o1214r5785j23978j09613j20997j50144j38819
$$ 972611904 972493172 972408772 972323418 972262204 972166419 972042441 971932828 971811831 971661687 971522868
2728.7I71522868j11819j01268o1214M6790N1856m0770L5048J21414P1109M7147Q404
$$ 971522868 971411049 971309781 971248567 971295357 971347213 971306443 971341491 971462905 971534014 971581161 971589565
2751.1I71589565o9558K443K13802J84954q3209j51157k5630L8624j0848j14322j97410
$$ 971589565 971520007 971522450 971736252 971921206 971837997 971686840 971661210 971699834 971688986 971574664 971377254
2773.5I71377254j66715o7830n1796j22488k37763k84314k47299k29419k41637l23892
$$ 971377254 971210539 971142709 971090913 970968425 970730662 970446348 970199049 969969630 969727993 969404101
2793.9I69404101m04954l79204l33965m41790o77526q01027q43763r63092j082778
$$ 969404101 968999147 968619943 968285978 967844188 967166662 966365635 965521872 964558780 963476002
2812.3I63476002j032531p05004k99752q3148p0095k19703n30720r47713j331330j703202
$$ 963476002 962443471 961738467 961438715 961355567 961285472 961065769 960535049 959587336 958256006 956552804
2832.7I56552804k287746l115535l924787m652560n635917o952584q070349q333862
$$ 956552804 954265058 951149523 947224736 942572176 936936259 929983675 921913326 913579464
2849I13579464p476330n986094m449785k558470K9624K540230L672123K837658P29442
$$ 913579464 906103134 900117040 895667255 893108785 893138409 895678639 899350762 902188420 902917862
2867.4I02917862j014233q84354J157701L646016N131364N095363L873229K146006
$$ 902917862 901903629 901019275 902176976 905822992 910954356 916049719 919922948 922068954
2883.7I22068954L23414j359820k725422l818930m744470n594969o433188p172704
$$ 922068954 922392368 921032548 918307126 914488196 909743726 904148757 897715569 890542865
2900H90542865p638753p678270p350206o875575o424963n971551n282402m379332l645182
$$ 890542865 882904112 875225842 867875636 861000061 854575098 848603547 843321145 838941813 835296631
2918.3H35296631l224135k801299k120137j042604O32524K926827N415797P456720
$$ 835296631 832072496 829271197 827151060 826108456 826740980 829667807 835083604 842540324
2934.7H42540324Q638024Q671403P555068N624413L090620M3809l149628n573511o310165
$$ 842540324 851178348 859849751 867404819 873029232 876119852 876163661 873014033 867440522 861130357
2953H61130357n330742l295481p24137K162457N023777P263720Q665085R364963R433210
$$ 861130357 855799615 852504134 851779997 853942454 858966231 866229951 874895036 884259999 893693209
2971.4H93693209R157836Q650482P879615P142961O526351N894303N181015M408180
$$ 893693209 902851045 911501527 919381142 926524103 933050454 938944757 944125772 948533952
2987.7I48533952L718257L161729K645313K019823J473725J242399J097619R12428
$$ 948533952 952252209 955413938 958059251 960079074 961552799 962795198 963892817 964805245
3004I64805245P22051N69284N78642O84380O43909M77970L86894L34859K91109K93851
$$ 964805245 965527296 966096580 966675222 967359602 968003511 968481481 968868375 969203234 969494343 969788194
3024.4I69788194K44140J38343Q2075K5273K5093J50681J99616J65403J49905J15633
$$ 969788194 970032334 970170677 970252752 970278025 970303118 970453799 970653415 970818818 970968723 971084356
3044.8I71084356q881j41918l7849J49190O8724j33991k02596j77264q7977K4736L7849
$$ 971084356 971075475 970933557 970895708 971044898 971113622 970979631 970777035 970599771 970511794 970536530 970574379
3067.2I70574379k6584l3855N6267J39892J94132K96772L72231L33368K26617N8532
$$ 970574379 970547795 970513940 970570207 970710099 970904231 971201003 971573234 971906602 972133219 972191751
3087.6I72191751n9307j0669L4690K7478L3498M4465P9214j9192k00689j14799J15395
$$ 972191751 972132444 972121775 972156465 972183943 972217441 972261906 972341120 972321928 972121239 972006440 972121835
3110I72121835J39713R5606J77085J53899l6180j13308o735J19447J32442P2062J6749
$$ 972121835 972261548 972357154 972534239 972688138 972651958 972538650 972531915 972651362 972783804 972855866 972872615
3132.5I72872615N1737J44362N1558j42872j76549j06037o9737j09971j92821j89245
$$ 972872615 972924352 973068714 973120272 972977400 972800851 972694814 972625077 972515106 972322285 972133040
3152.9I72133040r3221r001Q6427R1791m8279m0889J16348J03951p0572j93119j22190
$$ 972133040 972039819 972030818 972117245 972209036 972160757 972119868 972236216 972340167 972269595 972076476 971954286
3175.3I71954286O0380Q9526n2810j27077j7762L5167q2076l9041J22845K9326j59622
$$ 971954286 972014666 972104192 972051382 971924305 971906543 971941710 971859634 971820593 971943438 971972764 971813142
3197.7I71813142r6857P6234Q9169m5002j24395l9100L7312M1664R0062R9421m3154
$$ 971813142 971716285 971792519 971881688 971836686 971712291 971673191 971710503 971752167 971842229 971941650 971898496
3220.2I71898496j63078m2796J00612P3731n36j5199K3365n782o4671r2030p1346n007
$$ 971898496 971735418 971692622 971793234 971866965 971866429 971851230 971874595 971868813 971804142 971712112 971640766 971635759
3244.6I71635759N5671J09553l4750j97649m8875M0292p6234o2287O0082P6532j4305
$$ 971635759 971691430 971800983 971766233 971568584 971519709 971560001 971483767 971421480 971481562 971558094 971543789
3267.1I71543789k5094K325r4652k9326J19150j8656q7500Q7082J73331N8770j58370
$$ 971543789 971518695 971521020 971426368 971397042 971516192 971497536 971410036 971497118 971670449 971729219 971570849
3289.5I71570849k34365j31249j19389j46448p1466n2810p4148j431J3590j05560j09970
$$ 971570849 971336484 971205235 971085846 970939398 970867932 970815122 970740974 970739543 970753133 970647573 970537603
3311.9I70537603O974J8000O3718J45554N8949l040J8418n8889r3699M649K1995m3869
$$ 970537603 970544577 970562577 970626295 970771849 970830798 970827758 970846176 970787287 970693588 970698237 970720232 970676363
3336.4I70676363p0632n1141K146m3988j51098l0637J84536J37985l8803n3048M1604
$$ 970676363 970605731 970554590 970556736 970512748 970361650 970331013 970515549 970653534 970614731 970561683 970603287
3358.8I70603287L6299l8325j9014K2292n5969j63674j27316k5272J8716O3181J36971
$$ 970603287 970639586 970601261 970582247 970604539 970548570 970384896 970257580 970232308 970251024 970314205 970451176
3381.3I70451176J49071O7652m9115j62303r1791J7404n4061o7174q8335r5963M7386
$$ 970451176 970600247 970667899 970618784 970456481 970364690 970382094 970328033 970260859 970172524 970076561 970123947
3403.7I70123947J86324K19166J133j90258p9334m3035j86503k09868k980K14398J81675
$$ 970123947 970310271 970529437 970530570 970340312 970260978 970217943 970031440 969821572 969818592 970032990 970214665
3426.1I70214665J8656l1769m0948j21117m8578J85192J84715N6266L6419j1742Q225
$$ 970214665 970233321 970201552 970160604 970039487 969990909 970176101 970360816 970417082 970453501 970441759 970449984
3448.6I70449984R8288R1493O0201m530O437J83881J92701j5497j04129R7990K92659
$$ 970449984 970548272 970639765 970699966 970695436 970701873 970885754 971078455 971062958 970958829 971056819 971349478
3471I71349478J25646j03414j13547n0962K7001P7546J02758J79887J14918j02878
$$ 971349478 971475124 971371710 971258163 971207201 971234202 971311748 971414506 971594393 971709311 971606433
3491.4I71606433j52230m9054N0365J37926J24335J9073k7597J9014J21415J12891
$$ 971606433 971454203 971405149 971455514 971593440 971717775 971736848 971709251 971728265 971849680 971962571
3511.8I71962571O4552J02758L4035m2200l4631q9168n7340J64390K91526J62363O497
$$ 971962571 972027123 972129881 972163916 972121716 972087085 971997917 971940577 972104967 972396493 972558856 972565353
3534.2I72565353L5942Q4161q4519k22385q1837J19924J70529J62065J69695P4744
$$ 972565353 972601295 972685456 972600937 972378552 972296715 972416639 972587168 972749233 972918928 972993672
3554.6I72993672q2970j02818r596K324n0008J70708M41909K78890J69277K49565J27971
$$ 972993672 972910702 972807884 972798288 972800612 972750604 972921312 973363221 973642111 973811388 974060953 974188924
3577I74188924m8578p3433j52945l11196k54214J14083L76582K37406j04308r5547
$$ 974188924 974140346 974066913 973913968 973602772 973348558 973462641 973839223 974076629 973972321 973876774
3597.4I73876774J50264J70111J23978P8976j7404M0352j7285k28465r9480J74641
$$ 973876774 974027038 974197149 974321127 974400103 974382699 974423051 974405766 974177301 974077821 974252462
3617.8I74252462K29061J39713J10030N6804o8963J46985L73543J83403r8944l13341
$$ 974252462 974481523 974621236 974731266 974788070 974719107 974866092 975239635 975423038 975324094 975010753
3638.2I75010753k97129P0691L68654J80602j77443r5188J19507J37925J72079K31325
$$ 975010753 974713624 974784315 975152969 975333571 975156128 975060940 975180447 975318372 975490451 975721776
3658.6I75721776K23518R5844j07944j69158r9063N4240J80066l9399j49667K37405
$$ 975721776 975945294 976041138 975933194 975764036 975664973 975719213 975899279 975859880 975710213 975947618
3679I75947618L37065N7995r1135j09137o1988K43187L32117J42812L9697j4484m8160
$$ 975947618 976284683 976342678 976251543 976142406 976080418 976323605 976655722 976798534 976838231 976823747 976775587
3701.4I76775587M7803J70826J42217o6936k11298M2081K90811J67310q3268k52783
$$ 976775587 976823390 976994216 977136433 977069497 976858199 976900280 977191091 977358401 977275133 977022350
3721.8I77022350l49283j78993K58148M16040P2777k61485j81914q9407j57892l52264
$$ 977022350 976673067 976494074 976752222 977168262 977241039 976979554 976797640 976708233 976550341 976198077
3742.2I76198077l87490K16723N85675L62635k4200k60114l06189n1141L42250L80098
$$ 976198077 975810587 976027310 976612985 976975620 976951420 976691306 976385117 976333976 976676226 977056324
3762.6I77056324J49251m9115r5308L5346J06633Q8870N7638p4744q8215k861j3352
$$ 977056324 977205575 977156460 977061152 977096498 977203131 977292001 977349639 977274895 977186680 977183819 977170467
3785I77170467N6625J59740J43767L6299j61469k40326j78754k61665k25842L58K17914
$$ 977170467 977227092 977386832 977530599 977566898 977405429 977165103 976986349 976724684 976498842 976499200 976717114
3807.5I76717114K66314Q3148j54495k13861M1842K8491j99258p6711O4730J05739
$$ 976717114 976983428 977066576 976912081 976698220 976740062 976768553 976569295 976492584 976557314 976663053
3827.9I76663053Q1897j7643K3961Q4519l2425q5175N067J16706J10626N1617p331
$$ 976663053 976744950 976727307 976751268 976835787 976803362 976718187 976723254 976839960 976950586 977002203 976994872
3850.3I76994872l47078m57406O4790K30611J43885k2828l7074J60157N4360j7226
$$ 976994872 976647794 976190388 976255178 976485789 976629674 976606846 976569772 976729929 976784289 976767063
3870.7I76767063L6419j22905o5327J0908N7697J72973n9605k02358J9372P7784M1127
$$ 976767063 976803482 976680577 976615250 976626158 976683855 976856828 976797223 976594865 976614237 976692021 976733148
3893.1I76733148J53959O4075l22938o10709m63426J62363N64694L98457N4419k09629
$$ 976733148 976887107 976951182 976628244 976017535 975554109 975716472 976281166 976679623 976734042 976524413
3913.5I76524413k10882L6240K10762J38640j9311J8775J66893J51873m0591k09868
$$ 976524413 976313531 976349771 976560533 976699173 976679862 976698637 976865530 977017403 976976812 976766944
3933.9I76766944m3809J06632k1338p332K1696j29759j57595M6790K11001J31487o4671
$$ 976766944 976723135 976829767 976808429 976801097 976822793 976693034 976535439 976582229 976793230 976924717 976860046
3956.3I76860046k91168k54035J69933K97367q9466k04146Q2910J54674M887j19686
$$ 976860046 976568878 976314843 976484776 976782143 976692677 976488531 976571441 976726115 976731002 976611316
3976.7I76611316j07586P9930Q0228j28449j56641j25706j8894J63436J57833P4446
$$ 976611316 976503730 976583660 976663888 976535439 976378798 976253092 976234198 976397634 976555467 976629913
3997.1I76629913
$$ 976629913
##END=$$ End of the data block
