##TITLE=Lona PVC - THF $$ Begin of the data block
##JCAMP-DX=5.00 $$ ACD/SpecManager v 10.08
##SPECTROMETER/DATA SYSTEM=Alpha
##DATE=23 Aug 2016 12:03:00
##DATA TYPE=INFRARED SPECTRUM
##DATA CLASS=XYDATA
##ORIGIN=
##OWNER=
##NPOINTS=1667
##FIRSTX=599.65820312
##LASTX=3997.72216797
##MAXX=3997.72216797
##MINX=599.65820312
##MAXY=1.03008914
##MINY=0.13581775
##XFACTOR=1.0000000000
##YFACTOR=0.000000010000000
##FIRSTY=0.84763235
##DELTAX=2.03965425
##XUNITS=1/CM
##YUNITS=ARBITRARY UNITS
##XYDATA=(X++(Y..Y))
599.7 84763235 83310515 81857884 80628771 79655635 78894418 78333658 77997124 77876431 77921313 78077364
620.1 78077364 78271490 78426516 78475338 78381574 78132516 77750313 77321142 77023512 77030176 77367419 77918178
642.5 77918178 78503293 78993112 79382384 79829943 80576348 81638062 82663572 83344972 83655447 83678055
662.9 83678055 83519340 83167315 82584417 82084447 81655931 81204844 80776304 80396056 80065751 79727137
683.3 79727137 79288119 78718495 78113747 77636284 77396280 77389443 77488405 77482855 77185673 76639372 76044333
705.7 76044333 75018376 72745717 70718455 72338927 77188587 81432039 83445770 83862042 83281624
724.1 83281624 82096636 81110078 81247926 82307732 83061969 82707053 81415546 79894704 78891760
742.4 78891760 78847498 79786128 81384069 83195972 84869277 86200368 87121433 87663257 87892061
760.8 87892061 87885815 87758738 87640911 87612104 87672764 87813401 88017118 88219768 88384670 88551664 88754773
783.2 88754773 88989305 89265656 89585263 89890975 90104347 90245801 90468752 90924931 91614598 92379284
803.6 92379284 93037742 93539780 93925881 94206882 94396389 94512635 94546121 94490921 94334656 94051397
824 94051397 93661219 93244100 92906749 92718953 92677063 92734075 92824662 92890453 92849296 92483103 91794699
846.5 91794699 91424739 91593558 91730285 91617340 91285700 90662700 89713794 88313937 86088085 81853807
866.9 81853807 73291039 60564739 49929947 47294262 51468265 58013529 64316690 70448107
883.2 70448107 77175546 83457154 87706637 89957714 91096914 91697687 91983682 92035502 91927731
901.5 91927731 91735190 91506135 91285723 91110569 90962642 90778220 90505368 90145200 89767700 89471620
921.9 89471620 89297104 89189607 89068013 88897991 88681525 88410914 88081425 87702531 87262374 86740130
942.3 86740130 86149842 85519564 84838957 84068346 83216208 82385832 81709117 81255794 81033593 81039220
962.7 81039220 81247723 81574523 81907159 82193732 82469696 82794631 83205456 83704394 84254634 84788102
983.1 84788102 85224360 85500187 85619998 85686976 85839754 86121488 86468369 86814004 87114358 87331271
1003.5 87331271 87450773 87499154 87511963 87499529 87447953 87328011 87138993 86920941 86688614 86415857
1023.9 86415857 86093193 85724366 85263932 84603488 83641893 82478851 81573105 81469071 82225400 83322912
1044.3 83322912 84183395 84555721 84477687 84079188 83441949 82581961 81464750 80029845 78205258
1062.7 78205258 75902241 73099613 70047325 67345506 65709072 65609831 67064208 69624943 72542030
1081 72542030 75112027 77002418 78245825 79007781 79431874 79623085 79649800 79552978 79373431 79149938
1101.4 79149938 78904396 78614801 78169715 77372289 76025689 74066812 71647584 69114101 66896337
1119.8 66896337 65318817 64473057 64280379 64628178 65380204 66298765 67133141 67866057 68757743 70090932
1140.2 70090932 71891612 73892206 75744593 77225786 78287673 78997070 79430252 79608768 79519510
1158.5 79519510 79199761 78842908 78731954 78972483 79417235 79873043 80235022 80472124 80597275 80636901
1178.9 80636901 80599046 80458808 80189258 79809391 79375273 78945100 78566802 78268588 78070158 77992225
1199.3 77992225 78034347 78161871 78325266 78482467 78610122 78704172 78749573 78706366 78508770 78054857
1219.7 78054857 77214658 75896901 74182642 72358930 70704490 69256878 67870182 66438836 64973110
1238.1 64973110 63506037 62024736 60492867 58885467 57160902 55239820 53131944 51101106
1254.4 51101106 49488372 48360533 47558814 46941721 46421963 45902008 45292640 44584921 43872836
1272.8 43872836 43310660 43030065 43050176 43226281 43324304 43158251 42739013 42363593 42476368 43347239
1293.1 43347239 44903827 46838552 48827845 50689995 52391523 53965139 55373561 56496894
1309.5 56496894 57263762 57713318 57935971 58021188 58011872 57877791 57585824 57154930 56648761 56115252
1329.9 56115252 55586141 55145729 54958630 55132216 55573511 56028771 56275517 56203413 55790377 55135530
1350.3 55135530 54389030 53661203 53002387 52414972 51837373 51195347 50475502 49649748 48645404 47452223
1370.7 47452223 46045041 44413528 42776987 41327983 40113580 39110106 38196018 37192261 36053148
1389 36053148 34875861 33599389 32197160 30864593 29673696 28557873 27341250 25829974 24158460
1407.4 24158460 22510120 20937160 19529761 18345101 17291723 16293643 15483831 14848295 14369273
1425.7 14369273 14097574 13916118 13736953 13613272 13581775 13666591 13810302 13927126 13990259 14025027
1446.1 14025027 14072798 14147624 14222673 14266180 14276916 14324374 14470045 14670430 14935109 15308203 15788245
1468.6 15788245 16369639 17098914 17939259 18824951 19775519 20803714 21899848 23022476 24222723
1486.9 24222723 25628492 27258378 28898287 30591574 32531059 34533763 36405838 38136402
1503.2 38136402 40052578 42447746 44643822 46545255 48443151 50361502 52287978 54168302
1519.6 54168302 56135935 58034438 59726983 61385745 62908685 64353311 65847629 67162800
1535.9 67162800 68327898 69747502 71293366 72696972 74045992 75314540 76528263 77640229
1552.2 77640229 78607875 79413378 80201262 81052077 81720155 82263094 82761788 83211440 83595419 83789349
1572.6 83789349 83595312 82940036 82413387 82646430 83682382 85068685 86256564 87080610 87593597
1590.9 87593597 87793756 87658346 87333041 87238413 87779009 88913703 90164846 91157001 91845578 92339939
1611.3 92339939 92728072 93061292 93400508 93723065 94001007 94263411 94534945 94806325 95078701 95332211
1631.7 95332211 95539081 95728081 95949608 96178788 96380663 96547067 96669805 96810430 96980542 97100455
1652.1 97100455 97191000 97338247 97479355 97558945 97594452 97624207 97633195 97569150 97462028 97351235 97192651
1674.6 97192651 97014141 96863186 96698838 96457696 96147144 95916724 95704895 95380342 94932443 94183892
1695 94183892 93094176 91586351 89316171 86717576 83461869 79096919 74168605 68968135 63752425
1713.3 63752425 58734655 54101026 50768012 49068519 48431063 48672786 49802423 51701266 54285723
1731.7 54285723 58007365 62454110 66652602 71266180 76162434 80645883 84632039 88055021
1748 88055021 90966040 93290126 94917631 96058738 96905559 97481656 97835606 97997379 97996277 97877258
1768.4 97877258 97711122 97578067 97615951 97857583 98207951 98572052 98806506 98737216 98191786 97096413
1788.8 97096413 95597237 94326097 93879968 94118053 94995803 96547431 98256338 99525732 100258970
1807.1 100258970 100622320 100806403 100934923 101040864 101131892 101231730 101345384 101467919 101627219 101818299
1827.5 101818299 102011478 102197218 102352142 102453947 102525973 102592039 102637565 102659571 102707601 102790177 102860415
1850 102860415 102905452 102933526 102959406 102984631 103001976 103008914 103004324 102976489 102932441 102919865 102946603 102973950
1874.5 102973950 102981758 102983117 102984273 102983510 102981842 102978158 102967548 102961385 102965093 102963090 102963281 102968609 102965605 102948558
1903 102948558 102927148 102906454 102883196 102860510 102848494 102842295 102821136 102790117 102762651 102744567 102732325 102712786
1927.5 102712786 102687907 102657223 102611911 102558112 102502990 102442384 102374351 102320051 102298462 102295458 102298665 102302921
1952 102302921 102302539 102295446 102285600 102281690 102287221 102287984 102267587 102242291 102224278 102202344 102175438 102154636 102145076 102143359
1980.5 102143359 102146339 102145326 102128887 102109206 102104807 102112186 102123713 102129817 102125096 102115202 102102411 102087998 102072549
2007 102072549 102052534 102030981 102013040 101990747 101959467 101933134 101917267 101900601 101881909 101864481 101846552 101831317
2031.5 101831317 101818037 101802957 101791728 101784956 101778281 101766646 101741529 101715243 101703632 101695061 101676691 101652968
2056 101652968 101630497 101611936 101594472 101573431 101550841 101528883 101506841 101490319 101480484 101466703 101446724 101427650
2080.5 101427650 101412964 101398993 101377416 101349795 101327014 101308823 101289690 101269650 101249218 101228094 101205122
2102.9 101205122 101187885 101177609 101166141 101151466 101127088 101093268 101061440 101034486 101005495 100974739 100948453
2125.3 100948453 100919211 100886035 100861144 100843179 100824022 100798345 100767756 100742352 100728130 100721073 100715089 100706756
2149.8 100706756 100695026 100686705 100680625 100667453 100647116 100627029 100614774 100610852 100610137 100609577 100605106 100592530 100576794
2176.3 100576794 100558388 100532794 100507605 100490904 100478160 100467253 100458241 100441897 100416028 100386143 100352991 100314772
2200.8 100314772 100279796 100262249 100255704 100242937 100224626 100207925 100190365 100174844 100166404 100153029 100131536 100113583
2225.3 100113583 100099635 100089133 100079834 100066435 100050712 100035048 100021303 100004613 99975973 99944603 99923700 99908102
2249.7 99908102 99894577 99883223 99866414 99844497 99824750 99803984 99780715 99758834 99735767 99714893 99696964 99674052
2274.2 99674052 99645340 99619603 99602675 99586272 99565482 99545407 99524093 99502492 99484074 99459386 99427843 99398440
2298.7 99398440 99372864 99352026 99331099 99299264 99261838 99242842 99246043 99245870 99229389 99204767 99180317 99159807
2323.2 99159807 99138820 99116981 99100095 99083197 99073762 99081457 99097264 99100357 99057955 98964393 98849195 98790181
2347.6 98790181 98826456 98909789 98987138 99037343 99048370 99020743 98958534 98883575 98807979 98717356 98617017
2370.1 98617017 98523349 98448932 98401058 98378187 98377997 98392385 98402905 98394686 98372185 98353928 98343551 98321593
2394.5 98321593 98279256 98239982 98218328 98196030 98159069 98116225 98085028 98064065 98036134 98003286 97979015 97967345
2419 97967345 97963035 97959709 97954613 97938907 97914827 97900832 97894627 97878021 97851199 97826320 97807074 97790694 97776127
2445.5 97776127 97759855 97731817 97695208 97660261 97627151 97593039 97553819 97509956 97459894 97397649 97323239 97240543
2470 97240543 97150171 97045809 96926892 96800029 96662229 96513045 96361625 96193719 95986098 95739388
2490.4 95739388 95443988 95082217 94676554 94258571 93830580 93398404 92984498 92619896 92343497 92175746
2510.8 92175746 92101860 92098057 92148602 92254317 92435485 92696083 93014902 93373799 93752170 94123727
2531.2 94123727 94477308 94795704 95045495 95214790 95316994 95380008 95433438 95489454 95543659 95595360 95652294
2553.6 95652294 95711058 95764273 95811146 95851809 95879757 95890921 95896232 95903569 95908952 95907527 95899534 95893449 95893192
2580.1 95893192 95894736 95899928 95907515 95918649 95937479 95958132 95981824 96011847 96037960 96055925 96073431 96091622
2604.6 96091622 96113473 96144950 96179700 96209127 96226794 96228409 96228540 96243036 96261317 96273243 96292877 96331978
2629.1 96331978 96381205 96428800 96468759 96502107 96535903 96563482 96570712 96561778 96550435 96539593 96526796 96513808
2653.6 96513808 96498632 96473145 96446449 96424741 96397299 96363556 96323746 96278739 96236128 96196407 96155053 96119028
2678 96119028 96099430 96105891 96133256 96145850 96133375 96122837 96119738 96107632 96085078 96066076 96052527 96027946
2702.5 96027946 95989013 95947176 95903385 95857775 95809472 95761752 95722735 95675218 95603496 95516950 95421582 95344645
2727 95344645 95310467 95285439 95247078 95210403 95193875 95204467 95225894 95244014 95239896 95213866 95217353 95259005
2751.5 95259005 95285529 95282722 95272422 95258337 95243031 95229787 95211738 95187944 95155466 95089781 94995517 94940996
2775.9 94940996 94934052 94905847 94842172 94764483 94650656 94493556 94362587 94282943 94185203 94033021 93880945
2798.4 93880945 93781281 93688852 93535143 93300349 92999285 92695642 92431641 92183495 91955578 91774678
2818.8 91774678 91622412 91456699 91251886 90990710 90636969 90152800 89522189 88719147 87704718 86527050
2839.2 86527050 85212386 83601362 81558794 79176348 76715773 74392956 72292721 70543182
2855.5 70543182 69370872 68991756 69409615 70239991 70896184 71012282 70639718 70215636 70356089 71341014
2875.9 71341014 72876519 74483961 75816166 76659441 76954889 76768792 76204395 75350964 74274343
2894.2 74274343 73053360 71731067 70269519 68671143 67031842 65421420 63841903 62284815
2910.6 62284815 60766548 59340161 58024573 56771576 55544007 54354745 53287256 52461398 52033693
2928.9 52033693 52207845 53056753 54456854 56208283 58077019 59786409 61076933 61763293 61711848
2947.3 61711848 60860932 59346044 57571983 55990678 54887980 54426372 54693168 55713481 57421696
2965.6 57421696 59645182 62175506 64806789 67393273 69882965 72214478 74369967 76466936
2981.9 76466936 78539360 80445892 82091749 83484513 84684926 85766554 86690056 87441182 88103509
3000.3 88103509 88681066 89164579 89567071 89845693 90000010 90153587 90402341 90698308 90971375 91196877
3020.7 91196877 91348374 91458398 91589671 91700774 91746104 91771185 91854197 91986364 92041945 92009223 92020983
3043.1 92020983 92129040 92253298 92290395 92253047 92217773 92186075 92158926 92147321 92110616 92025465 91916788
3065.6 91916788 91854775 91884065 91943705 91955549 91912538 91874027 91921431 92048860 92177981 92288518 92373389
3088 92373389 92426753 92492747 92562354 92581797 92553806 92528558 92538071 92548221 92517591 92482734 92499840 92521340
3112.5 92521340 92469841 92385882 92358106 92418087 92520261 92584097 92583364 92555416 92545843 92551696 92532438 92476487
3136.9 92476487 92426318 92426234 92455703 92466700 92438972 92379147 92316383 92299724 92339277 92370445 92358810 92337388
3161.4 92337388 92324775 92312324 92290884 92258823 92216063 92161316 92114580 92093980 92084908 92074841 92064404 92054009
3185.9 92054009 92043966 92036837 92036670 92037362 92022133 91992146 91966087 91944903 91921467 91896534 91879421 91876835 91871732
3212.4 91871732 91855025 91838133 91824996 91810334 91786909 91768467 91759259 91725594 91657430 91600800 91604024 91634500
3236.9 91634500 91640693 91631794 91605234 91546750 91499013 91505200 91530907 91526312 91497093 91479433 91478825 91469467 91446573
3263.4 91446573 91422826 91385365 91318613 91265202 91253304 91248000 91234714 91229141 91223657 91201293 91175652 91146475
3287.9 91146475 91092628 91034770 90997791 90978825 90982509 90982854 90927804 90828454 90758908 90763760 90809500 90832740
3312.3 90832740 90814936 90794659 90790921 90780658 90748012 90708375 90686053 90676284 90670127 90659547 90617806 90547013
3336.8 90547013 90495408 90474629 90470338 90493000 90503806 90467799 90441012 90449750 90447181 90415746 90380204 90363693
3361.3 90363693 90350330 90299910 90226912 90188324 90199524 90212840 90198952 90178823 90162635 90150356 90143073 90130448
3385.8 90130448 90083200 89989686 89914709 89910758 89922243 89870661 89777923 89754277 89816320 89841896 89790261 89744931
3410.2 89744931 89748782 89784348 89818048 89827788 89831746 89841938 89848924 89832878 89792818 89773709 89759612 89708716
3434.7 89708716 89712417 89848787 90015841 90100557 90112740 90113550 90139443 90177631 90197021 90189505 90158165 90105176
3459.2 90105176 90067130 90037346 89938456 89801908 89773315 89880645 89981371 89981282 89914542 89860129 89869100 89887911
3483.7 89887911 89865333 89835441 89807713 89761519 89706981 89668858 89651960 89629936 89600497 89611942 89653200 89658332
3508.1 89658332 89630723 89605254 89591777 89594454 89607888 89618337 89614546 89615768 89632344 89646274 89666396 89686495
3532.6 89686495 89681995 89671421 89679974 89689255 89681691 89668787 89684099 89745516 89806360 89834958 89850765 89868146
3557.1 89868146 89879262 89875174 89862424 89838171 89813977 89830208 89884990 89942491 89979059 89989913 89990240 89997858
3581.6 89997858 90005255 89992690 89982527 90021086 90083390 90119231 90125579 90124589 90125215 90145308 90190291 90212619 90185511
3608.1 90185511 90154600 90157849 90184057 90206051 90185261 90151274 90176529 90245521 90284956 90236562 90192956 90219641
3632.6 90219641 90236294 90228158 90207434 90180600 90174645 90191507 90195537 90143597 90113199 90178114 90220064 90185606
3657 90185606 90178847 90218312 90246123 90256453 90249318 90204978 90184033 90198022 90141195 90081394 90113658 90172046
3681.5 90172046 90224338 90252745 90205753 90129179 90136665 90186083 90212178 90231931 90248066 90246266 90258884 90294027
3706 90294027 90311593 90268159 90171617 90136290 90179831 90211695 90192991 90143245 90086919 90043557 90032923 90020019
3730.5 90020019 89947319 89840502 89795816 89855772 89964300 89997858 89921278 89904928 89937937 89893705 89841831
3752.9 89841831 89877230 89947385 89977479 89990848 90007794 89990079 89967602 89959687 89948463 89952958 89958060 89944482
3777.4 89944482 89930671 89934492 89936614 89925659 89930421 89942569 89941674 89923668 89886361 89870536 89859259 89814931 89804763
3803.9 89804763 89792430 89750683 89766949 89815795 89811760 89747423 89711249 89678061 89610600 89600909 89630967 89648622
3828.4 89648622 89640367 89613432 89598954 89575630 89529455 89508832 89511627 89515728 89539957 89582300 89585930 89472216
3852.8 89472216 89347821 89373875 89450479 89480919 89455998 89434564 89443982 89407611 89344841 89346105 89389825 89430475
3877.3 89430475 89422429 89391208 89374530 89333606 89323300 89346081 89318120 89297056 89324635 89325267 89280528 89229625
3901.8 89229625 89184403 89174581 89213288 89244264 89240217 89229065 89211422 89174920 89145225 89133251 89117068 89109629
3926.3 89109629 89116371 89094174 89052171 89045441 89068186 89072329 89037359 88998681 88993216 88991529 88977849 88984716 89001971
3952.8 89001971 88994884 88969880 88952297 88942742 88931262 88925701 88917583 88892096 88874745 88877535 88881183 88880914 88878208
3979.3 88878208 88872468 88865107 88849121 88816392 88787252 88778615 88765985 88738674 88710904
3997.6 88710904
##END=$$ End of the data block
