##TITLE=Lona PVC - THF $$ Begin of the data block
##JCAMP-DX=5.00 $$ ACD/SpecManager v 10.08
##SPECTROMETER/DATA SYSTEM=Alpha
##DATE=23 Aug 2016 12:03:00
##DATA TYPE=INFRARED SPECTRUM
##DATA CLASS=XYDATA
##ORIGIN=
##OWNER=
##NPOINTS=1667
##FIRSTX=599.65820312
##LASTX=3997.72216797
##MAXX=3997.72216797
##MINX=599.65820312
##MAXY=1.08158863
##MINY=0.59550107
##XFACTOR=1.0000000000
##YFACTOR=0.000000010000000
##FIRSTY=0.99561960
##DELTAX=2.03965425
##XUNITS=1/CM
##YUNITS=ARBITRARY UNITS
##XYDATA=(X++(Y..Y))
599.7I9561960m19951l96883l20966k88170k86657k36505j14667n407J6720K5171O8885
$$ 99561960 99142009 98745126 98424160 98135990 97849333 97612828 97498161 97492754 97509474 97534645 97603530
622.1I7603530P5936M6635Q255m4638q8006j00500o6584M947P4840J27536J64538J61922
$$ 97603530 97679466 97726101 97734356 97689718 97601712 97501212 97434628 97439575 97514415 97641951 97806489 97968411
646.6I7968411J24342J38384K49690L47948L15672K17718J18977N590m5430k6953q5086
$$ 97968411 98092753 98231137 98480827 98828775 99144447 99362165 99481142 99486732 99441302 99414349 99329263
669I9329263j63025j57249j35183j14673j12385j13660j00422j19913j91354k13576
$$ 99329263 99166238 99008989 98873806 98759133 98646748 98533088 98432666 98312753 98121399 97907823
689.4I7907823j52880p0417j943K6751j4567j16212j87516k01172l92442q64935p41452
$$ 97907823 97754943 97684526 97682583 97709334 97694767 97578555 97391039 97189867 96797425 95932490 95191038
711.8I5191038O02728J727861J461208O63400J31362j72722l55953k88463Q8561L90744
$$ 95191038 95793766 97521627 98982835 99646235 99777597 99604875 99248922 98960459 99049020 99439764
732.2I9439764K93213n4747l60620m54378l00240Q3K82741M52006N17499N01823M06647
$$ 99439764 99732977 99678230 99317610 98863232 98562992 98563075 98845816 99297822 99815321 100317144 100723791
754.7A00723791K64728J43695O8700L457l5011j7071R990J4519L7587P4160N8258J1515
$$ 100723791 100988519 101132214 101200914 101204371 101169360 101152289 101162279 101176798 101214385 101288545 101346803 101358318
779.1A01358318J2172M3845L0982r620j6129L326J025k9456j6869P4924J74295K18034
$$ 101358318 101370490 101414335 101445317 101435697 101419568 101422894 101423919 101394463 101377594 101452518 101626813 101844847
803.6A01844847K16055K00534J71447J25038J03021J01173O9964K9683J0729n019k7585
$$ 101844847 102060902 102261436 102432883 102557921 102660942 102762115 102832079 102861762 102872491 102867472 102839887
826.1A02839887m6599m2224j4805P891K2686L7169L9077N698r5200j91522j06764M3059
$$ 102839887 102793288 102751064 102736259 102744150 102766836 102804005 102843082 102848780 102753580 102562058 102455294 102498353
850.5A02498353L3223m8673j25086k07103k97606m34589o94966j393676l093737m965616
$$ 102498353 102531576 102482903 102357817 102150714 101853108 101418519 100723553 99329877 96236140 91270524
870.9I1270524m371649j126641J793629K837086K698064K485573K565062K324700J555264
$$ 91270524 86898875 85772234 87565863 90402949 93101013 95586586 98151648 100476348 102031612
889.3A02031612Q25584M26436K30026J15609L6609q046l1162m9245n0485m7600m9377
$$ 102031612 102857196 103283632 103513658 103629267 103665876 103657830 103626668 103577423 103526938 103479338 103429961
911.7A03429961m9603p0238j08349j21689j01686p9512p1502o4444n4765n8115q4579
$$ 103429961 103380358 103310120 103201771 103080082 102978396 102898884 102827382 102762938 102708173 102650058 102565479
934.2A02565479j11246j21248j39224j62673j71256j77479j86098j98435k19763k23517
$$ 102565479 102454233 102332985 102193761 102031088 101859832 101682353 101496255 101297820 101078057 100854540
954.6A00854540j95444j50740r0873k2626L6275Q0216R5415P9930O9690R4449J41955
$$ 100854540 100659096 100508356 100417483 100394857 100431132 100511348 100606763 100686693 100756383 100850832 100992787
977A00992787J74093J78790J65248J36221R1779L8552N031J6021M9043O1429N4550
$$ 100992787 101166880 101345670 101510918 101647139 101738918 101777470 101782501 101798522 101847565 101908994 101963544
999.4A01963544M3595J5700k5297n2821o8593q3530q7691q8012r4545q6260n9902m2832
$$ 101963544 102007139 102022839 101997542 101944721 101876128 101792598 101704907 101616895 101522350 101436090 101376188 101333356
1023.9A01333356l6383l8469o9296j30570k20287k98321k54917m9424J92833L05807
$$ 101333356 101296973 101258504 101189208 101058638 100838351 100540030 100285113 100235689 100428522 100734329
1044.3A00734329K62988J46139K3615o6614j25742j83141k64395l78132n18399o88970
$$ 100734329 100997317 101143456 101167071 101100457 100974715 100791574 100527179 100149047 99630648 98941678
1064.7I8941678q86125j030230r74953o47080j29128M00651P67833Q75920P49767N23913
$$ 98941678 98055553 97025323 96050370 95403290 95274162 95674813 96442646 97318566 98068333 98592246
1085.1I8592246L26418J93793J03903L4076j4180l7074m1211m0775m1914m7094q8507
$$ 98592246 98918664 99112457 99216360 99250436 99236256 99199182 99157971 99117196 99075282 99028188 98939681
1107.5I8939681j93733l56758n46461p09641p80439p07138n16116k87199o7115J23882
$$ 98939681 98745948 98389190 97842729 97133088 96352649 95645511 95129395 94842196 94775081 94898963
1127.9I4898963K62773L22837K94965K47961K89351M33243N77330O21730N63950M52214
$$ 94898963 95161736 95484573 95779538 96027499 96316850 96750093 97327423 97949153 98513103 98965317
1148.3I8965317L27152K20525J36859N9402j6439p7379q8239k0635P8666J29712J19108
$$ 98965317 99292469 99512994 99649853 99709255 99692816 99615437 99527198 99506563 99585229 99714941 99834049
1170.8I9834049Q6140N8884L4696Q845j4305m2361q1349j19447j43874j49167j36351
$$ 99834049 99920189 99979073 100013769 100022614 100008309 99965948 99884599 99765152 99621278 99472111 99335760
1193.2I9335760j08850o8468k6512K789K2340L7700M0519L5042K7931Q022k1845o2692
$$ 99335760 99226910 99158442 99131930 99134719 99157059 99194759 99235278 99270320 99298251 99306273 99284428 99221736
1217.7I9221736j37806k57122m02141n26780n67108n24199m78602m73725m88937n02700
$$ 99221736 99083930 98826808 98424667 97897887 97330779 96806580 96327978 95854253 95365316 94862616
1238.1I4862616n16510n36078n68450o14708o77687p76363q97050r45985q51035o62500
$$ 94862616 94346106 93810028 93241578 92626870 91949183 91172820 90275770 89329785 88478750 87816250
1258.5H7816250m50027k63244j47342j19704j75005k62386l03388k52807j25950J7517
$$ 87816250 87366223 87102979 86955637 86835933 86660928 86398542 86095154 85842347 85716397 85733914
1278.9H5733914R6256O0832p4142k11191j98984M1234M20744P55512R12035Q91316
$$ 85733914 85830170 85891002 85816860 85605669 85406685 85447919 85868663 86624175 87536210 88427526
1299.3H8427526Q00228P15643O38056N35661M05937K77388J65433O9469k175m5151
$$ 88427526 89227754 89943397 90581453 91117114 91523051 91800439 91965872 92035341 92033166 91988015
1319.7I1988015q1986j31297j82045k09182k19929k19554j87033q9998M7774J44457
$$ 91988015 91906029 91774732 91592687 91383505 91163576 90944022 90756989 90666991 90714765 90859222
1340.1I0859222J50592P5417n3620j97166k91127l22187l16382k93576k62720k57098
$$ 90859222 91009814 91085231 91031611 90834445 90543318 90221131 89904749 89611173 89348453 89091355
1360.5H9091355l01034l53455m05020m90743n89072p07031q37707q58754p86156o86752
$$ 89091355 88790321 88436866 88031846 87541103 86952031 86245000 85407293 84548539 83762383 83075631
1380.9H3075631n94426n81461o79064p77733p99692q95899j035607j023191r38928
$$ 83075631 82481205 81899744 81220680 80442947 79643255 78747356 77711749 76688558 75749630
1399.2G5749630r13477j052660j370120j583809j637131j635217j523090j315164j176608
$$ 75749630 74836153 73783493 72413373 70829564 69192433 67557216 66034126 64718962 63542354
1417.6F3542354j116681r29421p52199n57691k81822j40042j30653q3738O5547K63113
$$ 63542354 62425673 61496252 60744053 60186362 59904540 59764498 59633845 59550107 59615654 59878767
1438E9878767L09342K43884J65576J30790J68485K00981J70916J19245J26290K09809
$$ 59878767 60188109 60431993 60597569 60728359 60896844 61097825 61268741 61387986 61514276 61724085
1458.4F1724085K52926K76226L86297N43070O40965P38859R13256R88210R46283R46105
$$ 61724085 61977011 62253237 62639534 63182604 63823569 64562428 65475684 66463894 67410177 68356282
1478.8F8356282R82171J002061R70900R94653J136607J278472J234668J222825J354295
$$ 68356282 69338453 70340514 71311414 72306067 73442674 74721146 75955814 77178639 78532934
1497.1G8532934J355583J227808J101660J194692J472992J314860J102507J077068
$$ 78532934 79888517 81116325 82217985 83412677 84885669 86200529 87303036 88380104
1513.4H8380104J066518J057458J009816J024246R83954Q67641Q17430P34454O96248
$$ 88380104 89446622 90504080 91513896 92538142 93522096 94389737 95207167 95941621 96637869
1531.8I6637869P10463O15317N29891O12796O59966O12068N79715N24890M92526M49645
$$ 96637869 97348332 97963649 98493540 99106336 99766302 100378370 100958085 101482975 101975501 102425146
1552.2A02425146L85869L13782K84505K94447K59161K23565J97745J68073J44791J01698
$$ 102425146 102811015 103124797 103409302 103703749 103962910 104186475 104384220 104552293 104697084 104798782
1572.6A04798782k1207j81532j44542Q2839L08978M05622L45790K39694J54448P0894
$$ 104798782 104777575 104596043 104451501 104534340 104843318 105248940 105594730 105834424 105988872 106059766
1593A06059766k5392q4650l0124J27565K84684L28410K66242J77073J24288J09506
$$ 106059766 106034374 105949724 105919600 106047165 106331849 106660259 106926501 107103574 107227862 107337368
1613.4A07337368Q4459N6506O4873O0904M1342N3835N9211N6875O7162M8817M05J4174
$$ 107337368 107421827 107478333 107543206 107604110 107645452 107699287 107758498 107815373 107882535 107931352 107931757 107945931
1637.9A07945931N1403M6945L2496p546r787N5850L4952n2619k86M4930J6594j9467
$$ 107945931 107997334 108044279 108076775 108069229 108059442 108115292 108150244 108097625 108097339 108142269 108158863 108139396
1662.3A08139396j8871p141l8111n8186m2653o2358p5198m5752l6407p6830j30868
$$ 108139396 108120525 108113384 108075273 108017087 107974434 107912076 107836878 107791126 107754719 107677889 107547021
1684.8A07547021p4279k9147o3908r5594j90532k89595l87645o04189o91700r02223
$$ 107547021 107472742 107443595 107379687 107284093 107093561 106803966 106416321 105812132 105120432 104218209
1705.2A04218209j296318j558268j755977j883697j937991j915271j457881p70522
$$ 104218209 102921891 101363623 99607646 97723949 95785958 93870687 92412806 91642284
1721.5I1642284k97314R6030M84055Q01766J046544J418227J630580J473564J504439
$$ 91642284 91344970 91441000 91925055 92726821 93773365 95191592 96822172 98295736 99800175
1739.8I9800175J494354J298166J101970R08900P49004N81359M02332K73073J96456
$$ 99800175 101294529 102592695 103694665 104603565 105352569 105933928 106336260 106609333 106805789
1758.2A06805789J41216Q5819M4715J7738r703k8777m8578j4913M3332L9375O497k4736
$$ 106805789 106947005 107032824 107077539 107095277 107085574 107056797 107008219 106993306 107036638 107076013 107082510 107057774
1782.7A07057774r4056k09451l21102l94797l10385o7592J21748K81585M34732M36985
$$ 107057774 106963718 106754267 106433165 106038368 105727983 105660391 105782139 106063724 106498456 106935441
1803.1A06935441K92719J46949N1975J0133J0586J6058J5509K0194J9777J1050K3079
$$ 106935441 107228160 107375109 107427084 107437217 107447803 107463861 107479370 107499564 107519341 107530391 107553470
1825.5A07553470M4453L1710J8573K5630R489j0312j931j335l0398k5332P522R155
$$ 107553470 107597923 107629633 107648206 107673836 107683325 107673013 107671082 107669747 107639349 107614017 107621539 107630694
1850A07630694k253j0955r227q476j4281j1921p856j9586l8457k7180L970O842j0085
$$ 107630694 107628441 107617486 107608259 107599783 107585502 107573581 107565725 107546139 107507682 107480502 107484472 107491314 107481229
1876.5A07481229j3387j2112j2087j0562j5354k5428k2447r382r405r036o462j3566
$$ 107481229 107467842 107455730 107443643 107433081 107417727 107392299 107369852 107360470 107351065 107342029 107335567 107322001
1901A07322001j9860j7714j7798k2066j7810m983j621k0552l2758k2972j8561j9228
$$ 107322001 107302141 107284427 107266629 107244563 107226753 107221770 107220149 107199597 107166839 107143867 107125306 107106078
1925.4A07106078j5557j1099j2385k0743k4640k4665k8658l6776l5178j7822m280j585
$$ 107106078 107090521 107079422 107067037 107046294 107021654 106996989 106968331 106931555 106896377 106878555 106874275 106872690
1949.9A06872690n377j4329k2482j8681p605l851j0144j7810j8275j8966k2662k2876
$$ 106872690 106867313 106852984 106830502 106811821 106804216 106800365 106790221 106772411 106754136 106735170 106712508 106689632
1974.4A06689632j6987q035o378j0836j4007j8287j9896j5962j1897p570n197n913
$$ 106689632 106672645 106664610 106658232 106647396 106633389 106615102 106595206 106579244 106567347 106559777 106554580 106548667
1998.9A06548667p296j1360j4401j5044j5795j0360q904k0135k7001k2852j5128j2255
$$ 106548667 106541371 106530011 106515610 106500566 106484771 106474411 106465507 106445372 106418371 106395519 106380391 106368136
2023.3A06368136j5056j4186q630q989j9037k5034j8371j2207j0621j0407j7333j8418
$$ 106368136 106353080 106338894 106330264 106321275 106302238 106277204 106258833 106246626 106236005 106225598 106208265 106189847
2047.8A06189847p927r287j9026j8596j5497j5748j5736j7893k0802j5545j1778j4710
$$ 106189847 106181920 106172633 106153607 106135011 106119514 106103766 106088030 106070137 106049335 106033790 106022012 106007302
2072.3A06007302j5164j6975j2422l719o998j3113j6784k3389k0146r406j1754j8299
$$ 106007302 105992138 105975163 105962741 105959022 105952024 105938911 105922127 105898738 105878592 105869186 105857432 105839133
2096.8A05839133j6713j6463j6534r358o545j1479j4174j8490k4700k1005j1122j0252
$$ 105839133 105822420 105805957 105789423 105780065 105773520 105762041 105747867 105729377 105704677 105683672 105672550 105662298
2121.2A05662298j5414j6510j3959j5057j8358j4913j1873j8191k0242p606O0n686
$$ 105662298 105646884 105630374 105616415 105601358 105583000 105568087 105556214 105538023 105517781 105510175 105510235 105504549
2145.7A05504549j0860j6344j8787j3829j2183j2028j3161j9550k0146j1373m494k098
$$ 105504549 105493689 105477345 105458558 105444729 105432546 105420518 105407357 105387807 105367661 105356288 105351794 105349696
2170.2A05349696l863j3637j7381j2779j6356j7881r704p355q845r072j2362j4603
$$ 105349696 105345833 105332196 105314815 105302036 105285680 105267799 105258095 105250740 105241895 105232823 105220461 105205858
2194.7A05205858j7762j9539j5890j4449j2683o545o998j6641k1875j8954j3268j1731
$$ 105205858 105188096 105168557 105152667 105138218 105125535 105118990 105111992 105095351 105073476 105054522 105041254 105029523
2219.1A05029523j5199j2612o581o556p987p665q393r501p367m196j1182k5463k5975
$$ 105029523 105014324 105001712 104995131 104988575 104980588 104972923 104964530 104955029 104947662 104943466 104932284 104906821 104880846
2245.7A04880846j7107j7655j4973j764k074j2922q512m89j0872k9540l2198j5318
$$ 104880846 104863739 104846084 104831111 104829347 104827273 104814351 104805839 104805350 104794478 104764938 104732740 104717422
2270.1A04717422l970j2291k7597k7954j0479J860k38l422n090p784r597j5974j7023
$$ 104717422 104713452 104701161 104673564 104645610 104635131 104636991 104636753 104633331 104628241 104620457 104610860 104594886 104577863
2296.7A04577863j0299p999N9N615o378j1372P248K4747J8561J0217J5676J2850M721
$$ 104577863 104567564 104559565 104559624 104565239 104558861 104547489 104554737 104579484 104598045 104608262 104623938 104636788 104641509
2323.2A04641509P439P105J549l206j2541j6034o91J6117O32o1989j19984o2728M9710
$$ 104641509 104648948 104656053 104657602 104654396 104641855 104625821 104625130 104641247 104641879 104579890 104459906 104397178 104446888
2349.7A04446888J02150J03617R2411L7468l5417o8415p5709p5496q0526r1898r1100
$$ 104446888 104549038 104652655 104745066 104782534 104747117 104678702 104602993 104527497 104446971 104355073 104263973
2372.1A04263973q4102p6198n8055l2950j1384p236k0862k9552k0027q047j0860j9109
$$ 104263973 104179871 104103673 104045618 104012668 104001284 103994048 103973186 103943634 103923607 103915560 103904700 103885591
2396.6A03885591j5092r119j5593j9085j3113r263j2052k0707k7322j9432l624Q71
$$ 103885591 103870499 103861380 103845787 103826702 103813589 103804326 103792274 103771567 103744245 103724813 103721189 103722060
2421.1A03722060l135o736j6248k7967k1564J776M458j3649j5331o246o390r429j0884
$$ 103722060 103718925 103712189 103695941 103667974 103646410 103648186 103652644 103638995 103623664 103617418 103611028 103601599 103590715
2447.6A03590715j7858k8455k9051j4723m458j2720k4879k9480k9361k9218k6834k1613
$$ 103590715 103572857 103544402 103515351 103500628 103496170 103483450 103458571 103429091 103399730 103370512 103343678 103322065
2472.1A03322065k6059l8040m1783l7551l7229m1938m6444n7661o9451p2802q5747
$$ 103322065 103296006 103257966 103216183 103178632 103141403 103099465 103053021 102995360 102925909 102853107 102767360
2494.5A02767360j02794r9504q8048q2040p3862n8567l4333j1754j192P999K2817M2927
$$ 102767360 102664566 102565062 102477014 102394974 102321112 102262545 102228212 102216458 102215266 102223265 102246082 102289009
2519A02289009O2251P2169P5675Q2147Q7881Q0561O8748N6863L9041K5428J7082M590
$$ 102289009 102351260 102423429 102499104 102581251 102669132 102749693 102818441 102875304 102914345 102939773 102956855 102961445
2543.4A02961445k611O008J2851M983l719p51O008R42m042J20q524j7631m995K349
$$ 102961445 102958834 102964842 102977693 102982676 102978957 102978206 102984214 102985156 102981114 102981234 102972710 102955079 102950084 102952433
2572A02952433q250j6927j0145K646n722k4461j5784Q679O842j6164k0671m411j67
$$ 102952433 102944183 102927256 102917111 102919757 102914035 102889574 102873790 102882469 102889311 102873147 102852476 102848065 102847898
2598.5A02847898o819r346q750L10K766o497r322q154l040M733k206j2672p260K349
$$ 102847898 102841079 102831733 102822983 102823293 102826059 102819562 102810240 102802086 102799046 102803779 102801573 102788901 102781641 102783990
2627.1A02783990K181k074n60K837K551l218q274o997p260j3721k0671j8155p451M77
$$ 102783990 102786171 102784097 102783537 102786374 102788925 102785707 102777433 102770436 102763176 102749455 102728784 102710629 102703178 102703655
2655.6A02703655l720j3971j7178j4353j5259k3734k9886k3055r894j2303k2673j4007
$$ 102703655 102699935 102685964 102668786 102654433 102639174 102615440 102585554 102562499 102552605 102540302 102517629 102503622
2680.1A02503622K420R381N555q642j6666j4484j2970r262r811j4639j1182o807j3947
$$ 102503622 102506042 102515423 102520978 102512336 102495670 102481186 102468216 102458954 102449143 102434504 102423322 102416515 102402568
2706.6A02402568k5237k4211j9586j6821o103q655k6619l1877l2270k8121j1325l970
$$ 102402568 102377331 102353120 102333534 102316713 102310610 102301955 102275336 102243459 102211189 102183068 102171743 102167773
2731.1A02167773j1110j8597j5485l445J67o199j3745j1611Q929K0253Q476j657r262
$$ 102167773 102156663 102138066 102122581 102119136 102119303 102113104 102099359 102087748 102096677 102116930 102125406 102123749 102114487
2757.6A02114487j3876j645M696o210j1587j3149l1960n2905k8348J0788N555j4472
$$ 102114487 102100611 102098966 102103662 102097452 102085865 102072716 102040756 101987851 101959503 101970291 101975846 101961374
2782.1A01961374k3019m1235n8901m0042r084j5378m6432n0461k0254p510k9385o0380
$$ 101961374 101938355 101897120 101838219 101798177 101789093 101773715 101727283 101676822 101656568 101649058 101619673 101559293
2806.5A01559293q1134o8187l8362l9351n4061m7422l1066k5546l4070n1785p8141
$$ 101559293 101478159 101409972 101371610 101332259 101278198 101230776 101199710 101174164 101140094 101088309 101010168
2829A01010168j15729j59907k10154k75409k96683k75588l45367n01781o11651o18154
$$ 101010168 100894439 100734532 100524378 100248969 99952286 99676698 99331331 98829550 98217899 97599745
2849.4I7599745n82326n60933m99779l51262j14012J50550K82639K08729L3260j23412
$$ 97599745 97017419 96456486 95956707 95605445 95491433 95641983 95924622 96133351 96166611 96043199
2869.8I6043199j63412K0963L23683M85510M62943L53408K05499M9424q6146j83106
$$ 96043199 95879787 95900750 96224433 96709943 97172886 97526294 97731793 97781217 97695071 97511965
2890.2I7511965k64937l45528l82811l86667m32873n06937n33784n23936n29075n56988
$$ 97511965 97247028 96901500 96518689 96132022 95699149 95192212 94658428 94134492 93605417 93048429
2910.6I3048429n67811n16230m31639l81279l81583m10289m09966l43728j85281P9232
$$ 93048429 92480618 91964388 91532749 91151470 90769887 90359598 89949632 89605904 89420623 89499855
2931H9499855L55125N55646O67918O80488N83357M06450K01779k4736k90966n35929
$$ 89499855 89854980 90410626 91078544 91759032 92342389 92748839 92950618 92925882 92634916 92098987
2951.3I2098987o34307n80257m33206k00713Q2880L74323O35529Q12936Q87608Q86023
$$ 92098987 91464680 90884423 90451217 90250504 90333384 90707707 91343236 92156172 93043780 93929803
2971.7I3929803Q39150P69669O78551N94384N70810N52994M79322L89105K98417K31898
$$ 93929803 94768953 95538622 96217173 96811557 97382367 97935361 98414683 98803788 99102205 99334103
2992.1I9334103K16013J84065J41859J41865J33670R5510N8925K1053k8432k9993L9852
$$ 99334103 99550116 99734181 99876040 100017905 100151575 100247085 100306010 100327063 100298631 100268638 100308490
3014.6A00308490Q2516P0096N2571K8717J5223J9944N639j1957j5032l10K5201K539
$$ 100308490 100391006 100461102 100513673 100542390 100557613 100577557 100583196 100571239 100556207 100555897 100581098 100583637
3039A00583637l7360j5879K3758K4081m137k6727k0480j0288l373N436j1874l9780
$$ 100583637 100546277 100530398 100554156 100578237 100574100 100547373 100526893 100516605 100513232 100518668 100506794 100467014
3063.5A00467014n0211k7835J5128K3877K4k7573m3082j8859J7905K9028L4868L1495
$$ 100467014 100416803 100388968 100404096 100427973 100427997 100400424 100357342 100338483 100356388 100385416 100420284 100451779
3088A00451779J5748J9467J8346r131k4200j0538M399n162k9719l4904p534N948k3651
$$ 100451779 100467527 100486994 100505340 100496209 100472009 100461471 100465870 100460708 100430989 100396085 100388551 100394499 100370848
3114.5A00370848m6074k7657J3471M4775L7622N639j2207j2517j4186j9133l0077k8252
$$ 100370848 100324774 100297117 100310588 100355363 100392985 100398624 100386417 100373900 100359714 100340581 100310504 100282252
3139A00282252P260K4438K682r847j5998k5487r060J6117Q071p618m05J395q190j2982
$$ 100282252 100289512 100313950 100316632 100306785 100290787 100265300 100256240 100272357 100280428 100272810 100272405 100273800 100265610 100252628
3167.5A00252628k1076k8551k5773j3840j800k658n937n722j0943r942J323M220M77
$$ 100252628 100231552 100203001 100177228 100163388 100161588 100158930 100152993 100147271 100136328 100126386 100127709 100131929 100132406
3194.1A00132406l863j5723k3079j6034q666j4651j4818K003J931j4174j3971m602
$$ 100132406 100128543 100112820 100089741 100073707 100065041 100050390 100035572 100037575 100039506 100025332 100011361 100006759
3218.5A00006759p999j1003q04l261j6284k5350k9611p546P063l070M661p74l0047
$$ 100006759 99998760 99987757 99986953 99983692 99967408 99942058 99912447 99904901 99911964 99908894 99913555 99912781 99882734
3245I9882734k4474J2410K5332K026j8739j7602j3345j5956j0789L982p349m1920l4702
$$ 99882734 99858260 99870670 99896002 99898028 99879289 99861687 99848342 99832386 99821597 99825579 99818230 99776310 99741608
3271.6I9741608j299l028j0246Q714J3852q696j0950q708l9721n0056k5749o091J2022
$$ 99741608 99740309 99737281 99727035 99735749 99749601 99740905 99729955 99721247 99681526 99631470 99605721 99599630 99611652
3298.1I9611652J2541k1792n2488l7372P171L1411J6714j0348l964J7727O306k1487
$$ 99611652 99624193 99602401 99549913 99512541 99519712 99551123 99567837 99557489 99553525 99571252 99577558 99556071
3322.5I9556071k9993j4532M744J3799O276k8079o2085m6032j0211k9R137J2064l946
$$ 99556071 99526078 99511546 99516290 99530089 99536365 99508286 99446201 99400169 99389958 99389929 99399066 99411130 99407184
3349.1I9407184m35K0772J2422j7667k3931m000N96l0178n2136k5594J9765K8163K623
$$ 99407184 99406749 99427521 99439943 99422276 99398345 99394345 99394941 99364763 99312627 99287033 99306798 99334961 99337584
3375.6I9337584r978K301Q923j109q291k5731n8634n2583j246J8931j6719m6611r596
$$ 99337584 99327606 99329907 99338830 99337721 99329430 99303699 99245065 99192482 99191236 99210167 99193448 99146837 99137241
3402.1I9137241M6497K3943k6565k1691N508K1559K3556N305j2815k015J8591n07l5751
$$ 99137241 99183738 99207681 99181116 99159425 99164933 99186492 99210048 99215353 99202538 99200523 99219114 99218607 99182856
3428.6I9182856k0581m41k3437j3369M5818O9207M0704K461j2868M476J6999M167j3489
$$ 99182856 99162275 99161834 99138397 99125028 99170846 99240053 99280757 99283218 99270350 99274826 99291825 99295992 99282503
3455.1I9282503k7102l8016l6997k9903m2302n9610k7830L5006M7559Q219l4171l8093
$$ 99282503 99255401 99217385 99180388 99150485 99108183 99048573 99020743 99055749 99103308 99111527 99077356 99039263
3479.6I9039263M285K3067R18j2064j1200j0943k2554l3635j7345o205k0141p03L2914
$$ 99039263 99043548 99066615 99067533 99055469 99044269 99033326 99010772 98977137 98959792 98953587 98933446 98932743 98965657
3506.1I8965657J0639k6411l4141j9419K402P611K504o509r245n740j4025n454J0825
$$ 98965657 98976296 98949885 98915744 98896325 98898727 98906338 98908842 98902333 98893088 98887348 98873323 98867869 98878694
3532.6I8878694o015k3740j0514K515p373k0164o849J7542J3190j299M971J6910J1879
$$ 98878694 98872679 98848939 98838425 98840940 98833567 98813403 98806554 98824096 98837286 98835987 98840958 98857868 98869747
3559.1I8869747r06l815j9902n0127l1823K7954N0164J8745k0295l6037k5892j222
$$ 98869747 98868841 98865026 98845124 98794997 98763174 98791128 98841292 98860037 98839742 98803705 98777813 98776591
3583.6I8776591l195k2399Q547L7533J0383j1599n823j3429j2780J3710J5211j2130
$$ 98776591 98773396 98750997 98759544 98797077 98807460 98795861 98790038 98776609 98763829 98777539 98792750 98780620
3608.1I8780620j9795q052K986Q816k3962m6849K283N8991M8733n1731p4178K569J1569
$$ 98780620 98760825 98752773 98755759 98764575 98740613 98693764 98696047 98755038 98803771 98752040 98677862 98680431 98692000
3634.6I8692000j019j5939k7591N651M6378K2173q1908q1331M4078L8117m9597l5697
$$ 98692000 98690981 98675042 98647451 98653102 98699480 98721653 98639745 98558414 98602492 98640609 98591012 98555315
3659.1I8555315J8322K8223K7752K1320l1578k9314J6356n9921p7522K3252N2023L5328
$$ 98555315 98573637 98601860 98629612 98650932 98619354 98590040 98606396 98546475 98468953 98492205 98544228 98579556
3683.5I8579556J2034n6899r0849p135M0871K6477L1459L3599j663j0383J2028J1397
$$ 98579556 98591590 98534691 98443842 98436707 98477578 98504055 98535514 98569113 98567450 98557067 98569095 98580492
3708I8580492l0536q1867l3557L0565K3478l719k9945n6661m8107P165J3620m5407
$$ 98580492 98549956 98468089 98434532 98465097 98488575 98484856 98454911 98398250 98350143 98357308 98370928 98325521
3732.5I8325521p3618l2830M6897J05703M6026o7961j2982L3570l2831l1882K0146
$$ 98325521 98251903 98219073 98265970 98371673 98417699 98349738 98336756 98370326 98337495 98305613 98325759
3754.9I8325759K9308P754J2476J8781l630L219k468l9095k3925O312p528j6540J8918
$$ 98325759 98355067 98362821 98375297 98394078 98390448 98393667 98391199 98352104 98328179 98334491 98326963 98310423 98329341
3781.4I8329341K0200j3524o950Q232M834j1611l2115j115K968m5985m351M381m3177
$$ 98329341 98349541 98336017 98329067 98337299 98342133 98330522 98298407 98297292 98300260 98254275 98249924 98254305 98211128
3808I8211128K008N4962J5854n0872k9665l9202o2281J2010L6752K1387J7160K259
$$ 98211128 98213136 98268098 98283952 98233080 98203415 98164213 98101932 98113942 98150694 98172081 98189241 98191500
3832.4I8191500j0526k9719l4917l814J0287L636J9378M9978K9612r4497j35261O616
$$ 98191500 98180974 98151255 98116338 98112524 98122811 98126447 98145825 98195803 98225415 98130918 97995657 98002273
3856.9I8002273O9994L9130j5396k2411J5563j8692n6464k1309J0986L0833N740m864
$$ 98002273 98072267 98111397 98096001 98073590 98089153 98070461 98013997 97992688 98003674 98034507 98040247 98035383
3881.4I8035383M667m6676l0214J6713j7744j3244K5344J6695J139k7198o8367l4159
$$ 98035383 98040050 97993374 97963160 97979873 97962129 97948885 97974229 97990924 97992063 97964865 97896498 97862339
3905.9I7862339L0136L0917Q518m477k4485k7156n07J2267n764p75K0993j0890n5927
$$ 97862339 97892475 97923392 97931910 97927433 97902948 97875792 97875285 97887552 97881788 97881013 97902006 97891116 97835189
3932.4I7835189l5047J5360K2566j4055k5534J1950K0206j0055r072P719p367j7959
$$ 97835189 97800142 97815502 97838068 97824013 97798479 97810429 97830635 97820580 97811508 97819227 97811860 97793901
3956.8I7793901P99N78j8782k0128n657P910P558m399j5271j5384k896L618j0246k1923
$$ 97793901 97794700 97795278 97776496 97756368 97750711 97758621 97766179 97761780 97746509 97731125 97728229 97731847 97721601 97699678
3985.4I7699678j4281r54q297k5111o479P635
$$ 97699678 97685397 97684443 97676146 97651035 97644556 97652191
3997.6I7652191
$$ 97652191
##END=$$ End of the data block
