##TITLE=$$ Begin of the data block
##JCAMP-DX=5.00 $$ ACD/SpecManager v 10.08
##SPECTROMETER/DATA SYSTEM=Varian
##DATE=24 Apr 2013 14:28:38
##DATA TYPE=INFRARED SPECTRUM
##DATA CLASS=XYDATA
##ORIGIN=
##OWNER=
##NPOINTS=3735
##FIRSTX=399.26403809
##LASTX=4000.35498047
##MAXX=4000.35498047
##MINX=399.26403809
##MAXY=108.55877686
##MINY=4.23491526
##XFACTOR=1.0000000000
##YFACTOR=0.000001000000000
##FIRSTY=4.23491526
##DELTAX=0.96440572
##XUNITS=1/CM
##YUNITS=TRANSMITTANCE
##XYDATA=(X++(Y..Y))
399.3 4234915 4234915 4234915 4234915 4234915 4234915 4234915 4234915 4234915 4234915 4234915 4234915 4234915 4234915 4234915 4234915 4234915 4234915 4234915 4234915 4234915 4234915 4234915 4234915 4234915 4234915 4234915 4234915 4234915 4234915 4234915 4234915 4234915 4234915 4234915 4234915 4234915 4234915 4234915 4234915 4234915 4234915 4234915 4234915 4234915 4234915 4234915 4234915 4234915 4234915 4234915 4234915 4234915 4234915 4234915 4234915 4234915 4234915 4234915 4234915 4234915 4234915 90265076 96953140 90740486 92227455 98659821 105058578 99331589 90385681
465.8 90385681 93989708 95980385 102361641 96738136 94799866 96601013 92780411 94782326 93459656
474.5 93459656 96240211 96372185 97559540 94764122 90503937 90298286 88947952 91786125 90477875
483.2 90477875 93085068 96804085 94581802 89494843 86506592 88266800 84633507 83101456 84851562
491.8 84851562 86558540 86126930 83291931 82522636 81902527 81013222 79222725 77702393 74959999
500.5 74959999 72148178 69923424 67167007 63761982 60196499 56628296 51602310 49509491 47879288
509.2 47879288 46135639 43550900 41144211 39943382 39324665 40003281 39997513 41930256 45329208
517.9 45329208 48663933 52931793 57158928 61330597 64152435 66576309 69305061 71157425 73548935
526.6 73548935 75300697 76610085 77214661 77544296 78601471 79157341 79432732 79868462 80864098
535.2 80864098 81596176 82526299 83741676 84505684 85208122 85541733 85704742 85418823 85950294 86234596
544.9 86234596 85661545 85160530 84423538 84221581 82958336 82138054 82140511 82105438 82054764 81364113
554.5 81364113 81380028 80922935 79898102 78548058 77390968 76565483 75406410 74189316 72296852
563.2 72296852 70289803 67330124 63028160 57022945 50148331 42725521 36232128 32522869 31634966
571.9 31634966 32878834 35842709 40499157 45718956 51346077 55159523 57801548 59236595 60294025
580.6 60294025 61565525 62085983 62622223 63248436 64021317 64735115 65092949 65472145 65217461 64551910
590.2 64551910 63447308 61715385 60034431 57988400 55549759 52175587 48527607 45047951 42071507
598.9 42071507 39943115 38855957 39014610 39243095 39493412 39349178 38937477 38011829 36796646
607.6 36796646 35768700 34232281 32577446 30819252 29644464 28355473 27302738 26653145 25877094
616.3 25877094 26101141 26279404 26651312 27257732 28362049 30072302 32278828 34805862 37055286
624.9 37055286 40061691 43081902 45471916 47630264 49964695 52537682 54594219 56267849 57948101
633.6 57948101 59491589 61015251 62458153 63670650 64789749 65979256 67051941 67793709 68390907
642.3 68390907 68879410 68995499 68407158 67775520 67227203 66270142 64679626 62817375 61066509
651 61066509 59100048 57678349 56923698 56939178 57418076 58401218 59723118 61250626 63327850 65362259
660.6 65362259 67352219 69324135 71255585 73151299 74865181 76429848 77791962 80101753 81598801
669.3 81598801 82460762 83514450 84434906 85437782 86385117 87275978 88206551 88824684 89402153 89781578
678.9 89781578 90276505 90804176 91200211 91335724 91274048 91657448 91980370 92099312 92092224 92297112
688.6 92297112 92452690 92431183 92640114 92592537 92509659 92333527 92208099 92163391 91936638 91498093 91037529
699.2 91037529 90832504 90358528 90106651 90076233 89880798 89770058 89810081 89979752 90170601 90602592
708.8 90602592 90889320 91334564 91827225 92178246 92865486 93296814 93695442 93954964 94270996 94715942
718.5 94715942 94673889 94513779 94663727 95012993 94893829 94681198 94438133 94366051 94372574 93695351 92904747
729.1 92904747 91763832 90413597 88880310 87041687 84896606 82016144 78783707 75385185 71352432
737.8 71352432 66665977 62414558 59378338 58442558 59891148 63410358 68393219 73845894 78917007
746.5 78917007 83137886 86318420 88776558 90461922 91644470 92460350 93218025 93676590 93769005
755.1 93769005 93834839 93577858 92912659 91636215 89609741 86165848 81685974 77341309 74716125
763.8 74716125 74400864 75082008 75696922 75764145 75343170 74553116 73750809 72883987 71921173 71273499
773.5 71273499 70725220 70335220 69985687 69756538 69495819 69116386 68774567 68209747 67610634 66633842
783.1 66633842 65293777 63799030 62072830 60286102 58643658 57452160 56893723 56859451 57178291
791.8 57178291 58411480 60498516 62947632 65661720 68531380 71617485 74665123 77487732 80036583
800.5 80036583 82090546 84003418 85379433 86513992 87541664 88371246 89370514 90225983 91139351
809.1 91139351 91914726 92571312 93115173 93869812 94674965 95241920 95868713 96005585 96224609 96405609
818.8 96405609 96620087 96876045 96873352 97086349 97139427 97466896 97840141 98051994 98173668 98414902
828.4 98414902 98889282 99018402 99178879 99219032 99484840 99809166 100000580 100118355 100168564 100612404
838.1 100612404 100587784 100599754 100781784 100972527 101062492 100665939 100548538 100491417 100452934 100233879 100108437
848.7 100108437 100062706 99915947 100002495 99997108 100266335 100444580 100566521 100679924 100854851 101290695
858.3 101290695 101507011 101727989 101759254 101874069 101936768 102072975 102244400 102234093 102579079 102626251
868 102626251 102748360 102924316 102851639 102790459 102871597 103099403 103060432 103080879 102892479 102708138 102566093
878.6 102566093 102539513 102730850 102627594 102532066 102212654 101951317 101805252 101786156 101787849 101620583 101615746
889.2 101615746 101543037 101574638 101390450 101363663 101482765 101535774 101749931 101791672 101961571 101734535 101682228
899.8 101682228 102053780 102201645 102193298 102135559 102372742 102479172 102630302 102502136 102317444 102335243
909.4 102335243 102199730 102427734 102489136 102501251 102515160 102663811 102820068 102703072 102836220 102867096
919.1 102867096 102952484 102926765 102976204 103109741 103110260 103099419 102894112 102993866 103063248 103089531 102967232
929.7 102967232 102861893 103023544 103036865 102998634 102756653 102697052 102526031 102490715 102571198 102410179 102406891
940.3 102406891 102143936 102053497 101959938 101956802 101932327 101707481 101635094 101220024 101104347 101153557 101084717
950.9 101084717 100882668 100762070 100765648 100654732 100872398 100734306 100671883 100568558 100127426 99737015
960.6 99737015 99200333 98930367 98476891 97969254 97374474 96692635 96145119 95759201 95485161 94835251
970.2 94835251 94567314 94316101 94043465 94047287 93988708 94290680 94590782 94945930 95432373 95911964
979.8 95911964 96167992 96460991 96918289 97144691 97542198 97686996 97870300 98140114 98306145 98587029
989.5 98587029 98828300 99240562 99218582 99120438 99199867 99190933 99043884 98889854 98867599 98599167 98582207
1000.1 98582207 98417656 98115723 97951134 97661697 97297829 96843613 96503456 95813820 95266899 94781960
1009.7 94781960 94023766 93338127 92693573 92230362 91614548 91131996 90654999 89993706 89072655 88072578
1019.4 88072578 87356598 86418900 85357391 84080551 82860344 81406021 79516792 77599541 75419533
1028.1 75419533 73150131 70706367 68161705 65420204 62497715 59537132 56801689 54519344
1035.8 54519344 52594452 50896038 49431755 48125866 46824226 45630291 44127586 42468021
1043.5 42468021 40571148 38346302 35714310 32752850 29972475 26995209 24539555 22269802
1051.2 22269802 20375113 19013596 17752377 16914330 15985627 15587500 15410343 15524105 15577068
1059.9 15577068 15763002 16448282 17208210 18562355 19751974 21431860 23400335 25554209 28382727
1068.6 28382727 31436699 34732708 38160831 41980690 45631981 49139263 52529739 55666595
1076.3 55666595 58688957 61099670 63296917 65573738 67300285 68704254 69759560 70557709 71168671
1085 71168671 71566132 72161346 72777039 73720711 74637787 75374107 76323608 77369972 78455750 79257957
1094.6 79257957 79910759 80306450 80810524 81296593 81522766 81764084 81806328 81948006 81731392 81347778
1104.2 81347778 81010025 80606285 80011719 79236305 78642685 77747726 76810974 75620804 74236282
1112.9 74236282 72717957 71007309 69526253 68028053 66652222 65356911 63977116 62261978
1120.6 62261978 60191853 57602463 54629658 51265285 47410664 43443344 39088665 34851524
1128.4 34851524 30772345 27239849 24218554 21885296 20241785 19133028 18500551 17927511 18026136
1137 18026136 17852827 17725355 17966467 18222372 18532873 18974871 19959526 20869310 22028248 23235559
1146.7 23235559 24680498 26500378 28381594 30403906 32353565 34471867 36227585 37812111
1154.4 37812111 39310257 40414577 41245178 41575710 41467297 40906246 40118626 38947918 37539211
1163.1 37539211 36109360 34288918 32662285 31027756 29421785 27687397 26024189 24678471
1170.8 24678471 23284590 22192835 20962772 19985449 18872969 17732447 16756075 15584747 14551133
1179.5 14551133 13384985 12601356 11745298 11083436 10401828 9678458 9387383 8926892 8763246 8387733
1189.1 8387733 8198137 8010063 7821879 7801764 7540810 7485253 7250334 7409105 7412768 7438015 7540094
1199.7 7540094 7466399 7719374 7693020 7943538 8033127 8330940 8669279 8772202 9127226 9372753
1209.4 9372753 9959515 10308374 10932901 11513844 12041213 12864070 13481735 14448629 15110570 15828561
1219 15828561 16495790 17081366 17609221 17781244 18049974 17967403 17985823 17892937 17882803 17969334 18017744
1229.6 18017744 18408150 18723343 19385729 19980091 20824270 21798748 22687309 23708595 24576794 25634106
1239.3 25634106 26430302 27361465 28396959 29636486 31446520 33625305 36291512 39126274 42177834
1247.9 42177834 45108818 47764694 50146519 52186241 53993816 55602058 57030781 58381008
1255.7 58381008 59522297 60547081 61478355 62212685 62982632 63601894 64063484 64389320 64717621
1264.3 64717621 64986870 65069710 65168610 65194489 65173866 65169670 65318108 65411926 65509300 65647461 65668030
1274.9 65668030 65793182 65900238 66037071 66067406 66111328 66260384 66318123 66422806 66490646 66581581 66535789
1285.5 66535789 66526649 66489616 66360870 66344963 66139771 65899834 65539696 65173271 64720291 64234222
1295.2 64234222 63865452 63355522 62935669 62563831 62360352 62144970 61844063 61539742 61065578 60494339
1304.8 60494339 59608719 58632080 57470699 56103722 54630913 53025246 51445053 49701118 47770451
1313.5 47770451 45797512 43876633 41962467 39973991 37898129 35899872 33903206 32086021
1321.2 32086021 30295197 28662312 27219782 25828148 24737661 23640156 22972382 22353704 21953886
1329.9 21953886 21711462 21521667 21695692 21650440 21866125 21852758 21825695 21679602 21259819 20963125
1339.6 20963125 20129360 19323709 18168304 17162025 16001879 14856907 14077991 13109511 12623859
1348.2 12623859 12013741 11916680 11729904 11627145 11706465 11578910 12089384 12339817 12969727 13413066
1357.9 13413066 14185953 15032892 15965148 17435343 18672310 21491440 23164047 25289974 27921371
1366.6 27921371 30524406 33949791 37366280 40834126 43749523 46922806 49670021 52800247
1374.3 52800247 56024647 58129761 60257378 62077305 64130615 65527519 66843697 68064232
1382 68064232 69275322 70837303 71991829 73315155 74358505 76210014 77818581 78962257 80423828
1390.7 80423828 81793282 83077568 83953911 85226524 86430954 87037704 87427155 87595634 87858536
1399.3 87858536 88050079 88033798 87778114 87491768 86963524 86076126 85303200 84635864 83871696 83060181
1409 83060181 82273476 81623260 81220207 81091568 80966385 81096268 81394577 81646172 82062775 82418602
1418.6 82418602 83142944 83416512 83538452 83626846 83557800 83751381 83958420 84115913 84273598 84449631
1428.3 84449631 84690933 84971603 85375023 85405167 85390648 85427864 85271828 85219734 84942223 84775436
1437.9 84775436 84527199 84328674 84097389 83821114 83603600 83066284 82693161 82033340 81184692 80205200
1447.6 80205200 78576881 77176460 75448166 73736107 71916725 70313164 69241669 68042793
1455.3 68042793 67669701 67594040 67914543 68362053 68690544 68950394 68881554 68845039 68504204 68036507
1464.9 68036507 67542793 67108330 67223808 67512520 68618332 69718147 71278694 74205338 76126862
1473.6 76126862 77145538 77379959 77675583 77491058 77203201 76611862 75870422 74931541 74085541 73522652
1483.2 73522652 73201538 73252045 73387527 74181564 75331116 76051369 77190712 78549149 79439636
1491.9 79439636 79754494 80050835 79964973 79734367 78956543 78263519 77392860 75551842 74382156 72597466
1501.6 72597466 70823364 68853424 67341911 66003189 63277706 60735874 57212543 55954651
1509.3 55954651 53608887 52311119 50940434 49682781 49067902 48439827 48337345 48135418 49381786
1518 49381786 49123226 49027653 48938007 48822891 49379795 48752426 48522202 48141003 47761456 47282742
1527.6 47282742 46873489 46461922 45889072 45699417 45445065 45497295 45977184 45838879 45961071 45949474
1537.2 45949474 45768082 45992611 47645340 48544823 49140858 50759384 51365891 52549812 54454662
1545.9 54454662 55210236 56341839 57160248 58840782 60969524 62202370 63403454 64388306 67302185
1554.6 67302185 68546181 69390587 69663475 70682762 75261345 76116508 77870667 78307518 79417145
1563.3 79417145 80261620 81611214 82963531 83561218 84346535 84381836 86029503 86393692 86717369
1572 86717369 87045647 87056511 87191078 86271538 85553215 84490364 83188438 81138184 78531578 76278091
1581.6 76278091 74251617 73189384 73283752 74538200 76813896 79516174 82567741 85147179 87615471
1590.3 87615471 89174713 90557281 91436096 92178169 92796143 93149002 93641281 93646614 93883797 93824554
1599.9 93824554 93897316 93837723 93667877 93562569 93257057 93103546 92587578 92299675 91788139 91372147
1609.6 91372147 90909348 90297005 89701401 88849861 88144279 87210678 86478790 84422447 83190620
1618.2 83190620 81987823 80514801 78917130 77311218 75451904 71359612 68527649 65336372
1626 65336372 62434376 58020512 54212749 51893658 50328606 50236423 50585724 52299831 52942444
1634.6 52942444 59017258 62266495 64365936 66542709 67676994 68737022 69080605 69501862 69275482
1643.3 69275482 69045807 68460396 67340332 66687630 65207901 64379372 63040085 62148437 61212601
1652 61212601 60084637 58292976 55852390 54902733 53291897 52158131 50835381 49656002 48642567
1660.7 48642567 47351673 46939404 45647919 45055557 44096725 43412651 42875275 42159985 42698124
1669.4 42698124 41737526 41955421 41517414 41459808 41155468 41166527 42404922 41880581 42340038 42260757
1679 42260757 42999271 43947350 44314098 44877579 44409485 49817871 49710384 50652950 51642651 53430618
1688.6 53430618 55501526 57395931 59665062 61361370 63536877 64905983 66660133 71394119
1696.4 71394119 73368233 75069687 75855659 78161766 82944763 84070473 85236763 86666298 88341064
1705 88341064 89500145 91115257 92291809 93059250 93901222 94744125 95476501 96015198 96453613 96835785
1714.7 96835785 97295280 97772736 98116852 98882866 99172623 99513542 99837372 99960327 100259079 100544876
1724.3 100544876 100779541 100907013 101072777 101288452 101263962 101362328 101487556 101584328 101476135 100936081
1734 100936081 101455742 101957916 102169098 102152031 102213150 102117996 102338676 102492920 102400536 102475426 102528046
1744.6 102528046 102708374 102676819 102576775 102586143 102720993 102921623 102777153 103011414 103091820 103187569
1754.2 103187569 103220207 103057419 103115555 103254677 103431969 103424057 103286278 103102325 103347755 103523178
1763.9 103523178 103519554 103597404 103500214 103543732 103647903 103665550 103599854 103231773 103167755 103368683 103545502
1774.5 103545502 103462708 103546745 103626671 103564697 103517036 103299789 103416801 103521187 103563942 103394470 103208572
1785.1 103208572 103342041 103264893 103242722 103175621 103028320 102661179 102404648 102398293 102302254 102271973 102107376
1795.7 102107376 102137657 102053772 101973541 101959785 101932083 102001007 102025490 102285149 102336250 102483620 102723335
1806.3 102723335 102881058 103189270 103336151 103472763 103600693 103890091 104146698 104324821 104524651 104602211
1815.9 104602211 104729301 104817703 104950722 104996735 105050728 105132545 105145424 105180779 104986954 104975677 105078949
1826.5 105078949 105134766 105068695 104789986 104811249 104827530 104879303 104793945 104703354 104599777 104431480 104235817
1837.2 104235817 103951195 103894501 103759666 103636948 103456367 103200172 102877762 102534653 102630592 102531433
1846.8 102531433 102450043 102362938 102397888 102477226 102422501 102444130 102450874 102571892 102684669 102863495 103012672
1857.4 103012672 103102638 103255852 103292686 103437340 103565918 103694054 103810272 103894638 103929977 103807640
1867.1 103807640 103760605 103656746 103799126 103879349 103865234 103854019 103826698 103826042 103670891 103681229 103661369
1877.7 103661369 103601913 103610634 103555290 103599297 103600533 103653137 103718887 103861092 103993645 104050346 104078079
1888.3 104078079 103998093 104167625 104347763 104528046 104681580 104732903 104752792 104758202 104882149 104948555 105068985
1898.9 105068985 105161880 105203209 105247917 105232910 105200089 105184280 105294151 105218124 105093346 105020805 104924049
1909.5 104924049 104950386 104949112 104957970 104899132 104843536 104713539 104529770 104338867 104056015 103994720 103867187
1920.1 103867187 103712814 103420326 103130241 103105209 102984764 102844154 102673347 102539917 102342361 102199036
1929.7 102199036 102130135 102075768 102076500 101972588 101980972 101998291 102039680 102105865 102175774 102321518 102439827
1940.3 102439827 102502777 102427559 102657982 102903015 102975594 103059601 103206596 103379570 103413231 103501839 103563156
1951 103563156 103681984 103772552 103807945 103877518 103870094 103992233 103969521 103972046 103990479 103949951 103997108 103953606
1962.5 103953606 104063141 104081383 103972832 103847496 103820885 103932266 103915535 103956795 103955139 104046272 104167213
1973.1 104167213 104255310 104333267 104337646 104494110 104579788 104638710 104655319 104693314 104828323 104903862 105012413
1983.7 105012413 105038330 105054817 105076241 105077934 105089638 105177208 105231987 105176949 105209404 105181236 105166740 105163284
1995.3 105163284 105194527 105218246 105170975 105164558 105122932 105116287 104988449 104896858 104845909 104733833 104759850
2005.9 104759850 104769440 104739128 104646812 104635979 104620514 104584473 104593880 104517578 104501427 104406342 104358086 104375031
2017.5 104375031 104392708 104444038 104432999 104489571 104506577 104509109 104492462 104573250 104655624 104646660 104764389 104840240
2029.1 104840240 104974625 105132088 105231155 105264984 105308060 105381363 105367096 105461075 105551414 105674583 105706848
2039.7 105706848 105673897 105735634 105773804 105939697 106054710 106100815 106050819 106052727 106145699 106121010 106121643 106125977
2051.2 106125977 106227867 106206284 106235687 106392441 106387802 106436913 106451782 106470947 106420387 106394600 106488335
2061.9 106488335 106512749 106480156 106375008 106364777 106391098 106465179 106519501 106538872 106544464 106476318 106549347
2072.5 106549347 106603104 106568283 106507019 106514465 106484589 106397339 106391464 106349289 106414566 106420357 106439240 106470901
2084 106470901 106394600 106361534 106281326 106337692 106379028 106412811 106452446 106386948 106413261 106382317 106356453 106415756
2095.6 106415756 106449219 106388641 106384026 106422829 106429153 106491989 106511902 106566643 106588997 106603714 106588257 106606552
2107.2 106606552 106713768 106702477 106696075 106612427 106623306 106725143 106790749 106818291 106724770 106761635 106751793
2117.8 106751793 106753998 106771461 106768585 106855011 106821121 106786690 106768280 106770775 106754593 106811050 106870262 106807617
2129.4 106807617 106854538 106869888 106844757 106806381 106822220 106841080 106874893 106965904 106909935 106876343 106801094
2140 106801094 106822624 106901917 106843285 106851929 106879807 106893990 106847488 106855965 106834450 106774719 106787529 106764244
2151.5 106764244 106749367 106745110 106840576 106870529 106870407 106885841 106851921 106843948 106756691 106755150 106750420 106730743 106700821
2164.1 106700821 106637184 106677788 106737869 106746277 106587898 106551323 106527870 106389839 106376831 106368279 106377747 106318329
2175.6 106318329 106288002 106287582 106248260 106184212 106066177 106020714 105936623 105850212 105795044 105837158 105875771 105801102
2187.2 105801102 105760109 105708298 105691124 105639641 105624451 105626053 105606628 105652695 105711380 105810921 105789490 105754585
2198.8 105754585 105819519 105930473 105980331 105978195 106037971 106061859 106168861 106180855 106132439 106167496 106272179
2209.4 106272179 106489662 106505104 106436203 106384911 106411598 106506790 106529602 106592392 106557541 106503456 106538193
2220 106538193 106617546 106633797 106554878 106502159 106484680 106497833 106445793 106417191 106434723 106404572 106326981 106307472
2231.6 106307472 106355835 106392693 106438309 106348564 106276833 106258453 106228058 106219833 106177017 106189308 106141731 106114136
2243.2 106114136 106084023 106027870 106047852 106035645 106003029 105985107 106058640 106054726 106015366 105994698 105920479 105911766
2254.7 105911766 105903214 105878494 105791275 105851486 105954811 105892059 105841415 105783791 105800278 105836632 105856705
2265.3 105856705 105811333 105759537 105770866 105802666 105877472 105842583 105840759 105818054 105810753 105864784 105879807 105987930
2276.9 105987930 106018639 105999748 105950920 105923294 105901817 105878967 105956421 105972618 105991661 105954147 105961388 105968422
2288.5 105968422 105915535 105966743 105975075 105971794 105942734 106008385 106032211 105996063 105992310 105893715 105933586 105893478
2300 105893478 105816422 105823700 105859955 105941971 105964127 105995804 105873367 105841881 105948380 105971756 105862396
2310.7 105862396 105658371 105735924 105853714 105807770 105745071 105763359 105752388 105695610 105674225 105551613 105520157
2321.3 105520157 105600197 105651237 105566177 105617493 105623383 105561157 105700363 105524788 105443443 105439529 105516396
2331.9 105516396 105782616 105762474 105612335 105515564 105637291 105628174 105709167 105781517 105714317 105683128 105578255
2342.5 105578255 105570129 105335915 105482315 105654892 105501686 105350693 105201508 105237335 105129501 105016373
2352.1 105016373 105062744 105228577 105362244 105260033 105395714 105114380 105049423 105290245 105521866 105606377
2361.8 105606377 105338066 105146851 104830406 104918091 105046722 105150734 105107811 105053452 104988396 104613319
2371.4 104613319 104626907 104521889 104404839 104510239 104582146 104557487 104357346 104298683 104215828 104152473 104173386
2382 104173386 104159767 104108063 103988037 103953918 104006111 104066444 103990639 103888748 103914330 103954460 103898308
2392.6 103898308 103853317 103970284 104037064 104091270 104099518 104050011 104103027 104190392 104256706 104258194 104267532 104240028
2404.2 104240028 104283554 104313393 104305183 104372025 104341064 104384422 104403778 104381111 104374878 104469215 104628075 104586639
2415.8 104586639 104602623 104590790 104621765 104663834 104652382 104740440 104696564 104699524 104746239 104785316 104766472 104789719
2427.3 104789719 104934959 104947014 104953056 104910744 104938316 105003059 105043961 105135529 105149094 105154793 105158882 105274788
2438.9 105274788 105315887 105300972 105285858 105217339 105259903 105266335 105361702 105426918 105438438 105443398 105407043 105483887
2450.5 105483887 105494064 105513512 105486649 105438728 105423500 105434586 105522781 105526756 105542908 105488655 105484695 105543350
2462.1 105543350 105541473 105577911 105594391 105630287 105596031 105602737 105617371 105569252 105531395 105497513 105586800 105666771
2473.6 105666771 105743744 105781975 105788422 105790321 105748856 105840172 105942657 105922737 105823883 105836052 105935310 105968781
2485.2 105968781 105965157 105996292 106105759 106097778 106096054 106186996 106210457 106209061 106241600 106291840 106339684 106382538
2496.8 106382538 106322678 106277237 106297791 106371918 106435463 106413818 106480865 106542328 106542046 106462868 106425117 106463806
2508.3 106463806 106459557 106515144 106510841 106493797 106493454 106512390 106534538 106496315 106454079 106378090 106396820 106398926
2519.9 106398926 106422569 106466270 106416039 106388870 106351418 106419121 106453094 106445320 106454231 106410645 106437347 106451653
2531.5 106451653 106462776 106430527 106377563 106317146 106230675 106235680 106296425 106308929 106234901 106256798 106306099 106263283
2543.1 106263283 106216125 106211319 106236351 106247314 106248222 106202232 106223076 106230194 106283966 106359283 106265007 106303543
2554.6 106303543 106362022 106370682 106376427 106282326 106224274 106219711 106275970 106339424 106362740 106305618 106297211 106316162
2566.2 106316162 106251915 106263397 106271759 106292603 106321815 106290100 106278328 106318314 106301559 106263756 106331238 106311356
2577.8 106311356 106305389 106351974 106358047 106355614 106223915 106036583 105958809 106035553 106065834 106063843 106088036 106094894
2589.4 106094894 106116882 106052773 105997543 105985367 106044884 106082191 106105225 106217209 106248611 106260338 106227333
2600 106227333 106233101 106309471 106341286 106357307 106404099 106521965 106564079 106573708 106543205 106552681 106638458 106686897
2611.5 106686897 106731255 106722916 106785378 106782661 106765579 106833260 106807838 106745399 106679184 106725136 106783577 106817017
2623.1 106817017 106819305 106794952 106786789 106704674 106643959 106589752 106706139 106779243 106683052 106688263 106665962 106655075
2634.7 106655075 106584785 106567253 106661934 106675148 106684242 106663254 106585510 106518188 106519920 106495377 106505997 106564529
2646.3 106564529 106617203 106629425 106534195 106550949 106581970 106521904 106412605 106398819 106488441 106512688 106595039
2656.9 106595039 106561378 106486275 106465919 106456467 106515129 106469063 106366035 106258064 106290672 106357819 106268135
2667.5 106268135 106231392 106302216 106326927 106265121 106245499 106232796 106295151 106294357 106213264 106296181 106334763 106319778
2679 106319778 106301445 106285606 106305908 106379845 106395340 106274490 106275276 106316223 106312851 106308846 106368111 106376656 106300079
2691.6 106300079 106419090 106527008 106519119 106464005 106439690 106420685 106323639 106332596 106351280 106326797 106324646 106364929
2703.1 106364929 106352745 106266342 106207581 106174904 106234947 106279533 106276695 106207558 106159180 106197830 106177589 106200363
2714.7 106200363 106255600 106257790 106185486 106146225 106116638 106041862 106010612 105987198 106031326 105986938 105882820
2725.3 105882820 105857285 105793457 105696152 105683983 105693596 105548065 105541534 105617561 105568398 105527863 105510574 105485413
2736.9 105485413 105335480 105286156 105305305 105258026 105263237 105287766 105360443 105321495 105196793 105151344 105210495
2747.5 105210495 105306404 105397072 105414490 105279015 105223892 105246193 105297539 105316559 105304161 105385963 105416504
2758.1 105416504 105390709 105368065 105452858 105524498 105442932 105412567 105476387 105455978 105341377 105379669 105466690
2768.7 105466690 105461510 105434143 105432915 105433250 105383354 105369949 105398712 105456474 105395180 105307693 105331078 105315353
2780.3 105315353 105175117 105036781 105178566 105274704 105224068 105162926 105073196 105112564 105118454 105105209 105068138
2790.9 105068138 105023254 104958801 104865715 104871407 104821198 104802895 104776497 104671394 104525833 104440643 104448807
2801.5 104448807 104401390 104360085 104266548 104258865 104289978 104314980 104364594 104293129 104245033 104182396 104203178 104192780
2813.1 104192780 104035866 103908249 103826454 103787300 103754555 103806870 103717117 103608498 103602478 103544868 103494164
2823.7 103494164 103308960 103194122 103154121 103078606 102969284 102883896 102857513 102721962 102708771 102664764 102495613
2834.3 102495613 102391777 102303581 102237076 102203506 102179985 101981148 101761818 101728371 101758102 101587662 101351891
2844.9 101351891 101281479 101191162 101099831 100956055 100876259 100738342 100499832 100376823 100181992 99931068
2854.6 99931068 99567131 99315163 99028198 98589394 98243622 97756096 97158485 96431694 95801338 95241478
2864.2 95241478 94576149 93874947 93002174 92138405 91365379 90696228 89970413 89259216 88554344 87659584
2873.8 87659584 86821388 85888176 84925392 84058914 83203476 82447891 81860901 81473579 81338928 81625641
2883.5 81625641 82241692 83120148 84072350 85134659 86368057 87336105 88225899 89136116 89975182
2892.2 89975182 90640945 91033974 91431450 91819000 92121513 92242661 92217232 92205162 92310349 92263901
2901.8 92263901 91998497 91853310 91552750 91245255 91033264 90752281 90498177 90119591 89817436 89633972
2911.4 89633972 89363770 89026108 88694389 88335243 87880112 87421082 86994881 86528114 85989967 85562721
2921.1 85562721 85117065 84503540 83955925 83471771 82899109 82256691 81645012 80990211 80276695 79541565
2930.7 79541565 78785698 78002373 77170662 76322815 75531563 74873009 74175682 73389816 72695961 72308281
2940.4 72308281 72078117 71799500 71749229 71860085 72037766 72410957 72895462 73408112 73994286 74595993
2950 74595993 75133965 75776237 76306885 76661377 76933159 76996819 77007027 76837006 76455162 75869186
2959.7 75869186 75073387 74184380 73281395 72439507 71529625 70734505 70074730 69499748 69115623 68877556
2969.3 68877556 68719833 68646591 68795998 69022598 69336227 69685913 69987198 70469307 70983536 71520287
2979 71520287 72136681 72679413 73151375 73762344 74516060 75191666 75921402 76718040 77453201 78151993
2988.6 78151993 78960587 79818336 80652161 81540016 82333305 83211731 84120918 84996223 85910332 86691284
2998.2 86691284 87513458 88291573 88944916 89576141 90357430 91134308 91637680 92167503 92691490 93175522
3007.9 93175522 93577957 93941277 94334908 94663429 95039902 95283607 95412735 95586891 95865311 96033401
3017.5 96033401 96054451 96118324 96111717 96209305 96248032 96241913 96342834 96341675 96360809 96432472 96581848 96736992
3029.1 96736992 96728775 96603722 96672806 96844124 96827553 96852570 96828743 96722321 96651917 96628723 96682465
3039.7 96682465 96636597 96466064 96300865 96145920 95888748 95669731 95488274 95169876 94812965 94550858
3049.4 94550858 94284798 93847000 93389725 92926529 92467018 92018417 91495895 90982407 90496040 90056717
3059 90056717 89533081 88970436 88506340 88188530 87981499 87820503 87776405 87762543 87762848 87748184 87816467
3069.6 87816467 87915840 87964264 88049614 88091301 88154739 88077934 88062386 88137695 88026474 87932045 87752129
3080.2 87752129 87609261 87461411 87230934 86982658 86557762 86173035 85840187 85415794 84925049 84575684
3089.9 84575684 84383682 84271828 84216011 84135078 84201530 84369957 84624107 84865868 85151665 85531715
3099.5 85531715 85800949 86158150 86488281 86766434 87031319 87229187 87536232 87927933 88381119 88796791
3109.1 88796791 89155449 89505493 89873817 90225151 90591293 90963486 91267502 91681709 92053062 92437416
3118.8 92437416 92904419 93338760 93789711 94131432 94533966 94986748 95378258 95754799 96122086 96494408
3128.4 96494408 96832870 97152672 97360977 97557205 97813644 98061813 98230812 98343414 98471825 98473038
3138.1 98473038 98419579 98461807 98557907 98452820 98303726 98242851 98003471 97795097 97669868 97547722
3147.7 97547722 97330338 97074257 96910133 96709068 96535583 96361488 96274544 96245926 96212097 96197319
3157.4 96197319 96251190 96442245 96544693 96784180 97128456 97300919 97446739 97652924 97939293 98205170
3167 98205170 98444702 98597389 98624519 98640938 98811119 98995758 99066841 99252853 99385498 99412842 99371025
3177.6 99371025 99343567 99358879 99225105 99195854 99287376 99329399 99295006 99223175 99140839 99086510 99090576 99036652
3189.2 99036652 98922844 98723579 98647804 98634575 98547607 98521255 98495186 98493164 98347618 98175423 98096130
3199.8 98096130 98062782 98122787 98060928 97878403 97660843 97543869 97487396 97361412 97205940 97135933 97122398
3210.4 97122398 96989372 96927353 96855515 96791847 96798584 96733383 96717300 96714897 96756447 96689018 96452202 96300926
3222 96300926 96310776 96286339 96230316 96274849 96171417 96061005 95999733 95921600 95853134 95774521 95838142 95811966
3233.5 95811966 95730881 95701981 95668655 95571365 95382271 95265259 95095337 94919647 94851967 94827934 94660820
3244.2 94660820 94458176 94386604 94250084 94131149 93978714 93839645 93689682 93492752 93344772 93097145
3253.8 93097145 92876030 92755539 92720131 92551674 92170059 91865372 91768021 91716316 91509262 91426735
3263.4 91426735 91360107 91150642 90999931 90907234 90732620 90514435 90476410 90362877 90253555 90158432
3273.1 90158432 89906448 89732773 89608788 89542557 89324867 89119614 89040787 88866440 88728432 88593681
3282.7 88593681 88584892 88548775 88350510 88233925 88179474 88096710 87962967 87845947 87773254 87772575 87736427
3293.3 87736427 87575188 87391899 87316505 87279015 87209129 87144691 86968651 86835739 86720856 86574257
3303 86574257 86462242 86346336 86298790 86198219 86122421 86061211 86101646 86136070 85891037 85660614 85489822
3313.6 85489822 85410339 85256561 85054245 85009590 84949280 84825500 84572372 84480621 84487152 84302269 84038254
3324.2 84038254 83800735 83645515 83485733 83371742 83138016 82851418 82653633 82442703 82269478 81949951
3333.8 81949951 81615913 81396774 81189087 81011581 80806999 80498329 80083931 79773331 79492729 79078644
3343.5 79078644 78659019 78369270 78102715 77617645 77066383 76812271 76667564 76209099 75645317 75135986
3353.1 75135986 74626762 74216507 73758835 73276871 72916763 72536621 72059296 71594124 71115982 70561790
3362.8 70561790 70124672 69816170 69417130 69062325 68755043 68214195 67647957 67264244 66997421 66753685
3372.4 66753685 66474724 66188187 65817291 65443886 65192802 65062889 64917023 64656227 64507950 64485283
3382.1 64485283 64421730 64396233 64461761 64565956 64709373 64745064 64740051 64942123 65135483 65256920 65504181
3392.7 65504181 65789436 65981689 66192505 66592453 67064362 67473640 67917221 68386147 68811249 69208099
3402.3 69208099 69693893 70267487 70693504 71094437 71668945 72297775 72900902 73439156 74019264 74613091
3412 74613091 75163994 75780144 76364563 76847939 77275810 77806656 78398346 78943672 79618645 80276588
3421.6 80276588 80745186 81159401 81686424 82293510 82877090 83415672 83827515 84280556 84757706 85175522
3431.2 85175522 85631645 86053505 86543953 87074829 87613884 88049065 88385536 88893929 89252090 89430817
3440.9 89430817 89705551 90103546 90532761 90912910 91392159 91769012 91957298 92146149 92408173 92713196
3450.5 92713196 92981941 93284279 93536514 93898354 94216400 94233986 94272438 94401871 94562782 94716339
3460.2 94716339 94925453 95138260 95272690 95408470 95520340 95683113 95846329 95930473 96001808 96117989
3469.8 96117989 96193840 96278252 96388901 96422112 96539001 96698006 96787514 96736565 96737999 96805588 96767677
3480.4 96767677 96920464 97028343 97002831 97010941 97077675 97137558 97044601 97128281 97176224 97057343 96985413
3491 96985413 96918159 96866577 96864082 96953850 96955292 96906258 96794876 96730721 96906281 96976135 96773338 96557045
3502.6 96557045 96617668 96732506 96733856 96583298 96443123 96425011 96267410 96147560 96027412 95975883 95941948
3513.2 95941948 95809029 95866028 95821175 95713509 95715561 95708221 95589302 95368965 95230339 95055862 94979477
3523.8 94979477 94966469 94857101 94706047 94570511 94565361 94437073 94262909 94137207 94087082 94174385 94100700
3534.4 94100700 93877083 93732346 93749123 93777840 93671486 93484192 93298264 93200333 93063972 92934143
3544.1 92934143 93076141 93065414 92795097 92651855 92649864 92628326 92490135 92426552 92456573 92516830 92497902
3554.7 92497902 92286186 92257843 92226044 92049553 92072578 92240082 92246155 92109665 92147041 92117340 91930695
3565.3 91930695 91729393 91550331 91686882 91726524 91624672 91641228 91669907 91642097 91768814 91856087 91739311
3575.9 91739311 91713928 91619232 91536072 91551033 91603027 91610863 91471924 91424934 91277260 91165062 91236763
3586.5 91236763 91112991 91075760 91047203 91019608 91006447 90949783 90856186 90656677 90583092 90595085 90512505
3597.1 90512505 90536446 90518570 90396294 90480286 90525208 90487206 90478340 90425789 90209648 90000160 90142372
3607.7 90142372 90130707 90289543 90412247 90411247 90628731 90327950 90207489 90404762 90342392 90255356 90365448
3618.3 90365448 90608765 90719704 90797340 90873947 90998192 91140076 91216675 91111336 90931480 91031586
3628 91031586 91471703 91838249 91779739 91926086 92097717 92201645 92564232 92777992 92935501 93247894
3637.6 93247894 93485130 93548050 93584229 93805962 94204559 94447968 94540077 94594208 94584335 94897301 95416954
3648.2 95416954 95208321 94746078 95447021 96248405 96500626 96659096 96626999 96658348 97056030 97324081
3657.9 97324081 97580368 97837929 98147354 98345818 98522171 98715179 98888313 99195595 99333244 99480980
3667.5 99480980 99690811 99702896 99745941 100108200 100476372 100611191 100821472 101012688 101178200 101268547
3677.1 101268547 101212868 101394722 101565720 101899010 102305946 102376015 102267601 102344704 102632187 102723305
3686.8 102723305 102763893 103124626 103299759 103482330 103693520 103743950 103857834 104118721 104429901 104729721
3696.4 104729721 104831230 104840378 105019043 105184380 105335114 105549324 105650955 105820442 106038696 106233734
3706.1 106233734 106382286 106423744 106544586 106576157 106274010 106154800 106586014 106790817 106923920 107020851
3715.7 107020851 107155426 107214874 107096062 107216850 107316544 107224937 107265831 107281685 107155212 107062881 107355904
3726.3 107355904 107636032 107607368 107670242 107696289 107735619 107742508 107533005 107517502 107701752 107877617 107636696
3736.9 107636696 107547234 107691811 107858170 107905083 107801277 107663147 107330109 107071510 107626312 107738251
3746.6 107738251 107815735 107809059 107391251 106826920 107071968 107527878 107511185 107591507 107818275 108084747
3756.2 108084747 108076973 107949844 107834557 107726311 107834724 107939377 108045441 107986221 107858765 107978088
3765.9 107978088 108160751 108082481 108013138 108073669 107952713 107974594 108027260 108041985 108111908 108131180 108108559
3776.5 108108559 107992203 107818291 107590492 107716736 107975075 108058182 108049454 107874268 107953674 108164719
3786.1 108164719 108161476 108153786 108068726 108123062 108204094 108187965 108213211 108221954 108283112 108109566 107867821 108250336
3797.7 108250336 108331558 108066414 107780067 107464653 107613235 107887276 108067520 108137283 108056801 107802795
3807.3 107802795 107842300 107990562 108151443 108319679 108378654 108308945 108118446 107916206 108057098 108230026
3817 108230026 108224144 108253365 108110268 107753410 107495026 107817276 108049339 108057465 108029587 108096428 108096115 108079987
3828.6 108079987 108186386 108194839 108070572 108072182 108087456 107947426 107738747 107795273 107790329 107725258 107686996
3839.2 107686996 107694847 108075813 108200180 108055153 107951546 108098610 108134834 108147560 108426758 108558777
3848.8 108558777 108293938 108157974 108131203 107305267 106379433 107294281 107892509 107916359 108146133 108239136
3858.4 108239136 108063759 107956467 107818069 107598618 107490112 107550827 108068405 108109253 107905602 107756653
3868.1 107756653 107765770 108029724 108004097 107969193 107802612 107662010 107929222 108089958 108011665 107930580 107866905
3878.7 107866905 107579872 107650192 107967316 108031479 108055481 107856056 107670525 107622604 107942825 108240532
3888.3 108240532 108229675 107935249 107683296 107961845 108020485 108062836 108020996 107898720 107834877 107651993
3898 107651993 107671654 107847504 107856293 107616470 107325020 107431175 107509048 107887138 108227966 108089577 107985817
3908.6 107985817 108025085 108027176 108159470 108282112 108192932 108076080 107957596 107762718 107625275 107752136
3918.2 107752136 107870346 107969429 108043709 107982819 107843193 107669456 107733452 107757080 107730598 107899971 107939339
3928.8 107939339 107904724 107864113 107903702 108018616 107898727 107837059 107828384 107774315 107797455 107914940 107939400
3939.5 107939400 107939186 107985649 107920914 107798218 107760506 107839188 107933876 107977493 107920746 107775841 107682571
3950.1 107682571 107751884 107867889 107833443 107844444 107899567 107874451 107718658 107650902 107941101 107988426 107837105
3960.7 107837105 107797081 107763870 107794342 107776215 107814278 107942589 108009560 107950546 107935974 107885765 107775177
3971.3 107775177 107829170 107874474 107859055 107798080 107872795 107812439 107602257 107618202 107568924 107669792 107822823
3981.9 107822823 107857727 107864868 107835136 107904297 107795265 107712532 107697456 107707130 107701302 107653633 107849152 107800446
3993.5 107800446 107606773 107578751 107563347 107530319 107497566 107561264 107576172
4000.2 107576172
##END=$$ End of the data block
