##TITLE=$$ Begin of the data block
##JCAMP-DX=5.00 $$ ACD/SpecManager v 10.08
##SPECTROMETER/DATA SYSTEM=Varian
##DATE=13 Nov 2012 08:48:44
##DATA TYPE=INFRARED SPECTRUM
##DATA CLASS=XYDATA
##ORIGIN=
##OWNER=
##NPOINTS=3735
##FIRSTX=399.26403809
##LASTX=4000.35498047
##MAXX=4000.35498047
##MINX=399.26403809
##MAXY=65.14395905
##MINY=33.56896591
##XFACTOR=1.0000000000
##YFACTOR=0.000000100000000
##FIRSTY=55.04244614
##DELTAX=0.96440572
##XUNITS=1/CM
##YUNITS=TRANSMITTANCE
##XYDATA=(X++(Y..Y))
399.3E50424461l768921j4390525Q294334J3205566k66838m026641n422097p537460
407E36511879L197212N446625r58633k823296N2566L091698L719597L285561j966515
415.7E49556694r501228j0026665M830017O631279N979271J0318718J584740l445855
423.4E55926971p61299l416176J619454N995750K15340L960686N965080j630859Q75587
432.1E68750534j999359m401589O64216J205940j431427k076149M049187K7618k598190
440.7E62190781L824424J598740L420677J467171j412506n06020l053779M4441N69267
449.4E68143196J524620M233551k877998n362702P252274O072159k10724k945519j1776504
458.1E64052353L161201Q408699L889046j99356J498222K576981k070274k447319k855530
$$ plain form
399.3 550424461 546655540 532265015 540559349 553764915 553498077 549471436 544049339 536511879
407 536511879 539709091 545155716 544197083 541373787 541426353 544518051 548237648 551523209 549556694
415.7 549556694 540055466 530028801 534858818 541490097 547469368 557788086 559372826 555926971
423.4 555926971 555165672 551749496 553368950 559364700 559580040 563540726 569505806 567874947 568750534
432.1 568750534 566751175 562349586 563013802 564219742 562788315 560712166 564761353 564788971 562190781
440.7 562190781 566015205 567613945 571034622 572501793 571089287 570583267 567529488 567573929 568143196
449.4 568143196 569667816 573901367 571023369 565660667 572912941 578985100 578774376 575828857 564052353
458.1 564052353 567213554 575622253 579511299 579311943 580810165 583387146 581316872 578869553 576014023
466.8E76014023L082542L816071j773606J753922q012238p031631J2597923P375756
474.5E87822762P49282k072181L517913N009804K233124k800827m165268Q48541J021958
483.2E92165108L406868L852462J704216j445198j020965N21889J23100L443031j329880
491.8F01420631j855278J567536L92380O48422j154595Q0109J483459M008828J569099
500.5F08160591n640793j876449L254738M75654P03736J028442j194992N11207j525383
509.2F03896751m044876j886940J87340J385651m88396L356361K336312n646630k511444
517.9E96584129L43361k279930j733742P17011o80771j062317n35812j060715j478996
526.6E88812218m445153l007659m96254o50559j936874k925759k665252j907959l45612
$$ plain form
466.8 576014023 579096565 582912636 581139030 582892952 574880714 567849083 580447006 587822762
474.5 587822762 588572044 586499863 590017776 595027580 597260704 594459877 590294609 591143150 592165108
483.2 592165108 595571976 599424438 601128654 599683456 598662491 599184380 599307480 602750511 601420631
491.8 601420631 599565353 601132889 601525269 602173691 601019096 601099205 602582664 606591492 608160591
500.5 608160591 602519798 600643349 603898087 604373741 605077477 606105919 604910927 605422134 603896751
509.2 603896751 599851875 597964935 598152275 599537926 599049530 602405891 604742203 599095573 596584129
517.9 596584129 596927490 594647560 592913818 593630829 592950058 591887741 591351929 590291214 588812218
526.6 588812218 584367065 581359406 580863152 580212593 578275719 575349960 572684708 570776749 570431137
535.2E70431137j946297k870216P7095n50079l093682j893921j361198j818809j185799
543.9E55788231n77011j86577k952614l974190j862564j66321L1586j757393k713165
552.6E41629982j215744Q05702j351929j703796j459618k993125n44663Q82835M64287
561.3E34513931n60379j082229j638070j490592K11257p56378j229782J96533J202050
570E29366341K24151P21131R27238p27920n09491j912690j456527R33342N33867q21419
579.6E27278023j494980m46777J57585K92625n6648N68008M35715P16324J415062m06685
589.3E28458252j410637k574081p84493J740341J89209q8005J116753J686554J508941
597.9E29842834J216431j224136p60575J925011P80068m45366o82564M90341J456451
$$ plain form
535.2 570431137 568484840 565614624 565691719 565141640 562047958 560154037 558792839 556974030 555788231
543.9 555788231 555211220 555024643 552072029 548097839 546235275 546068954 546100540 544343147 541629982
552.6 541629982 540414238 541219940 539868011 538164215 536704597 533711472 533166809 534049644 534513931
561.3 534513931 533953552 532871323 531233253 529742661 529953918 529197540 527967758 528164291 529366341
570 529366341 529590492 530311623 531238861 530510941 530001450 528088760 526632233 527565575 528099442 527278023
579.6 527278023 525783043 525336266 525493851 525786476 525729828 526297836 526733551 527449875 528864937 528458252
589.3 528458252 527047615 524473534 523689041 525429382 525618591 525530586 526647339 528333893 529842834
597.9 529842834 531059265 529835129 529074554 530999565 531779633 531334267 530651703 531142044 532598495
606.6E32598495Q93822j084785r83658Q28628J09482n47981j995468k31133J137505
615.3E30724907k89688J229248K61497j1711j93825j725921j065712p93076l12233
624E27823486j28975K38877J12686l4676o17942j680527k91596P76215M4975k94571
633.6E25947952R73168J652755J677933Q08258L17116K051125J613998N77087J322098
642.3E36941490K449799K359695P35436R05876K149963K349167P84836l09486J752319
651E50119095L276749K890167K135582R37957O54946J170997J759301J530113P98874
659.7E65273781J219177R77974P38068J291351O00128J289559K424812m03595n625382
668.3E67785873L427773L351097L695602J607323k14271N68008Q18596N15785j70097
$$ plain form
606.6 532598495 533492317 532407532 531423874 532252502 532361984 531814003 529818535 529587402 530724907
615.3 530724907 530435219 531664467 531925964 531914253 531720428 529994507 528928795 528135719 527823486
624 527823486 527694511 527933388 528046074 528011398 527393456 525712929 525421333 526197548 526242523 525947952
633.6 525947952 526921120 528573875 530251808 531060066 531377182 533428307 535042305 535619392 536941490
642.3 536941490 539391289 541750984 542486420 543392296 545542259 547891426 548676262 548366776 550119095
651 550119095 553395844 556286011 558421593 559359550 560014496 561185493 562944794 564474907 565273781
659.7 565273781 566492958 567470932 568209000 569500351 570100479 571390038 573814850 573411255 567785873
668.3 567785873 571213646 574564743 578260345 579867668 579653397 580221405 581040001 581555786 581385689
677E81385689J631355K272911M09203J006736N83497k6589P19681J237526K310181
685.7E91530190J443557k63252l02124R47304J708755M07486K25868O40107J35307
694.4E96473198M64172P91779J021080J017609J904106K025299Q18672M59099j110344
703.1F03864670J68381J395607k41700J736183K375718J420555J270942K31286K48069
711.7F12469711j5526o0462O17103Q80699R64012R24378O54335M69208Q68225M79164
721.4F18250847K20947K82402m42695M76150J378594N61332J728249J619224p2784
730.1F24002266P53250Q94127K52800j65367J417198K895279J331901J618462J572151
738.7F34572067O60515P65419J71623j71432K37961J112709J722870K137146O91986
$$ plain form
677 581385689 583017044 585289955 585699158 586705894 587289391 587262802 587982483 589220009 591530190
685.7 591530190 592973747 592710495 592408371 593355675 595064430 595471916 595697784 596337891 596473198
694.4 596473198 596937370 597729149 598750229 599767838 601671944 603697243 604515915 604975014 603864670
703.1 603864670 604033051 605428658 605186958 606923141 609298859 610719414 611990356 612221642 612469711
711.7 612469711 612454185 612393723 613010826 613891525 614855537 615779915 616434250 616903458 617771683 618250847
721.4 618250847 618471794 618754196 618311501 618787651 620166245 620727577 622455826 624075050 624002266
730.1 624002266 624755516 625649643 625902443 625737076 627154274 630049553 631381454 632999916 634572067
738.7 634572067 635232582 635998001 636169624 635998192 636236153 637348862 639071732 641208878 641900864
747.4F41900864K12097R52530N42907K67868q45794J454315K662964K50778O867K61917
757.1F47667313J060257O40716m41894j055298q00629N73044N24673L66059l95050
765.7F48139191p84836J84631P9270p48139j343307j646576O0959J021270q36563j05209
775.4F44020691Q34961o01196q71735k54364j223755j707382P27997J067733l09372
784.1F41683578j110763j485367j489715q73528J027679j26075j982498j511498K77100
792.7F34408913J460189K06948n45693n86776l0899M05540N72014N07736N73616N97534
802.4F37569122N493J325379N82886m87900M69246O54869R09271Q34198J642532Q66547
812F44371643O16226P28379j206055M7302J515198P03659m18015N0202R80835R69848
$$ plain form
747.4 641900864 642112961 643065491 643608398 643876266 643030472 644484787 647147751 647398529 647405396 647667313
757.1 647667313 648727570 649368286 648926392 647871094 647070465 647643509 648168182 648534241 648139191
765.7 648139191 647354355 647538986 647618256 646870117 645526810 643880234 643941193 644962463 644125900 644020691
775.4 644020691 644855652 644254456 643382721 643128357 641904602 640197220 640925217 641992950 641683578
784.1 641683578 640572815 639087448 637597733 636724205 637751884 637625809 635643311 634131813 634408913
792.7 634408913 635869102 636076050 635530357 634943581 634912682 635318222 635890236 636397972 636971588 637569122
802.4 637569122 637574615 638899994 639482880 638994980 639464226 640119095 641028366 641862564 643505096 644371643
812 644371643 644987869 645716248 644510193 644557495 646072693 646776352 646358337 646408539 647389374 648359222
821.7F48359222K17057q90656K65198P64084K25906k90909m71801Q68988J512222N35507
831.3F51094818m66080q0871j06354J52130N3559P4691P17697n5465n112m72565m6997
841.9F50859451L99552p01371p74841p94296J39541Q10853Q56018M10843n02015o39419
851.6F50064316M26330P14646r47113m05121l52249j266403k19880O36979L4332l92304
861.2F48293533n95398j925583j014328o02264n62210L34015j99967K31095j85776
869.9F43773117n18722q05970j167221j458435j694031l17192o20994o33049k95258
878.6F36262245p60116q81310q62656j231575j680831p84379o02340j3275m12636q19855
888.2F28213272L27950K96058M81568p5074l37638n37491k45133P54662J106644J717872
$$ plain form
821.7 648359222 648576279 647685623 647950821 648714905 648940811 648649902 648178101 649047089 650559311 651094818
831.3 651094818 650628738 650547867 650441513 650593643 650647202 650721893 651439590 651384125 651379013 650906448 650859451
841.9 650859451 651259003 650557632 649782791 648988495 649128036 649938889 650794907 651205750 650703735 650064316
851.6 650064316 650490646 651205292 650258179 649853058 649500809 648234406 648014526 648651505 648685837 648293533
861.2 648293533 647698135 645772552 644758224 644155960 643593750 643927765 643727798 643958893 643773117
869.9 643773117 643254395 642448425 641281204 639822769 638128738 637811546 637190552 636557503 636262245
878.6 636262245 635502129 634620819 633758163 632526588 630845757 630061378 629459038 629445763 629033127 628213272
888.2 628213272 628541222 628837280 629318848 629243774 628906136 628368645 628123512 628878174 629984818 631702690
897.9F31702690R34143R17626Q66432R70878J222496K41127L84980N77469J478576
906.5F39296417P73163K98233J229477Q50830N70297O08750J362076j86234l07236
915.2F44495773O19126k46506M95987L80936L85818O00205J175689Q07038j12000K51541
924.9F48853607j18027N14908K58713O04935J14975j164551L94745N74264M06342K01492
934.5F50641403l25393r50089n74646Q18558J68228j59683l48816k32849N35659J6785
944.2F49589157m03595r4986l34091k05765j1520j30692N94940k71911l16162q6060
953.8F48329315p66449l06701r10035q8958M76913R9259n21546o33697P94830q07724
963.4F45665207j088867L76053K98538M196k11563j49841l45154J14822o63147p58972
$$ plain form
897.9 631702690 632636833 633554459 634420891 635391769 636614265 636855392 637240372 637817841 639296417
906.5 639296417 640069580 640367813 641597290 642448120 643018417 643627167 644989243 644803009 644495773
915.2 644495773 645114899 644868393 645364380 645745316 646131134 646731339 647907028 648714066 648602066 648853607
924.9 648853607 648735580 649250488 649509201 650114136 650229111 649064560 649459305 650033569 650439911 650641403
934.5 650641403 650316010 649365921 648791275 649609833 649778061 649618378 649269562 649036713 649572372 649589157
944.2 649589157 649185562 649090576 648756485 648550720 648539200 648408508 649003448 648731537 648415375 648329315
953.8 648329315 647562866 647256165 646346130 646257172 646734085 646833344 646311798 645678101 646472931 645665207
963.4 645665207 644576340 644952393 645250931 645255127 645043564 644893723 644548569 644663391 644000244 643241272
973.1F43241272j72653n05753L28140L30506k55356j79825O95801J84021q20389q51288
982.7F41994476j095962j16196Q4381k92282l88718m15687k33154q4458J73683k47230
992.4F39378853n37110p05070P8926M15077N30472R49478o8435p98340j227799p28569
1002F37287483j100006p42760Q03261J01395l06244k46124K84958l20092m88128K92282
1011.7F35566025o22292n24254n24978j64871j01662o87409k22206J80092j47667j074753
1021.3F31676025k89116K46811J55182J73645k99263j38702k09580p08084j059646
1030F29547272K48794M73099j24435L82385j87569n66673m62380J76125j74599p64999
1039.6F28547020l94402j18904L27874k14882j49918m7111p00036r49935n06287N67207
$$ plain form
973.1 643241272 643068619 642562866 642891006 643221512 642966156 642786331 643482132 643666153 642845764 641994476
982.7 641994476 640898514 640782318 640866699 640574417 640185699 639770012 639536858 639452400 639626083 639378853
992.4 639378853 638841743 638136673 638215599 638630676 639161148 640110626 640042191 639243851 638016052 637287483
1002 637287483 636187477 635444717 636247978 636349373 636043129 635797005 636081963 635761871 635273743 635566025
1011.7 635566025 634943733 634419479 633894501 633729630 633627968 632940559 632718353 632898445 632750778 631676025
1021.3 631676025 631386909 631633720 631788902 631962547 631663284 631524582 631315002 630606918 629547272
1030 629547272 629796066 630269165 630144730 630527115 630339546 629772873 629310493 629486618 629312019 628547020
1039.6 628547020 628152618 628033714 628361588 628146706 627996788 627949677 627249641 626299706 625793419 626360626
1049.3F26360626N81856p69005p83348Q63342j85051r01985K34986M52957j34545p51342
1058.9F24968491M19006K60925M34838R4528j135369K59247m78897r86404q393m86450
1068.6F23341522j148300J33858O00624m99573Q49419Q09326r5673j042862j384201
1077.2F21564140J9493k41813k39678K73552R74274K98767o87218o19964j183663n05562
1086.9F19652328J41945l7727l99094N70183J320915O76003m20189j881065j248551
1095.6F18374748k71835N67665o3667j007538o0120P27692R50012l24325k32163l91312
1105.2F18269157j567192r42802N47371J051712k66342K28538J33248m86222P7820
1113.9F17045288m69513j330490j618919M23927J406860R63402K83241m18129k9335
$$ plain form
1049.3 626360626 626942482 626173477 625390129 626253471 626068420 625166435 625401421 625854378 625719833 624968491
1058.9 624968491 625387497 625648422 626083260 626177788 625042419 625301666 624822769 623836365 623827972 623341522
1068.6 623341522 622193222 622327080 622927704 622428131 623277550 624086876 623991203 622948341 621564140
1077.2 621564140 621583633 621341820 621102142 621375694 622349968 622648735 621961517 621341553 620157890 619652328
1086.9 619652328 619794273 619756546 619357452 619927635 621248550 621924553 621504364 619623299 618374748
1095.6 618374748 618102913 618670578 618606911 617599373 617539253 618266945 619216957 618892632 618660469 618269157
1105.2 618269157 616701965 615759163 616306534 617358246 617091904 617320442 617453690 616967468 617045288
1113.9 617045288 616575775 615245285 613626366 614050293 615457153 616420555 616703796 616285667 616256332
1122.6F16256332k30980p1640q34121l54805J67007l88145O88514O96984R23652l9482
1132.2F16813316j311493q09173p31392p6599R52110J177368R1667l50647l61022n36461
1141.9F14857674l68653m10766k05880m38346j81313N66979R82093N39093J52970q6785
1151.5F15407066j061439n91622n62782q85506j75895N6228J47667O65093M44031q08869
1161.1F12633972n91698m69589o76689K38304K09542l79105J00174J079941O91986
1169.8F12836838m47083r15565k02675m2153r66835m93316M21142P58858O85158P50961
1179.5F12385330j98707r17778o3477l11356j80358J45874K41546q6555k46582J99203
1189.1F10967140q46100n59044K24038J87683k24266o08330K32963K69509P6675j95617
$$ plain form
1122.6 616256332 616025352 615953712 615119591 614764786 614931793 614543648 615232162 615929146 616852798 616813316
1132.2 616813316 615501823 614692650 613961258 613884659 614836769 616014137 616105804 615755157 615394135 614857674
1141.9 614857674 614489021 614078255 613872375 613434029 613252716 613819695 614801788 615340881 615493851 615407066
1151.5 615407066 614345627 613754005 613191223 612305717 612129822 612186050 612333717 612998810 613442841 612633972
1161.1 612633972 612042274 611572685 610895996 611134300 611343842 610964737 611064911 612144852 612836838
1169.8 612836838 612389755 611474190 611271515 611229362 610262527 609769211 610190353 610949211 611634369 612385330
1179.5 612385330 612186623 611268845 611205368 610894012 610713654 610859528 611101074 611014519 610767937 610967140
1189.1 610967140 610121040 609561996 609786034 609973717 609749451 609141121 609374084 609643593 609720268 609524651
1198.8F09524651j14289L98255j4878o31790p38869m9324L79334M10080P1411O3019
1208.4F09297600j16463o52046n20058k94571K27776n0240J63384K50740n48706m97627
1218F07259789j51253N13878k26326p70073k21787K25487K94762l91159q2703l44315
1227.7F06106300l04260K67334k10380l75329j74140J6098j80283K55966J87760k17553
1237.3F05371513j01699n15099n16052m17519J6289J90544J49155J08375l26309k07329
1247F03751869j60827j10817n8098j14784l17498m7302J03226k59896R3880j15890
1256.6F02763863m80004m89998k51617k10495m6349L06626k213L38478m62722q58536
1266.3F00607033J12991n417N2376j35879n30167n27649L55835N15251n6915J97639
$$ plain form
1198.8 609524651 609410362 609808617 609793739 609161949 608423080 608373756 608753090 609163170 609234581 609297600
1208.4 609297600 609181137 608529091 608009033 607714462 607942238 607891998 608055382 608306122 607757416 607259789
1218 607259789 607108536 607622414 607396088 606626015 606404228 606629715 606924477 606533318 606450615 606106300
1227.7 606106300 605802040 606069374 605858994 605483665 605309525 605325623 605145340 605401306 605589066 605371513
1237.3 605371513 605269814 604754715 604238663 603821144 603837433 604027977 604177132 604285507 603959198 603751869
1247 603751869 603591042 603480225 603422127 603307343 602989845 602942543 603045769 602785873 602879753 602763863
1256.6 602763863 602283859 601793861 601542244 601331749 601285400 601592026 601589813 601928291 601465569 600607033
1266.3 600607033 600720024 600714607 600766983 600631104 600100937 599573288 599929123 600444374 600387459 600585098
1275.9F00585098r5863p4692k98691n96275j03645R9716j34812k81982N0278k7161
1285.5E99121971R232l19825k00347J81922l41224N6801j53618l97225o7787k93655
1295.2E97596245l69911l82119J65444O21719m4403q18291m45785l0174J31149J03378
1304.8E96527252m39682n53131o09054j59646K33117n0698n63850p44400J0490J48087
1314.5E93798485k78588n27267l80173n21774n57899K76184N78575M96025R6474q393
1324.1E92971649J38779j71013o46858m05731N8975m38309j13983L93486J40228J31302
1333.8E92058525P8201n66406j049728p59583j740684j793824O35376K117234J390800
1342.4E90369911J30501k4643j41792l72086j96609J42250k31972m57306K88391N8098
$$ plain form
1275.9 600585098 600489235 600414543 600115852 599519577 599415932 599515648 599380836 599098854 599149132 599121971
1285.5 599121971 599131203 598811378 598611031 598792953 598451729 598508530 598354912 597957687 597889900 597596245
1295.2 597596245 597226334 596844215 597009659 597631378 597586975 596768684 596322899 596292725 596423874 596527252
1304.8 596527252 596087570 595534439 594925385 594765739 594998856 594948158 594384308 593639908 593650398 593798485
1314.5 593798485 593519897 592992630 592612457 592090683 591532784 591808968 592387543 592883568 592980042 592971649
1324.1 592971649 593110428 592939415 592292557 591886826 591945801 591507492 591393509 591786995 591927223 592058525
1333.8 592058525 592136726 591570320 590520592 589761009 588020325 586226501 586861877 588979111 590369911
1342.4 590369911 590500412 590475769 590333977 589961891 589765282 589907532 589675560 589218254 589506645 589564743
1352.1E89564743j0757m92134n32952L43628J8959m04396l76854j96686j290626j105805
1361.7E85517120o30378K94265K203217O39915l74870p43294j210975j83525N28373
1370.4E86039848N94292j54839j386375k376404J10207J653633P03735k75802m55818
1379.1E84452477L00216J57700j40267q85429m64859j4916j090087j154328l37066
1387.8E80823441J943321J353569K37083J96724n40886r79461k825585j205597J797409
1396.4E80800018R30901l21770p40051J023445P14188n7030l61137j094933j367073
1405.1E79526558R48181J197662K49329M7569o02646k13966o905k288K54173l49541
1414.8E81048126k29110j672059j684684j101914k353058K847863K150001M8447k099381
$$ plain form
1352.1 589564743 589553986 589061852 588528900 588872528 588891487 588487091 588110237 587913551 586622925 585517120
1361.7 585517120 584886742 585181007 587384224 588024139 587649269 586905975 585695000 585511475 586039848
1370.4 586039848 586634140 586479301 585092926 582716522 582826729 584480362 585184097 584908295 584452477
1379.1 584452477 584752693 584910393 584770126 583884697 583419838 583404922 582314835 581160507 580823441
1387.8 580823441 582766762 584120331 584357414 584554138 584013252 583033791 580208206 579002609 580800018
1396.4 580800018 581730919 581409149 580669098 581692543 582406731 582349701 581988564 580893631 579526558
1405.1 579526558 580474739 581672401 581921730 581969299 581366653 581152687 581145782 581143494 581397667 581048126
1414.8 581048126 580819016 579146957 577462273 576360359 574007301 576855164 579005165 579053612 576954231
1423.4E76954231r66530J835099J037712K88543l0555j320915j948166J093254P41119
1432.1E77683792p72896j26838k7199j339150k766113K238808K191162M81148k39602
1440.8E77323112r6168l77159l26843k77405j08032j3352j729889j033401J285248
1449.5E74646111J42974j074981o93741O71501o05125k392312k072219l981629n66787
1458.2E64073792L760566L582459J801986p2670o63490j332741l401565K001648K760429
1466.8E72510414P67365r5559p02171j029091l595161m706078J899758L931312J675186
1475.5E70655975j045799J431007J377717l40157r79729j270256N46303R01566K80380
1484.2E71557007k28882r06868k333412j301232l9978l675537N88570L655624J904145
$$ plain form
1423.4 576954231 575987701 577822800 578860512 579149055 579118500 577797585 575849419 576942673 577683792
1432.1 577683792 576910896 576784058 576756859 575417709 572651596 574890404 577081566 577562714 577323112
1440.8 577323112 577226944 576849785 576522942 576245537 576137505 576124153 574394264 573360863 574646111
1449.5 574646111 574789085 573714104 573020363 573691864 573086739 570694427 568622208 564640579 564073792
1458.2 564073792 567834358 571416817 573218803 573146133 572482643 571149902 567748337 569749985 572510414
1466.8 572510414 573277779 573182220 572480049 571450958 567855797 563149719 565049477 568980789 570655975
1475.5 570655975 569610176 571041183 572418900 572078743 571099014 569828758 570375061 571276627 571557007
1484.2 571557007 571328125 570421257 568087845 566786613 566746635 563071098 563659668 567315292 569219437
1492.9E69219437N11894m64974k021408l092575J908798q09860j01814J995773k89612
1501.6E66855659q4457M08745j89514k920265j2761345l925133P569504M820747K355537
1510.2E62129478K222672m5433j5488Q49648j528969j962090l414344J378440L151932
1518.9E62765846o65779o242370l691521L909149L583679Q87604j488991J338120R71145
1527.6E61366882o02379J271515Q32024r59167j664887k962036j57776L001137J567993
1536.3E61693306k2774k384147r672699l928147M284401J881104P30743J828232m45709
1545E53964310J873474L494224O82335n13267k461205j34620K608604L67622j675834
1553.6E58205643m691048J090927K023811k087593j5520019j1182137J6753197Q239784
$$ plain form
1492.9 569219437 569731331 569266357 567244949 564152374 566061172 565251312 565149498 567145271 566855659
1501.6 566855659 566771202 567179947 566990433 564070168 551308823 547383690 554953194 559773941 562129478
1510.2 562129478 564352150 564306717 564291229 565140877 563611908 561649818 558235474 559613914 562765846
1518.9 562765846 562100067 555857697 552166176 556075325 559659004 560546608 559057617 560395737 561366882
1527.6 561366882 560764503 562036018 562868042 561908875 560243988 557281952 557124176 560125313 561693306
1536.3 561693306 561670532 559286385 549613686 545685539 549969940 551851044 552581787 554410019 553964310
1545 553964310 555837784 559332008 560014343 559501076 557039871 556905251 559513855 559881477 558205643
1553.6 558205643 553514595 554605522 556629333 554541740 539021721 527839584 544592781 552832565
1561.4E52832565L843003Q10890j035004j373863O87714J055755p05070k828446l605232
1570E49682312L824272K122917Q6441n40084j785164l553963l583298M519501K508202
1578.7E53281136N82504K19383n51872L5934m08020m87442k69432j44424J13411o89926
1588.4E51681252o60058p83004k50511l96691q04596r32770o36329p4845m52270K02446
1598E46892624P5188j04294q77991j425209j504021r48753P68661j006202j596947
1606.7E40273056p15713j57891m75807n68314J2322j547432p01218q55293j296844
1615.4E33966866l467713m410934M249534J652565J25504j263352j739082k959404
1623.1E26153984j362457K674713P37495q9759j838074K21100J266594q0224j36032
$$ plain form
1561.4 552832565 556675568 557486458 556451454 555077591 555765305 556821060 556115990 553287544 549682312
1570 549682312 553506584 555629501 555715942 555175858 553390694 549836731 546253433 550772934 553281136
1578.7 553281136 553863640 554083023 553531151 553567085 553159065 552671623 552402191 552257767 552371178 551681252
1588.4 551681252 551021194 550238190 549987679 549590988 548786392 547853622 547217293 547142448 546690178 546892624
1598 546892624 546967812 546863518 545985527 544560318 543056297 542107544 542876205 541870003 540273056
1606.7 540273056 539557343 539399452 538923645 538355331 538367653 536820221 536119003 535263710 533966866
1615.4 533966866 530499153 526088219 530337753 531990318 532115822 530852470 529113388 526153984
1623.1 526153984 524791527 527466240 528203735 528113976 526275902 526497002 527763596 527683372 527547340
1631.7E27547340o71234k66494j292840o468620Q05855L282242L217621J804466N43136
1640.4E28501472l28865P28112N30929K51656j327896m089470k11373J390839M008293
1649.1E29453697K181816N10216o11954j1752586j558266J1078339N638924K251777
1656.8E37191963J288758O92443L60184q8196k34565j029816L62358K903480J644440
1665.5E43091049M40102j50833k017212l474236J590271J857567J383438K083054J026420
1674.2E45829620j905975k93274K824898J536255o14014j598053j87683J507606j17836
1682.9E46981544m817504m545594N769806M092980P43293n96275N63851M63562J084861
1691.5E49740524Q15316Q0184J89095j775055o602898K169533K581825Q12531m161911
$$ plain form
1631.7 527547340 526876106 526609612 525316772 518848152 519654007 522936249 526153870 527958336 528501472
1640.4 528501472 528172607 528900719 529431648 529683304 528355408 524265938 524054565 525445404 529453697
1649.1 529453697 531635513 532145729 531533775 519781189 518222923 529301262 534940186 537191963
1656.8 537191963 538480721 539173164 539533348 539445152 539210587 538180771 538543129 541446609 543091049
1665.5 543091049 543531151 543380318 541363106 537888870 539479141 541336708 542720146 544803200 545829620
1674.2 545829620 543923645 543630371 546455269 547991524 547377510 545779457 545591774 547099380 546981544
1682.9 546981544 542164040 537618446 543388252 547481232 548224525 547628250 548192101 548655663 549740524
1691.5 549740524 550555840 550636024 550825119 549050064 542447166 544616699 547198524 548011055 543849144
1700.2E43849144j071167N024986K187577n31579p52906p03850l42903K146492J728592
1708.9E51534386k34490k29683P70951l98026j639175k907524p61605J137772k189789
1717.6E45082817j653709M704284K468911J115684L71361r19953j79939R79538L17269
1726.3E52286263m18244n07431p21931j940346K29301Q77838j873321o206093o7596
1734.9E41658440N386848K380447Q1406m01573k100945M31214K309646n44395k255936
1743.6E46945152Q14476P64427p73468q62350j389046j10130J446876o57958R49974
1752.3E47127953K284469K26021k89345q47015k337456J188850J636467L35579n65872
1761E48759651k247047M36516J536941M33159k61307l9558r24645j563873J059036
$$ plain form
1700.2 543849144 542777977 547802963 549990540 549458961 548706055 548002205 547659302 549805794 551534386
1708.9 551534386 551299896 551070213 551841164 551443138 549803963 546896439 546134834 547272606 545082817
1717.6 545082817 543429108 548133392 550602303 551717987 552089348 551169395 550989456 551968994 552286263
1726.3 552286263 551868019 551360588 550638657 548698311 548927612 549805450 547932129 541726036 541658440
1734.9 541658440 547045288 549425735 549507141 549105568 547004623 547435837 549745483 549201088 546945152
1743.6 546945152 547759628 548524055 547750587 546888237 545499191 545389061 546835937 546177979 547127953
1752.3 547127953 549412422 549638443 549349098 548502083 546164627 547353477 548989944 549325523 548759651
1761 548759651 546512604 546949120 548486061 548919220 548657913 548618355 547693710 546129837 547188873
1769.7E47188873k22892l979760l368530L154411L039513M99992J99890J005440L0442
1778.3E47547379o08139j185265P63J463737L45002p44133j260491K44293J163483
1787E46966629K37007k47612n50003j540985j762238j795501J400528J947822j40876
1795.7E44514771k1096J172943j84326j467705m44107Q64678J15127J54419O12793
1804.4E45317497q1062K136l13454m14924J29890n39436p59735J35612M47617L24898
1814E44249039K52304M9095k77443l24440J61324L31878j95122l58161p04804l24440
1823.7E42859230m86793j463662J172448J169891r98955k661285o77338K427750J367988
1832.3E42709274k45704n88265J14174J33019k78016K00425M52690k07901m73938o18057
$$ plain form
1769.7 547188873 546965981 542986221 539617691 542772102 545811615 546311607 546511497 547516937 547547379
1778.3 547547379 546939240 545753975 545754738 547218475 547563477 546819344 545558853 545803146 546966629
1787 546966629 547203636 546956024 546406021 544865036 543102798 541307297 542707825 544655647 544514771
1795.7 544514771 544493675 545666618 545482292 544014587 543570480 544435158 544550285 544704704 545317497
1804.4 545317497 545236435 545238571 544925117 544510193 544640083 544100647 543340912 543476524 543924141 544249039
1814 544249039 544501343 544550438 544272995 543948555 544109879 544441757 544246635 543888474 543183670 542859230
1823.7 542859230 542372437 540908775 542081223 543251114 542252159 539590874 538913536 541341286 542709274
1832.3 542709274 542463570 541875305 541989479 542122498 541844482 542044907 542497597 542289696 541815758 541197701
1842E41197701o12450j436768j558113K305412J345826r13697j06582L97300J36033
1850.7E40754662Q201j54152J67771J54152L5209k04124k95830l63007l94210l77312
1860.3E39331360j22872L27950K34299l2883o38046p91092o09513p75718r26705P3586
1869.9E36070366J322784R74846K82173O6796M4021l0021j23597j52664o10542l04794
1879.6E37539368L23295J14556k19880k75535k17629p8773n2986m33426k12937r65499
1889.2E35520554r92127J214333Q12988K06909k02789r62258j55487M32053p7476l60489
1898.9E35436211k4071O0272q049K13890Q9569l93600l56903m08135q15277j85356
1908.5E33608551n226j88980N57403O72188j5030j79100M425o14280r31855j124725
$$ plain form
1842 541197701 540585251 539148483 537590370 539895782 541241608 540327911 540221329 540618629 540754662
1850.7 540754662 540762863 540608711 540776482 540930634 540965843 540761719 540465889 540102882 539708672 539331360
1860.3 539331360 539208488 539536438 539770737 539737854 539099808 538308716 537699203 536923485 535996780 536070366
1869.9 536070366 537393150 538367996 538650169 538716965 538760986 538730965 538607368 538454704 537844162 537539368
1879.6 537539368 537862663 537977219 537757339 537481804 537264175 537185402 537132416 536698990 536486053 535520554
1889.2 535520554 534528427 535742760 536555748 536762657 536559868 535597610 535442123 535874176 535796700 535436211
1898.9 535436211 535412140 535472412 535464363 535678253 535767822 535374222 535017319 534609184 533793907 533608551
1908.5 533608551 533603325 533414345 533971748 534643936 534628906 534449806 534454231 533839951 532908096 531783371
1918.2E31783371K94800R20524j04141n86624q39653O17065J018982k65693k96059
1926.8E32542572k10876j29738r5520j9799K88773N1689j28288l01399m84085m46206
1936.5E31067123k43797k14538R9639L97644r7312j313897q59336J055412J66931m20418
1946.1E29637451n2337k17667M75960N72242J31951l83225m93126k1934j41411n45921
1955.8E28961983n46646j6709O5270J60637J95770J11771P0686k23503k77519o17676
1965.4E27884064n49393l55797K86713Q43353J73187l3874l0632l59154m57992k53373
1975.1E27147102l72352k49291J01319j52054O5231P6370Q2512l36685n42641J36261
1984.7E25955772r5749j07803l67927m52691N5161Q7624k94304n57404O65169M69131
$$ plain form
1918.2 531783371 532078171 532998695 532894554 532307930 531468277 532085342 533104324 532838631 532542572
1926.8 532542572 532331696 532201958 532106438 532086639 532375412 532427101 532298813 531997414 531513329 531067123
1936.5 531067123 530823326 530608788 530708427 531106071 531008759 529694862 528835526 529890938 530057869 529637451
1946.1 529637451 529585114 529367447 529843407 530415649 530547600 530164375 529671249 529649315 529507904 528961983
1955.8 528961983 528415337 528398628 528463898 528624535 528820305 528932076 529002762 528779259 528501740 527884064
1965.4 527884064 527334671 526978874 527265587 528108940 528282127 528248253 528217621 527858467 527400475 527147102
1975.1 527147102 526774750 526525459 526626778 526474724 526539955 526616325 526698837 526362152 525819511 525955772
1984.7 525955772 525860023 525752220 525384293 524931602 524986763 525074387 524780083 524222679 524887848 525356979
1994.3E25356979l40309l09105j05438p248l30849J01204K00920j40037p1755o2522
2004E24291840l42598l77236j01471k42576L15590K88200l90205l58849p4577l090
2013.6E23005028l84636m8905k99568n19829J14441K56501M00314o4812k20566k67448
2023.3E21970520l22723l2463q0491J52321K56806J47018j36375k62947j85013j34697
2032.9E21371956r8152k83318j99966j20697K1362J35651M5318m22554m58298J79253
2042.6E20170555k51617m08020Q2969J63498k4605K10038L81164m99878n62477j47247
2052.2E19114380j92413j06011L2044J8463r0752K31972j10665m25758n035j48201
2061.9E18318024k01493N9395k44560l19710L90129K77634j53771l04489l02238M6883
$$ plain form
1994.3 525356979 525016670 524707565 524602127 524594879 524264030 524365234 524566154 524426117 524354362 524291840
2004 524291840 523949242 523572006 523470535 523227959 523543549 523831749 523441544 523082695 523008118 523005028
2013.6 523005028 522620392 522571487 522271919 521752090 521866531 522123032 522523346 522458534 522237968 521970520
2023.3 521970520 521647797 521615334 521534843 521687164 521943970 522090988 521954613 521691666 521506653 521371956
2032.9 521371956 521273804 520990486 520790520 520669823 520691185 520826836 520872154 520449600 519991302 520170555
2042.6 520170555 519918938 519510918 519593887 519757385 519732780 519942818 520323982 519824104 519261627 519114380
2052.2 519114380 518921967 518815956 518848000 518866463 518775711 519007683 518897018 518471260 518466225 518318024
2061.9 518318024 518116531 518175926 517931366 517611656 518001785 518279419 518125648 517821159 517518921 517565804
2071.5E17565804k51084l15933r2888p1602K85530K73056j04980j29166k9106l91197
2081.1E16738434m34303o4965K6055L2844J35346J75514P1564j02501o94771o43311
2090.8E15239906M4136J77575J54495J6441l052N8251J67236N0583l92609n45959m84619
2101.4E14482384k96250J43891N79452K03171r8991j14098k46429j7701k62107m11072
2111E13962250l07694p4463K24419n7678r1744l3111N5084L1090j88179l68500l90930
2121.6E12760544J43814K43683J94282K23313j17379j73111m7149j05019l98788l37105
2131.3E12387085M2992J62391J53961j63955l56980p0076l1318j39313r5978j54075
2140.9E11734734n08576m66652L19290L46604P4692O485l08609k74544l01972L6278
$$ plain form
2071.5 517565804 517314720 516998787 516905899 516834297 517119827 517392883 517287903 517158737 517129631 516738434
2081.1 516738434 516304131 516239166 516265221 516298065 516433411 516608925 516680489 516577988 515883217 515239906
2090.8 515239906 515284042 515461617 515616112 515632553 515629501 515687752 515854988 515905571 515512962 514967003 514482384
2101.4 514482384 514186134 514330025 514909477 515112648 515013657 514899559 514653130 514635429 514373322 513962250
2111 513962250 513654556 513580093 513804512 513746834 513655090 513621979 513677063 513708153 513519974 513151474 512760544
2121.6 512760544 512904358 513148041 513342323 513565636 513448257 513275146 513227997 513122978 512724190 512387085
2131.3 512387085 512430077 512592468 512746429 512582474 512225494 512155418 512124100 511984787 511888809 511734734
2140.9 511734734 511226158 510759506 511078796 511425400 511500092 511506577 511197968 510923424 510621452 510657730
2150.6E10657730Q5220L167M24690K1362j28479k12745l93677j24359j67809j64947
2160.2E10000153q4229O1874J38665r9564m59213n2223K97813j23291q4381k34375
2169.9E09361229j31912J68037N0354M96n3749K2545m31519n60531j37329M2228m616
2180.5E08325233n8670K58713L9711k8915O4468l20320m38309l22990J39694L41110
2190.1E07999725N5504N0698J10511k50091j86615j64337n38140M3755K01607k43264
2199.8E07079353j73568R6855J20506l54004j44958J43470j44233j7548N4665j67427
2209.4E06493111L1433J29242k94571j97449k6016m11835m62570J6136J7204j15203
2219E05179482M80728L41301k77214k80343m24156m57382L2349L30238J87302j35308
$$ plain form
2150.6 510657730 510742950 510746117 511170807 511192169 511063690 510850945 510457268 510332909 510165100 510000153
2160.2 510000153 509915924 509977798 510116463 510016899 509557686 509505463 509803276 509679985 509595604 509361229
2169.9 509361229 509229317 509397354 509447708 509448204 509394455 509417000 508985481 508424950 508287621 508329849 508325233
2180.5 508325233 508266563 508525276 508564987 508536072 508600540 508280220 507841911 507518921 507658615 507999725
2190.1 507999725 508055229 508105927 508216438 507966347 507779732 507615395 507077255 507121010 507322617 507079353
2199.8 507079353 506905785 507002640 507123146 506769142 506624184 506767654 506623421 506605873 506660538 506493111
2209.4 506493111 506524544 506653786 506359215 506161766 506135750 505723915 505261345 505277481 505294685 505179482
2219 505179482 505660210 506001511 505724297 505443954 505019798 504562416 504594765 504925003 505112305 504976997
2228.7E04976997j87263L05061k1667o01845k97432j46217j44348k15607N4207L67355
2238.3E04089241K6131k53105k64130k34604n6763J70975k50015l07465M2420o0273
2248E02902412K4567J51405J97907k57378m16565k82325l90053j00327R4528K77596
2257.6E02201767n7526J8082K76604l16468j15356L5057l85399n65300Q6975N51529
2267.3E01729965Q3389j2016k37312l24745l41912j73187L3379n75905j05667M50172
2276.9E00526161M8256J05820q8654l28216j03417q4190o0082j37405k70805k17781
2286.5D99389687M8484L19863k24343l32145K45590N7373l10211k55928K6550K42233
2296.2D99207153L43170l24859o86913k73437m15955p1831J15929j35841j68915j259
$$ plain form
2228.7 504976997 504789734 505094795 505073128 504471283 504173851 504027634 503883286 503667679 503721886 504089241
2238.3 504089241 504115372 503862267 503598137 503363533 503306770 503477745 503227730 502920265 502962685 502902412
2248 502902412 502926979 503078384 503276291 503018913 502602348 502320023 501929970 501829643 501924171 502201767
2257.6 502201767 502144241 502162323 502438927 502122459 502007103 502042160 501656761 501091461 501178436 501729965
2267.3 501729965 501813354 501801338 501564026 501239281 500897369 500724182 500757561 500181656 500075989 500526161
2276.9 500526161 500574417 500680237 500591583 500263367 500159950 500075760 500015678 499878273 499607468 499389687
2286.5 499389687 499438171 499758034 499533691 499201546 499447136 499504509 499194298 498938370 498964920 499207153
2296.2 499207153 499550323 499225464 498538551 498265114 497849159 497777328 497893257 497757416 497588501 497587242
2305.8D97587242K83928J14822n6572o38046n99212j62125n8060O218k43759J63384
2315.5D96397820j27678k78664j76735o39038m8523K98347j39236p76443k63825K03476
2325.1D94449501L96156P97196m64745j129799k80494P38716M26292l48282o16989
2333.8D93967552q0108L91922j020318o02188K76261j94397k75536L21350J22490n02739
2343.4D92404289N66445m02336j092721k20260O12411J389161P96051k82441o16912
2352.1D93153687m80538q74939j215744o79703M3068J58120j907158l36228K139626
2360.8D90000191K112732J11885k241326j146621o92025L77961N34858K90070J132164
2369.5D90479889J54419n42374k74963K20604J74446L67393L10555K03667M46739j06964
$$ plain form
2305.8 497587242 497871170 497985992 497929420 497291374 496692162 496530037 496471977 496478195 496234436 496397820
2315.5 496397820 496270142 495991478 495814743 495175705 495127182 495425529 495286293 494509850 494246025 494449501
2325.1 494449501 494845657 495642853 495178108 494048309 493767815 494506531 494932823 494584541 493967552
2333.8 493967552 493887444 494279366 493259048 492656860 492933121 492738724 492463188 492784538 492907028 492404289
2343.4 492404289 492970734 492568398 491475677 491255417 491867828 493256989 494053040 493770599 493153687
2352.1 493153687 492673149 491798210 490582466 489902763 489945831 490103951 488196793 487860565 490000191
2360.8 490000191 492112923 492224808 489983482 488836861 488144836 488522797 489057655 489347725 490479889
2369.5 490479889 490634308 490091934 489816971 490037575 490212021 490579414 490889969 491093636 491540375 491433411
2379.1D91433411r0943P9537J22680J42937k21825k02903o0006k83813k31743M24843
2388.8D91112175J36948l19519P8125K37388K5101m09203l28064k07786m3411R8495
2398.4D90380249j78947M8027J14822J5907k46849n26581k66532q02J72730r8991l79296
2409D89033737l4981L36380J60408j85737l85552k70729m4899k38037j62391J49726
2418.7D88357925Q9302k30140M0321K88201l20435l34015j00670j30729l5019J66778
2428.3D87791519J80168j99394j29814Q0872q1406n49469n43633J01166K79350q4381
2438D86844978j62658K04353r9869l19443l81050o25724m3335L54614N07469L19405
2447.6D86598740j97335j04103m5547j37978j66397m58755n92995j26877K65579J84708
$$ plain form
2379.1 491433411 491342468 491422005 491544685 491687622 491465797 491262894 491202888 490919075 490687332 491112175
2388.8 491112175 491249123 490929604 491007729 491245117 491270218 490861015 490532951 490325165 490281754 490380249
2398.4 490380249 490201302 490249329 490364151 490380058 490133209 489606628 489340096 489339294 489512024 489413033 489033737
2409 489033737 488998756 489335136 489495544 489309807 488924255 488653526 488608627 488370590 488208199 488357925
2418.7 488357925 488447227 488217087 488257408 488545609 488225174 487891159 487790489 487659760 487624741 487791519
2428.3 487791519 487971687 487772293 487642479 487723351 487641945 487092476 486548843 486650009 486929359 486844978
2438 486844978 486682320 486886673 486786804 486467361 486086311 485460587 485417252 485771866 486279335 486598740
2447.6 486598740 486401405 486297302 486251755 486113777 485947380 485488625 484895630 484768753 485034332 485219040
2457.2D85219040k19116q6937K12211k22091l24593k02331o8589j66053k31553K28310
2466.9D84138298L71552N8479m51622j85242j33858k60582R4910l94363m10080K11029
2476.5D83038521M68941j19858o35224j18789K784l5934J07880K06222J39237j8959
2486.2D83034821k04926k26555j48659m33197k19650k52457k34718J82762J94969J92185
2495.8D81884575k64359l00865N0125O6490k28385l94860j02424n5428K63710J00021
2505.5D81018600m06112j55144J96648L4370l32794j90964j90811j1787J45187m3144
2515.1D80064049K6130o9465k29263l77236r4871J30119J51100J11198l14102l19481
2524.7D79078178j56746K07139J54075l45383k25486j10054l0632j34659k62489q7052
$$ plain form
2457.2 485219040 484999924 484912987 485125198 484903107 484578514 484376183 484307594 484141541 483909988 484138298
2466.9 484138298 484509850 484568329 484116707 483931465 483797607 483537025 483631935 483237572 482827492 483038521
2476.5 483038521 483507462 483387604 482752380 482633591 482636375 482600441 482708321 482914543 483053780 483034821
2486.2 483034821 482829895 482603340 482454681 482021484 481801834 481549377 481314659 481497421 481692390 481884575
2495.8 481884575 481620216 481319351 481369476 481435966 481207581 480812721 480710297 480654869 480918579 481018600
2505.5 481018600 480612488 480457344 480653992 480688362 480355568 480164604 479973793 479962006 480107193 480064049
2515.1 480064049 480090179 480020714 479791451 479414215 479319344 479449463 479600563 479711761 479397659 479078178
2524.7 479078178 478921432 479128571 479282646 478937263 478711777 478601723 478571091 478436432 478173943 478086891
2534.4D78086891j63956k95333j90277N2566N3101l39280k99758Q2626J11809J56593
2544D77254982M7836p5912n4360r4413j74714l30314j03951n8403n7830J37596J18522
2554.6D76609039j34544n01976j27869P8049R460K85492R232n48325k97889J74446
2564.3D75555115j75324k87742k89994j27334R0179o1836N0316k29721P9384L06167
2573.9D74909210n3062k02141l32832o5804l37677j40610K30713K29j78299k76336
2583.6D73553391N7945j47591k71454l02429o8016K61345M6883K48260n6190l13569
2593.2D73008575l78456j06964J65100k54745j82419j68686J08833L8872j18599J08261
2602.9D72219772p9612o1989m11301m73633j47628J14250J71547O1302P9918j51711
$$ plain form
2534.4 478086891 477922935 477627602 477437325 477489891 477542992 477203712 476903954 476986580 477098389 477254982
2544 477254982 477302818 477226906 477172546 477078133 476903419 476573105 476469154 476410751 476352921 476490517 476609039
2554.6 476609039 476474495 475972519 475844650 475922699 475932159 476217651 476226883 475678558 475380669 475555115
2564.3 475555115 475379791 475092049 474802055 474674721 474764900 474703064 474753380 474523659 474603043 474909210
2573.9 474909210 474856148 474654007 474321175 474255371 473917694 473777084 474007797 474008026 473829727 473553391
2583.6 473553391 473611336 473463745 473192291 472889862 472821846 473083191 473130074 473378334 473322144 473008575
2593.2 473008575 472630119 472523155 472688255 472433510 472251091 472082405 472191238 472230110 472111511 472219772
2602.9 472219772 472140160 472078171 471666870 471193237 471045609 471159859 471331406 471392708 471472626 471320915
2612.5D71320915l319k12593m06227j73034j15624j9188p6828R0943J73454J51062
2622.1D70729561p1068l07426m17366k72255J02310r5711n0888k92702l48320J6556
2631.8D68992691l319J94474r2507l05443k15378J60370L45536j46065m20685m75883
2641.4D68033791N7258J39008l17040k51159J10740J66588p8888p7324k44064n264
2651.1D67533646J03569m6959l6698k41203j21117l19786j56669K22511L5858j53961
2660.7D66819191k21100p1945l79334m14085l7689J19247K82669J43586k12899k27852
2670.4D65799789L4104k31781l68843j57547R422J82800M2038k9220k21215l96766
2680D64662781l8529L5248n27954j13373O17104Q4457j77460j44920l02162l72810
$$ plain form
2612.5 471320915 471317596 471105003 470698776 470525742 470410118 470390930 470314102 470405045 470578499 470729561
2622.1 470729561 470658493 470351067 469933701 469661446 469763756 469668045 469617157 469324455 468976135 468992691
2631.8 468992691 468989372 469183846 469091339 468785896 468570518 468730888 469076424 468930359 468509674 468033791
2641.4 468033791 468091049 468230057 467913017 467661858 467772598 467939186 467860298 467782974 467538910 467533646
2651.1 467533646 467637215 467590256 467553558 467312355 467191238 466871452 466714783 466937294 466973152 466819191
2660.7 466819191 466598091 466526146 466146812 465732727 465695038 465814285 466096954 466240540 466027641 465799789
2670.4 465799789 465833893 465602112 465233269 465075722 465085144 465267944 465309982 465280762 465059547 464662781
2680 464662781 464624252 464659500 464131546 464018173 464635277 464719734 464542274 464397354 464095192 463722382
2689.6D63722382l02010j06087M2610K08931j32141k77672j82266j75705J06316K86751
2699.3D63191109j01395o53496j95274J95846M8981j26457n7259K07405l8757O1112
2708.9D62531815j42937l65982j30577k01226p4615l00522k93579L8338M2839J68686
2718.6D61272240P3051m08172l91160l7956k19536J91765N95894J2894l76168k24952
2728.2D60487900o6757l03879k71073m1961o9046q4534R0218k00158m47578J81160
2737.9D59274292M5166k25716M7570N9127j95694k23655L97186K82250k26746m10423
2747.5D58823357l17879k67677l48359K099k4033J08452R6855r270J2017n58739m21524
2758.1D57095299J1787K06757O3095k59552n0659R7389q7090o9732j8311n25246j28059
$$ plain form
2689.6 463722382 463420372 463314285 463356895 463565826 463433685 463156013 462973747 462798042 462904358 463191109
2699.3 463191109 463089714 462436218 462240944 462436790 462485771 462359314 462302055 462509460 462470703 462531815
2708.9 462531815 462388878 462022896 461892319 461691093 461616478 461315956 461022377 461060715 461103554 461272240
2718.6 461272240 461345291 460937119 460545959 460508003 460288467 460480232 461076126 461089020 460712852 460487900
2728.2 460487900 460421143 460117264 459846191 459804230 459735184 459650650 459740868 459540710 459093132 459274292
2737.9 459274292 459319458 459093742 459141312 459200439 459004745 458781090 459178276 459460526 459233780 458823357
2747.5 458823357 458505478 458237801 457889442 457891541 457867508 457975960 458072815 458063545 458075562 457516823 457095299
2758.1 457095299 457107086 457313843 457376938 457117386 457066727 457164116 457077026 457007294 456988983 456463737 456335678
2768.7D56335678J71814m06303l8491K34642J81466j00670l31917o7177k89726n08232
2778.4D55181084r5368J68000j89400j45493K34986K21862j55296m28581k04201q9493
2788D54498100o0959m9057j86309k41585K40631J21994n79376J18675L09143m26865
2797.7D53744392l33328R8190J89782j40801m60434m41017Q087k23045l05786L50227
2807.3D52486267K13699o0005l53584k02370L16735O065j78833j0796k04315k88391
2816.9D51724472j47629m11758m68712r54L89901J91116r689J04103l90397m69512
2826.6D50510941k86255m49028j48011L04985L49884q7699j74218r9411l22570p24907
2836.2D48873711m14315M18167J66970p0038k14043l45077l2120n531k97242n91697
$$ plain form
2768.7 456335678 456507492 456101189 456062698 456297340 456478806 456378136 456046219 455979042 455689316 455181084
2778.4 455181084 455085716 455253716 455064316 454918823 455153809 455375671 455220375 454791794 454587593 454498100
2788 454498100 454437141 454388084 454201775 453960190 454200821 454322815 453743439 453862114 454171257 453744392
2797.7 453744392 453411064 453509254 453699036 453558235 453097801 452656784 452664871 452441826 452136040 452486267
2807.3 452486267 452699966 452639961 452286377 452084007 452400742 452406807 452227974 452217178 452012863 451724472
2816.9 451724472 451576843 451165085 450696373 450695419 451085320 451276436 451266747 451370850 450980453 450510941
2826.6 450510941 450224686 449775658 449627647 449932632 450282516 450194817 450020599 449921188 449598618 448873711
2836.2 448873711 448459396 448877563 449044533 448974495 448760452 448415375 448383255 448377724 448080482 447488785
2845.9D47488785j66779k84424n79910q0795J8921p1869p9384L86009J41678n69954
2855.5D46202278j02959M9286j56326K0180J15166J20315n6648l33748k63214l1548
2865.2D45562782l9291j33896j54686j22108r4452J3046L8872p3014k44789l44886
2874.8D44407578l61329k42309M52080O43501j89095n80482j55182J33400j02310l20053
2884.4D43685799k41242l11889k90909K20718L6583k85873M272N4093l7270m91371
2894.1D42342911l42446P9728k29989m15344k48909K93122K97660N7259k33803n31425
2903.7D41068764l65029l14521J33514K19994j77384n54161m90761R2812J73988K38037
2913.4D40025253l72581o26259J37558J01623n07698p13119p3395m8027l90053P3433
$$ plain form
2845.9 447488785 447322006 447037582 446457672 446376877 446395798 446323929 446244545 446630554 446772232 446202278
2855.5 446202278 446099319 446148605 445992279 446012459 446127625 446247940 446191292 445857544 445594330 445562782
2865.2 445562782 445523491 445389595 445234909 445112801 445018349 445031395 445070267 444997253 444752464 444407578
2874.8 444407578 444046249 443803940 444256020 444899521 444710426 444129944 443974762 444108162 444005852 443685799
2884.4 443685799 443444557 443132668 442841759 443062477 443099060 442813187 442817459 442871552 442834282 442342911
2894.1 442342911 442000465 442080193 441850204 441434860 441185951 441479073 441776733 441833992 441600189 441068764
2903.7 441068764 440703735 440389214 440522728 440742722 440565338 440011177 439520416 439613228 439787216 440025253
2913.4 440025253 439652672 439026413 439163971 439265594 438757896 438044777 437971382 437923355 437533302 437606735
2923D37606735L97339j6746j37558L98941R1858j94436m03137m59404K15645M8523
2932.7D37547760k11182j06849O7901K77481J32676N9433m0436j15052p2555n1346
2942.3D37487831l99551n84030L53584M17137n99861n18074l07503Q4572O68793k1668
2952D36581230n45654q2588J57089k61154k3079n3520p01485k9717J49994J16577J06049
2962.6D35413742m67033k41204j89514n2566J16539P5912L8910j85928k56882l62892
2972.2D33889084k32239J93138O51283j39465n87349Q1024j73111j74255j38397k38419
2981.8D33131294j62620K5253k4757l57590O7902n0736K11105K78778m06646l9292
2991.5D32672691j33590l07160O5460L5363m30260l44734K78854M23699j62011r11865
$$ plain form
2923 437606735 438004074 437987328 437849770 438248711 438340569 438146133 437742996 437283592 437499237 437547760
2932.7 437547760 437336578 437229729 437297630 437575111 437707787 437767220 437726784 437611732 437539177 437487831
2942.3 437487831 437088280 436504250 436857834 437274971 436675110 436157036 435849533 435934105 436602898 436581230
2952 436581230 436035576 435952988 436110077 435848923 435825844 435772324 435070839 435041122 435191116 435307693 435413742
2962.6 435413742 434946709 434705505 434515991 434463425 434579964 434655876 434694786 434508858 434251976 433889084
2972.2 433889084 433656845 433849983 434501266 434361801 433774452 433855476 433682365 433508110 433369713 433131294
2981.8 433131294 432968674 432993927 432969170 432611580 432679482 432628746 432839851 433118629 432711983 432672691
2991.5 432672691 432539101 432231941 432297401 432332764 431902504 431557770 431836624 432260323 432098312 431186447
3001.1D31186447l90892L2539N1957M4937l36037k56615k89650P9499P2174k82097
3010.8D29912262P3891j39122m75045j47361r728l08151Q0109L7193n10101k72637
3020.4D28241310q4152k4643p5226J85967J94854j69296l54957m09661Q583k18849
3030.1D27293930o83441n56259K14882O98585j21727q34122n76820n9051j54877R5062
3039.7D25316162L07579j68571j50376j40381k39601l54728m55513m32587k25334R6741
3049.4D23553391K52876P3471l33214j71051j96724k33192l24936k89727J60943k96288
3059D22195549k47612k8419l02468n33142m70352L48091M47273j58004n73235k12746
3068.6D20464935j25808l10746k63633m03443J27793l5057J77383K41127r82666o05965
$$ plain form
3001.1 431186447 430795555 430828094 430880051 430924988 430588951 430332336 430042686 430122185 430194359 429912262
3010.8 429912262 429986153 429847031 429371986 429224625 429214897 428906746 428986855 429024048 428513947 428241310
3020.4 428241310 428157158 428132515 428057289 428243256 428438110 428268814 427913857 427504196 427512779 427293930
3030.1 427293930 426610489 426054230 426269112 426967697 426845970 426011848 425435028 425375977 425221100 425316162
3039.7 425316162 425623741 425455170 425304794 425164413 424924812 424570084 424114571 423681984 423456650 423553391
3049.4 423553391 423806267 423879738 423546524 423375473 423178749 422945557 422620621 422330894 422491837 422195549
3059 422195549 421947937 421919518 421617050 421083908 420613556 420961647 421408920 421250916 420677681 420464935
3068.6 420464935 420339127 420028381 419764748 419361305 419489098 419454041 419631424 419872551 418889885 418283920
3078.3D18283920j6708M1084j19591n09681q0147K01187L7613m8218l20778p91855
3087.9D16676826m13360K14462L2921k79732l66440k89611N951j74332r66835m29001
3097.6D14010849M33350J05476j88293j58005k49214k90986J75515K07977m54178r75189
3107.2D12617302m26254M77676j9913l80211j86004L4637K365k89421k48451n58128
3116.9D11023598l10898k74735m44908K53754J06392k73476j69563m07257n63088k08740
3126.5D08731079k43606l25890J04408J31684J29203r6969m11034k01683k75803l38821
3136.1D07202568r2010j2856q7776k55737j59798k8153m61731n17997j09711J24245
3145.8D05601044j74218m09431O1607k75764l43742R1819k73437k54746j14517l26424
$$ plain form
3078.3 418283920 418267212 418308296 418188705 417679024 417598877 417800064 417837677 417789459 417468681 416676826
3087.9 416676826 416263466 416477928 416510849 416231117 415864677 415575066 415581017 415406685 414439850 414010849
3097.6 414010849 414444199 414549675 414361382 414203377 413954163 413663177 413838692 414046669 413592491 412617302
3107.2 412617302 412191048 412668724 412648811 412268600 412082596 412117233 412119598 411830177 411581726 411023598
3116.9 411023598 410712700 410437965 409993057 410246811 410353203 410079727 409910164 409502907 408939819 408731079
3126.5 408731079 408487473 408161583 408265991 408397675 408526878 408429909 408018875 407817192 407541389 407202568
3136.1 407202568 407110558 407097702 407009926 406754189 406594391 406566238 406104507 405586510 405476799 405601044
3145.8 405601044 405426826 405017395 405079002 404803238 404459496 404551315 404277878 404023132 403908615 403582191
3155.4D03582191l07426K95067K04925l80668j27030L3112l49579q08067j17226J01662
3165.1D02126961q67691n62783K15836J27792m28085l51486J02997K98690N2033m41284
3174.7D00272980m20952j36871J50146m81720n69687J7052k49138O1646J37329l14904
3184.4C98465881o30912l41988M01955m2000n66063l53470j98936l18871k82135M8599
3194C96182060J6442l55874l18717O2789k69012o92024k46010J29318m29115l84445
3203.6C93695412N68466J93481p34710m25492J72539p2403l70445l01857j22643k51007
3213.3C92351341m54101K09427j26458n67970J86386Q2665l27454k98042l45612l41911
3222.9C90368271n5847k10152k62032J73340k77176o62155k05269K59285J88904q9607
$$ plain form
3155.4 403582191 403274765 403569832 403774757 403394089 403267059 403300171 402950592 402142525 402025299 402126961
3165.1 402126961 401259270 400696487 400912323 401040115 400612030 400260544 400363541 400662231 400714264 400272980
3174.7 400272980 399852028 399715157 399865303 399383583 398813896 398830948 398581810 398643456 398780785 398465881
3184.4 398465881 397834969 397492981 397894936 397852936 397286873 396933403 396734467 396415596 396133461 396182060
3194 396182060 396198502 395842628 395523911 395586700 395317688 394625664 394379654 394508972 394079857 393695412
3203.6 393695412 394263878 394457359 393722649 393297157 393469696 393397293 393026848 392724991 392602348 392351341
3213.3 392351341 391897240 392106667 391980209 391412239 391598625 391681290 391353836 391055794 390710182 390368271
3222.9 390368271 390312424 390102272 389840240 390013580 389736404 389074249 388868980 389128265 389317169 389227562
3232.6C89227562m19693j28212P0572o92978l05367K2126k42920k40898j20964M6386
3242.2C87215614n04265l27835j31912k8915o6338m01954P7171l7155Q7280o8817l85132
3252.8C85427742J2436J09291L3646n54352n55306k79045j87340j09748M9781r0828
3262.5C83856277o85272l4408J86805j46865m66118l62358L21197p1831l05786l64074
3272.1C81927567j04142n8708j27563J32446k59247o6414k97890p06176o15845n684
3281.8C79818344L15361l30467j75438m44832k72751J54572j89743j33019k47879Q5717
3291.4C78579865j52321o92215j85852J62620j20468m02794n34553q29430k82974K55356
3301C75797234P705j68075m04969k66799L0670m36592n20058p4120o27441l85933L12920
$$ plain form
3232.6 389227562 388807869 388679657 388750229 388057251 387751884 387774010 387531090 387290192 387169228 387215614
3242.2 387215614 386711349 386383514 386251602 386222687 386156349 385754395 385831566 385794411 385881691 385812874 385427742
3252.8 385427742 385440178 385549469 385583115 385028763 384473457 384194412 384007072 383897324 383947105 383856277
3262.5 383856277 383171005 383136597 383323402 383176537 382710419 382348061 382669258 382597427 382291641 381927567
3272.1 381927567 381823425 381764717 381637154 381769600 381510353 381443939 381146049 380439873 379824028 379818344
3281.8 379818344 380133705 379803238 379627800 379182968 378910217 379064789 378875046 378742027 378494148 378579865
3291.4 378579865 378427544 377735329 377549477 377712097 377591629 377188835 376654282 375824852 375541878 375797234
3301 375797234 375804939 375636864 375231895 374965096 374995766 374559174 374039116 373964996 373337555 372951622 373264542
3311.7C73264542l64724o31485J02883K52685n33523m20456L2844l83987p77473m63639
3321.3C70077667j78833n94864j6174N4550q25691p24144m56352k23236j21994j47972
3330.9C66842957n14946n43747j67694K1514K14882m25110r48791n27268l32870p47070
3340.6C62871857k91405j57242p27997j39465l42979p01523o37322n48401l14483k45896
3350.2C58765144J23711m98543m88777k24724m89273l11432o30913k67753O7787l67699
3359.9C55677528r08546n11589k9106m85382k05345j84136m38042m52995k86827j04904
3369.5C52070656m02603o54526n98755l29475p76596k65007N18112j02845l90510n67741
3379.2C48500710m50554k75460n81817p92504l67851j01852k90757J16845P0076l15743
$$ plain form
3311.7 373264542 372899818 372268333 372371216 372623901 372090378 371669922 371702766 371318779 370541306 370077667
3321.3 370077667 369898834 369303970 369287796 369342346 368516655 367792511 367336159 367112923 366990929 366842957
3330.9 366842957 366328011 365784264 365616570 365638084 365852966 365427856 364479065 363951797 363618927 362871857
3340.6 362871857 362580452 362423210 361695213 361555748 361212769 360511246 359873924 359325523 359011040 358765144
3350.2 358765144 358888855 358390312 357901535 357676811 357187538 356876106 356245193 355977440 356045227 355677528
3359.9 355677528 354768982 354257393 354228287 353742905 353537560 353353424 352915382 352462387 352175560 352070656
3369.5 352070656 351668053 351013527 350414772 350085297 349308701 349043694 349561806 349458961 349068451 348500710
3379.2 348500710 348050156 347774696 347192879 346400375 346032524 345930672 345639915 345756760 345826836 345511093
3388.8C45511093o85921m22058P3357m89082n28794j74331j50948p2861m9743k14882
3398.4C42795830o3477k95753r34677k11754J3504p63550l91274M18702J51481l98445
3408.1C40320587m29458n34783l22304J57929L41034j19705l30353k35520k49862k34146
3417.7C38363419n89982k84461m29764l92342K30980j08299J7242J65291L03764L3303
3427.4C37309151m79050k42805K670j3275j3123N09758J19820j92681N7907l65524
3437C36692848n96237k59323J46484j23214k4529j46370K34070Q37593J05591l00102
3446.7C36566811o58913J26114L92532J55792K61841j66092K84005O9389J09444N21202
3456.3C37662125L48892K24495j1368J36337p3204J04218m8561K05154M13246j17645
$$ plain form
3388.8 345511093 344825172 344403114 344476471 343987389 343458595 343284264 343133316 343060455 343010712 342795830
3398.4 342795830 342732353 342436600 341501923 341290169 341303673 340540123 340148849 340567551 340719032 340320587
3408.1 340320587 339891129 339356346 339034042 339191971 339533005 339413300 339082947 338847427 338597565 338363419
3417.7 338363419 337773437 337488976 337059212 336666870 336897850 336789551 336806793 336972084 337275848 337309151
3427.4 337309151 336830101 336587296 336589966 336576691 336563568 337073326 337193146 337000465 337058372 336692848
3437 336692848 336096611 335837288 335983772 335860558 335836029 335689659 335923729 336761322 336866913 336566811
3446.7 336566811 335907898 336034012 336426544 336582336 336844177 336678085 336962090 337031479 337140923 337662125
3456.3 337662125 338011017 338235512 338224144 338360481 338287277 338391495 338342934 338548088 338961334 338843689
3466C38843689L05290P3319L48053M38499m5853R3880J90354L01399J3160N01748P28950
3476.6C41792488P3624n01061J06316Q79745L17841p4806k20070R25941R10797l4027
3486.2C44176788J71509m9209N64956N80597K01683J46904K24838O15769L66134J09177
3495.8C47109146j18446Q8920J97182N13573K72255j14746O78787L75976L08724N30739
3505.5C49842110K96364K28385P37381M08173o35834O16837P78808P36390O46133j96800
3515.1C53457947J40686n2452J76124M43344L97721P58323L91045j29318p9956K24075
3524.8C55727539K91214N17616M97055K86332L0365N18264P46765M84772Q35724N94673
3534.4C60530319Q16727j42517o20079P96432N48020O75316L25851l0174J04255j21269
$$ plain form
3466 338843689 339148979 339222298 339570351 340008850 339962997 340056877 340247231 340548630 340561790 341063538 341792488
3476.6 341792488 341866112 341365051 341471367 342351112 342668953 342594147 342374077 343300018 344210815 344176788
3486.2 344176788 344348297 344299088 344864044 345444641 345646324 345793228 346018066 346633835 346999969 347109146
3495.8 347109146 346990700 347079620 347276802 347790375 348062630 347947884 348626671 349002647 349311371 349842110
3505.5 349842110 350138474 350366859 351104240 351512413 350876579 351493416 352272224 353008614 353654747 353457947
3515.1 353457947 353598633 353546181 353722305 354165649 354563370 355321693 355712738 355583420 355503464 355727539
3524.8 355727539 356018753 356536369 357033424 357319756 357350121 357868385 358615150 359099922 359935646 360530319
3534.4 360530319 361347046 361204529 360584450 361380882 361928902 362604218 362930069 362899895 363004150 362882881
3544.1C62882881J8006P16400J075744m06151L77617R18847O08787O93932j79024Q53577
3553.7C67560616O84967K64511L35197K61116J026230Q15964L07045m31328N37109
3562.4C71361427K74391j92680J153641j536217n96619K79313L1395K578315J581230
3571.1C74934196Q41599N63087J8502J67999J78947N78766M64859J068344N56641k50206
3580.7C79122734M48036O50406N57060J9799J429023P04842k398872j66970P12929
3589.4C81078987J748657J509323J024209l95470j039086J454583k74048P41157J005173
3598.1C86853485l24898J904793K76833N2757Q44688j8463Q8043K93618K38762j033516
3607.7C89176102J483535J64376k26937K774239j069145j278801J797066j20583J479073
$$ plain form
3544.1 362882881 362900887 363617287 364693031 364286880 364664497 365583344 366192131 366886063 366707039 367560616
3553.7 367560616 368245583 368510094 368845291 369106407 370132637 370948601 371255646 370824318 371361427
3562.4 371361427 371635818 371443138 372596779 371060562 370463943 370743256 370774651 373352966 374934196
3571.1 374934196 375775795 376338882 376357384 376525383 376704330 377283096 377747955 378816299 379372940 379122734
3580.7 379122734 379570770 380221176 380778236 380798035 382227058 382931900 380533028 380366058 381078987
3589.4 381078987 382827644 384336967 385361176 384965706 383926620 385381203 385107155 385848312 386853485
3598.1 386853485 386528587 388433380 388710213 388762970 389607658 389589195 389677238 389970856 390209618 389176102
3607.7 389176102 390659637 390824013 390597076 393371315 392302170 391023369 392820435 392699852 394178925
3616.4C94178925O86760j463547M8370N16892J754455J701355O66695J60255J67809
3625.1C98417969N73044K78053J511993p47337m973908K160988K255707J972389J40457
3633.8D01589355o07528J085357O58150N12695o59523J29319P88994K35290J23940
3642.4D03856049l39203J35269k68631O76689j334076k685966R02862k149086n1002
3651.1C98742905K468872L305206J704063O44417J824188k976531M0359J713905K55738
3659.8D07723122L96576n70565k35824J06735O24237M46434m43420O70089l70750k605858
3669.4D05740776j332321j935387J404152L582993K121849l251801o209717J951485
3677.1D02072029L163147J338387j92910O11992J076889N56336k51427n78766n19638
$$ plain form
3616.4 394178925 394865685 393402138 393450508 393967400 395721855 397423210 398089905 398250160 398417969
3625.1 398417969 398991013 399269066 400781059 400033722 395059814 397220802 399476509 401448898 401589355
3633.8 401589355 400981827 402067184 402725334 403238029 402578506 402707825 403496819 403732109 403856049
3642.4 403856049 403516846 403652115 403383484 404060173 402726097 400040131 400942993 398793907 398742905
3651.1 398742905 401211777 404516983 406221046 406865463 408689651 405713120 405753479 407467384 407723122
3659.8 407723122 408119698 407549133 407313309 407420044 408044281 408490715 408047295 408717384 408346634 405740776
3669.4 405740776 404408455 402473068 403877220 407460213 409582062 406330261 400120544 402072029
3677.1 402072029 405235176 406573563 406380653 406992645 408069534 408625870 408374443 407795677 407276039
3685.8D07276039L31802J150513l009834j321793K576599k952919p1907L317948Q67653
3694.5D08164101L92341J9570j80436N8022q17299K84844J158523j990852j511879
3703.2D05576935K279091N93033r18389o29158k47841J286583l092041K45323J523018
3711.9D06616554n687904J820412K748069P67937M38690P43714l27912j897774L18108
3720.5D05539894J748505k279625k519112K149811Q13446k16331r82857P3967J409149
3729.2D05736847k47955J493492k168465m131775L226586N55801l817596o22139R29908
3737.9D00954704P47261Q64792L06549r25750J394920M394874j497116j0104103K806969
3746.6C98943100K504501K065621k984047o155167M887886J147919j337280K126007
$$ plain form
3685.8 407276039 407607841 408758354 405748520 404426727 407003326 404050407 403978500 407296448 408164101
3694.5 408164101 408556442 408576012 408395576 408453598 407636299 407921143 409079666 407088814 405576935
3703.2 405576935 407856026 408449059 407530670 406901512 406653671 407940254 404848213 405093536 406616554
3711.9 406616554 400928650 402749062 405497131 406265068 406703758 407447472 407119560 405221786 405539894
3720.5 405539894 407288399 405008774 402489662 404639473 405452919 405236588 404253731 404327698 405736847
3729.2 405736847 405488892 406982384 404813919 400682144 403908730 404464531 400646935 400024796 400954704
3737.9 400954704 401701965 402566757 402873306 401947556 403342476 407737350 406240234 396136131 398943100
3746.6 398943100 401447601 403513222 400529175 394374008 399261894 400409813 399072533 401198540
3754.3D01198540J554146R28802j831284Q14476J326180k775574M4174J841240M94500
3763D03595200k73209J313972o23703k188110N35736J649552J57814l528939J255837
3771.7D01894150K003555k09312m17710m60701k1934p03354L16849O30035k402763
3780.3D00628815M89502N53321J62850O04248j517601M50592J393585J02005k14653
3789D02652664o28166J10397J30005j37558o16989j85890R76868j687928j934662N77813
3798.7C99256554J108322J307487k656250l544960K033806J431809R97352J450157
3806.4D01384277m342727r11408K863388Q86307L32832O39382l11165j050568J451035
3815.1D00941353j170502o273651K822838K231178J684990J061478o757546O48232
$$ plain form
3754.3 401198540 402752686 403681488 401850204 402664680 403990860 401215286 401259460 403100700 403595200
3763 403595200 403321991 404635963 404012260 401824150 402359886 404009438 404167252 400638313 401894150
3771.7 401894150 403897705 403688393 403270683 402809982 402788048 402084694 402401543 403031578 400628815
3780.3 400628815 401118317 401671638 401834488 402438736 400921135 401371727 402765312 402867317 402652664
3789 402652664 402024498 402134895 402264900 402127342 401510353 401324463 402301331 400613403 398678741 399256554
3798.7 399256554 400364876 401672363 399016113 395471153 397504959 398936768 399934120 401384277
3806.4 401384277 397041550 396130142 398993530 399879837 400212669 400852051 400540886 399490318 400941353
3815.1 400941353 399770851 393497200 396320038 398551216 400236206 401297684 394540138 395188370
3822.8C95188370K273979P98302N49583j53847j713943L88031R37195R36622O67038
3831.4C99871330l514099R89075L367767k787895k289886K923965l051071m135361
3839.2C91373825K925530l52097J034126K655411j515732j026611J566048J116714
3846.9C97777214r9297j1062j038284m11454l66897m258385L332138l333435o2523
3855.6C91528015L750229p25784l42179J593666Q79555Q75931k207222j073875K525520
3864.2C96803856k576561k574043K187957K161637K126808l286552l434411J018029
3871.9C92426720K270164J473084m174462R87664K427635K77328M56772J433106k150917
3880.6C95427094l991089K468452O68411p10983J411057l394585J057014K168045k48832
$$ plain form
3822.8 395188370 397462349 398260651 398810234 398656387 396942444 397330475 398267670 399204292 399871330
3831.4 399871330 396357231 397346306 400714073 397926178 395636292 398560257 395509186 391373825
3839.2 391373825 394299355 393947258 394981384 397636795 396121063 395094452 396660500 397777214
3846.9 397777214 397677917 397666855 396628571 396217117 395850220 391591835 394923973 391590538 391528015
3855.6 391528015 395278244 394552460 394210281 395803947 396683502 397559433 395352211 394278336 396803856
3864.2 396803856 394227295 391653252 393841209 396002846 398129654 394843102 391408691 392426720
3871.9 392426720 394696884 396169968 391995506 392983170 395410805 395688133 396144905 397578011 395427094
3880.6 395427094 391436005 393904457 394572868 393861885 395272942 391878357 392935371 395103416 394854584
3889.3C94854584O14700J3695k991677M90723J381455p81060O68908M69284J93138
3898C94913750P04727l850441R39712P49665k389183J880226j175385j038322J306839
3906.7C92041588O44607R99909M31061J50261k47002j50528k21405r15871K58675P36580
3916.3C93727875q57620j111718J229897L08609j263275R35859J60790k09694o12564
3925C92308159j038284J149444Q47511j24435j601982o48270J327057l74260l48930
3933.7C91496010N07316J49994K39144K06299m60244m70390l03268M37431O03371j985894
3943.3C90419769J90659J258125l78837K28843l26957k95868k05536q5182O17561k36015
3953C91186562K67906P23343j02539q31261n24635K63519p9651r0408m22478r50432
$$ plain form
3889.3 394854584 395469284 395482979 392491302 392982025 394363480 393582420 394251328 394720612 394913750
3898 394913750 395618477 391768036 392707748 393457413 391068230 392948456 391773071 390734749 392041588
3906.7 392041588 392686195 393686104 394117165 394267426 394020424 393869896 393648491 392732620 392991295 393727875
3916.3 393727875 392870255 391758537 392988434 393297043 392033768 392969627 393130417 392920723 392308159
3925 392308159 391269875 392419319 393266830 393142395 391540413 390892143 392219200 391844940 391496010
3933.7 391496010 392003326 392153320 392392464 392598763 392138519 391668129 391364861 391802292 392405663 390419769
3943.3 390419769 390610428 391868553 391489716 391718559 391391602 391095734 390890198 390805016 391422577 391186562
3953 391186562 391454468 392177811 392075272 391244011 390719376 390982895 390903244 390812836 390390358 389439926
3962.6C89439926j85623M97665P30286L18108n2796K45743k04544n99747k08130k56195
3972.2C89724693N8098L35274K25258J45073p2747q6326j23978k58560k07329M37508
3981.9C90176964L59306n38406n58357l68920n64308l32680Q18634J064530J1177k76337
3991.5C89791603J29051m61349r60732P4158O03180L9253p62062k39067P05528
4000.2C88919563
$$ plain form
3962.6 389439926 389254303 389751968 390482254 390800362 390747566 390993309 390788765 390189018 389980888 389724693
3972.2 389724693 389782791 390118065 390343323 390488396 390415649 390329323 390205345 389946785 389739456 390176964
3981.9 390176964 390536270 389997864 389439507 389070587 388506279 388173599 388992233 390056763 390067940 389791603
3991.5 389791603 389920654 389459305 388498573 388572731 389175911 389215164 388453102 388214035 388919563
4000.2 388919563
##END=$$ End of the data block
