##TITLE=$$ Begin of the data block
##JCAMP-DX=5.00 $$ ACD/SpecManager v 10.08
##SPECTROMETER/DATA SYSTEM=Varian
##DATE=13 Nov 2012 08:32:22
##DATA TYPE=INFRARED SPECTRUM
##DATA CLASS=XYDATA
##ORIGIN=
##OWNER=
##NPOINTS=3735
##FIRSTX=399.26403809
##LASTX=4000.35498047
##MAXX=4000.35498047
##MINX=399.26403809
##MAXY=77.49357605
##MINY=51.49479294
##XFACTOR=1.0000000000
##YFACTOR=0.000000100000000
##FIRSTY=51.49479294
##DELTAX=0.96440572
##XUNITS=1/CM
##YUNITS=TRANSMITTANCE
##XYDATA=(X++(Y..Y))
399.3E14947929R050408K6588974o578407k160378N152779L619766l776550n900803
407E40943718O413879L69301M908180L733979K074737P33948m994469k460441J662636
415.7E53385468J0927505J243095j2171478o265678N422554P422065k638244o311264
423.4E51014023k672424K4757J297951M769592R11369j201210K626267j706124O164017
432.1E61228218M046135m225769m197731J809387N104599j449928r68514m115219n67894
440.7E56663284j683998K24228J1394920K129403k15531Q63419l95355p62215J874771
449.4E70092926j024399n785789M124565K336464o676J529236K07291j916123o380501
458.1E63176994L353196J944999L264389O14395N68428J783219m657784N03044K151795
$$ plain form
399.3 514947929 523998337 550587311 544008904 541848526 547001305 550621071 546844521 540943718
407 540943718 547357597 547726898 552635078 556369057 558443794 559177742 554183273 551722832 553385468
415.7 553385468 564312973 565556068 553384590 547118912 552541466 559963531 557325287 551014023
423.4 551014023 548341599 548366356 549664307 554433899 555345268 554144058 556770325 555064201 561228218
432.1 561228218 565274353 561048584 556850853 558660240 563764839 562314911 561346397 557231178 556663284
440.7 556663284 554979286 555203514 566598434 568727837 568512306 569375725 568980370 568218155 570092926
449.4 570092926 569068527 563282738 567407303 569743767 569737091 571266327 571473618 569557495 563176994
458.1 563176994 566530190 568475189 571739578 572353973 572922401 574705620 570047836 570550880 572702675
466.8E72702675k409287k736435L229561P876549O102219l349381p521629K852402
474.5E76746674M116134L093338J347389m4364M18701j790657k771111N07431N267830
483.2E86891365Q47969k833481j956482L86849L032646Q93440R1400l213043K78549
491.8E84419212K489281k332573n11780K177697K420311M39376K697945J949005l75175
500.5E93373299m33197j331444O70662j399422Q77686K802963q49419k525482K44217
509.2E91429863K668419j872559j555290J86539o26755p70073n89676n19256l437272
517.9E84913940j372680r80530j481400K50931M79965k175560m318046k096100n45235
526.6E72675285J754227m77676m098549l028984K3994J583786j230659J64604m2687
$$ plain form
466.8 572702675 570293388 567556953 570786514 578663063 584765282 581415901 573894272 576746674
474.5 576746674 580862808 583956146 585303535 585259171 585677872 583887215 581116104 581623535 586891365
483.2 586891365 587739334 584905853 582949371 583336220 586368866 587262306 587353706 584140663 584419212
491.8 584419212 586908493 584575920 584064140 586241837 588662148 589101524 591799469 593748474 593373299
500.5 593373299 592940102 591608658 592279320 590879898 591757584 594560547 593711128 591185646 591429863
509.2 591429863 594098282 592225723 590670433 590856972 590230217 589460144 588870468 588351212 584913940
517.9 584913940 583541260 582560730 581079330 581330261 581810226 579634666 575316620 573220520 572675285
526.6 572675285 574429512 573951836 569853287 566824303 566848297 568432083 567201424 567366028 567323341
535.2E67323341j503715r60350M2076L74947k100373j033745k046737J75743K171669
543.9E62442856l75290K23350p31315r66339j718865J48011J258697K32163l36838
552.6E60176430j969910n96428r31053J250343J7433k774963m07486Q24814K235031
561.3E57824211K72789q38127j840706M7684K581100n55267p66029J60598N32380j519089
570.9E55899544q77304J282806R69887J080665j355018o57654Q4152j98135J71928
579.6E56400871l07007o30111q19588J213684O80809K33269k75345m72679N46226q55712
589.3E55714417j165047j854515m58908P25250K9945M42467P29218J138038k0523Q9340
598.9E55369682N2147p53059p27234O6376N14183L21388K00806j272240M3945M78211
$$ plain form
535.2 567323341 565819626 564859276 564901352 565276299 563175926 562142181 560095444 560271187 562442856
543.9 562442856 562067566 562290916 561559601 560593262 558874397 559022408 560281105 560513268 560176430
552.6 560176430 558206520 557610092 556679039 557929382 557946815 555171852 554764366 555589180 557824211
561.3 557824211 558097000 557258873 555418167 555465851 558046951 557491684 556725655 556886253 557418633 555899544
570.9 555899544 555022240 556305046 557274933 558355598 557000580 556342926 556427078 556228943 556400871
579.6 556400871 556093864 555463753 554644165 555857849 556538658 556771927 556496582 556023903 556570129 555714417
589.3 555714417 554549370 552694855 552235947 552961197 552991142 553433609 554162827 555300865 555280342 555369682
598.9 555369682 555421829 554668770 553941536 554007912 554522095 554843483 555044289 553772049 553815994 554294205
608.5E54294205K71377J138802J245766J568870o60629r67140l41835j7662m80652
617.2E56051102p70645Q6746j166802j4648L28026O21566Q03643l11318m86335j002884
626.9E54138451P49549N94674N44929J009064N25627N82314l56446j09596j4687K59438
636.5E57923317n11894R71641J715126p44476K21748Q70514J258583J35994J03379
645.2E61943932L77235k60429J826400L84217m92058Q32596J523285P10334J61972
653.9E67007484M68369o33583J272278J182937L14980Q46634Q32481J402130k86712
662.5E72406998L39851J094856J36986J589737J721993n110283O86988K643509J953583
671.2E77464218J341667j6517j018868j313362J218109K326927Q84819j78413p89642
$$ plain form
608.5 554294205 554565582 555704384 556950150 558519020 557858391 556891251 556549416 556531754 556051102
617.2 556051102 555280457 555367203 554200401 554185753 554513779 555135345 555938988 555627670 555141335 554138451
626.9 554138451 554888000 555482674 556027603 557036667 557562294 558144608 557788162 557678566 557663879 557923317
636.5 557923317 557411423 558383064 560098190 559353714 559575462 560445976 561704559 561840553 561943932
645.2 561943932 562321167 562060738 563887138 564271355 563779297 564611893 566135178 566845512 567007484
653.9 567007484 567475853 566842270 568114548 569297485 569612465 570459099 571291580 572693710 572406998
662.5 572406998 572746849 573841705 573978691 575568428 577290421 572180138 572867126 575510635 577464218
671.2 577464218 578805885 578789368 577770500 576457138 577675247 580002174 580886993 580708580 579918938
679.9E79918938K043838K308998J282502R87129J11580N37262O78520J063843q13485
688.6E88119125M72641J640549K88734J486359K59972O17103J179581Q36678J045990
697.3E95946732P18536J844788J743736J309738P70416J106072J401405J345482J373787
705.9F07560692O21490J297264J222077J328621R67178Q01544J586838J012955R74121
714.6F17372780N64728O19659P23190J150208J663360Q61779Q19587J103936Q17070
723.3F25696297j53771J053849J920547J522446J402282l9253N89523J143303J425286
732F34560509J975670J129417J472015K377510K496720K092438J800613J089020J687774
740.7F50681686K250367J982803K662430J890487J890183K332458J753006J379166
$$ plain form
679.9 579918938 581962776 584271774 585554276 586541405 586652985 587190247 587868767 588932610 588119125
688.6 588119125 588591766 590232315 590521049 592007408 592267380 592884483 594064064 594900742 595946732
697.3 595946732 596665268 598510056 600253792 601563530 602333946 603440018 604841423 606186905 607560692
705.9 607560692 608182182 609479446 610701523 612030144 612997322 613798866 615385704 616398659 617372780
714.6 617372780 617937508 618557167 619280357 620430565 622093925 622955704 623775291 624879227 625696297
723.3 625696297 625542526 626596375 628516922 630039368 631441650 631402397 631991920 633135223 634560509
732 634560509 636536179 637665596 639137611 641515121 644011841 646104279 647904892 648993912 650681686
740.7 650681686 652932053 654914856 657577286 659467773 661357956 663690414 665443420 666822586
748.4F66822586N98450Q12912J893921K246780J157532K35748R49783Q34732n65567
757.1F74986877J36795J074830l75138o66733L61481M93317p74307j565476q44726
765.7F72826920o77796m74624p64847j242371j411209j288605j002655k127838j461105
774.4F62375870n83954j776810k609863j663818l08075j607743j940994j811295k318191
783.1F47755127j428604r20868j708603k759247j406364n06668r84002j064186l51753
791.8F36624832m6501m06647O35872l88946o58417O73485J195221J382522R18083J850510
801.4F41780014J523895J607361K703476K069779J417007J239090K180710L033142
809.1F57554474K703552J962586J835556K042083J584092J151275K123871L421478
$$ plain form
748.4 666822586 667421036 668233948 670127869 672374649 673532181 673767929 674717712 675552444 674986877
757.1 674986877 675123672 676198502 675823364 675156631 675518112 676011429 675237122 673671646 672826920
765.7 672826920 672149124 671674500 670909653 669667282 668256073 666967468 665964813 663836975 662375870
774.4 662375870 661791916 660015106 657405243 655741425 655433350 653825607 651884613 650073318 647755127
783.1 647755127 646326523 645405655 643697052 640937805 639531441 639024773 638040771 636976585 636624832
791.8 636624832 636578331 636171684 636807556 636418610 635760193 636433678 637628899 639011421 639929504 641780014
801.4 641780014 643303909 644911270 647614746 649684525 651101532 652340622 654521332 657554474
809.1 657554474 660258026 662220612 664056168 666098251 667682343 668833618 670957489 674378967
816.9F74378967K384644J353683J697388J699371J659012J922760K222595J209565
824.6F88527985M88891J641922J326218M91180J231232J662216J765366J068268l31345
833.3F97871933j19171R91134Q05207K92053L00903k98080k95944K88696l88413k04162
842.9F99244156P06253J63422k7466M36249J67083j284027j432190p41501j562423
851.6F95669556k29798O14853m33883n39475r73663r65195j527863j954650j988297
860.3F87671585j485748p54929k544861k427673j123199k461701k935257j974411k285232
868.9F69678574k691498k441330k317734k362976l195114k580872j756592k808380
876.7F49524078k834472j159210j307450k970428k628670j961098j561889n75142n7907
$$ plain form
816.9 674378967 676763611 678117294 679814682 681514053 683173065 685095825 687318420 688527985
824.6 688527985 689016876 690658798 691985016 692476196 693707428 695369644 697135010 698203278 697871933
833.3 697871933 697752762 698743896 699549103 699841156 700142059 699843979 699548035 699836731 699448318 699244156
842.9 699244156 699950409 700113831 700086365 700522614 700689697 699405670 697973480 697231979 695669556
851.6 695669556 695439758 696054611 695620728 695081253 694107590 693142395 691614532 689659882 687671585
860.3 687671585 686185837 685430908 682886047 680458374 679335175 676873474 673938217 671963806 669678574
868.9 669678574 666987076 664545746 662228012 659865036 656669922 654089050 652332458 649524078
876.7 649524078 646689606 645530396 644222946 641252518 638623848 636662750 635100861 634525719 634467812
885.3F34467812r73740r11179m76837r50470O52695J376152R64088P55158J452103
894F36355782K721405K743568L115692K885819K814102K549286K177353L338012L820343
902.7F62521362L084030L191452M343796M058762K585602K326812L238221L547515
910.4F88897552L971024M178238L169098L513870L356476J778793K599106L261566
918.1G14725723K136917K390442K901688L074341K498474K083893K998123K132339
925.8G34941940J490174K744140K904358J742096J669693J081238l06397J003952J892853
934.5G49164047J443634J611023J398010M01078N24444K283554K148362J212158Q71353
943.2G61057663N5237k44446L30963Q73108Q89282L60108j14518J03913K72140J076889
$$ plain form
885.3 634467812 633494072 632582893 632106056 631155586 631808281 633184433 634148521 634903679 636355782
894 636355782 639077187 641820755 644936447 647822266 650636368 653185654 655363007 658701019 662521362
902.7 662521362 665605392 668796844 673140640 677199402 679785004 682111816 685350037 688897552
910.4 688897552 692868576 697046814 700215912 703729782 707086258 708865051 711464157 714725723
918.1 714725723 716862640 719253082 722154770 725229111 727727585 729811478 732809601 734941940
925.8 734941940 736432114 739176254 742080612 743822708 745492401 746573639 746267242 747271194 749164047
934.5 749164047 750607681 752218704 753616714 754017792 754542236 756825790 758974152 760186310 761057663
943.2 761057663 761112900 760868454 761199417 762072525 762961807 763321915 763207397 763311310 763583450 764660339
952.8G64660339J044388O26755J020431N58167K06375p18079n84335q0795k09656N50232
962.5G67073822L50418l7002j09330M18473O65130O75507K51541k79007N52521j35346
972.1G69426727n36270l95813N6153M15573m26178K3269O7902K42615M15573M84314
981.8G69773865P76138P49359L07999p51267K40097L3112m67911k46506p12432K76947
991.4G69979401j9837K73819J300965P83233O15769O27136l20053o39801J76468K18353
1001.1G72995453M88052k71835o29044l23867m74701k89231n30014J028595J125107
1009.7G73118515M49600O64597K69165M33883l92684q13675j061783l9368L35236o57883
1019.4G72305603l29666l49655O85806J117706N27573m76837n5084Q84018l67661p04041
$$ plain form
952.8 764660339 765704727 766331482 767351913 767910080 768116455 767398376 766814041 766733246 766523590 767073822
962.5 767073822 767424240 767387238 767277908 767696381 768361511 769037018 769288559 769009552 769562073 769426727
972.1 769426727 768890457 768494644 768550797 768966370 768540192 768563461 768631363 768873978 769289551 769773865
981.8 769773865 770550003 771299362 771607361 770856094 771096191 771129303 770661392 770414886 769702454 769979401
991.4 769979401 769959564 770233383 771534348 772317581 772933350 773560486 773240433 772600632 772777100 772995453
1001.1 772995453 773483505 773211670 772582626 772258759 771784058 771494827 770964813 771993408 773118515
1009.7 773118515 773568115 774232712 774501877 774935760 774543076 773729401 772667618 772628250 772963486 772305603
1019.4 772305603 771975937 771626282 772312088 773429794 773957367 773480530 773425446 774309464 773941803 773237762
1029G73237762j567611j091233j69906j80283L55835J40228K30332l28903m57840k05765
1038.7G69962616k71454r10721q12607j26190n13458l68042j048813l83377r3231m9515
1048.3G65385208J064682N99060R42764O96335R42841J056442L69492k61231q78372
1057G69917221P4081J40610L9673n09872L96194L82385m23736P70492K62299R79614
1066.6G72028961O59256M73557N97534o58951o18210j78985O85806q49152j05667K30103
1076.3G72264252l16773J588440J80283q2474M70200J63192n19790m51737L6927q15278
1085.9G72517242l13949O93588J302414j079559r70230P64923j66779l70254n17044
1094.6G71860352J426696Q17108r14535o54068O7444L52325j505203j329193p53479
$$ plain form
1029 773237762 771670151 770578918 770409012 770228729 770584564 770724792 770955124 770626221 770168381 769962616
1038.7 769962616 769691162 768780441 767967834 767841644 767328186 766960144 765911331 765527954 765434723 765385208
1048.3 765385208 766449890 767048950 767991714 768688049 769630890 770687332 771056824 770795593 769917221
1057 769917221 769991302 770131912 770171585 769661713 770057907 770440292 770016556 770787048 771049347 772028961
1066.6 772028961 772688217 773161774 773759308 773100357 772482147 772303162 772988968 772139816 772034149 772264252
1076.3 772264252 771947479 773535919 773716202 773633728 774103928 774267120 773747330 773295593 773332520 772517242
1085.9 772517242 772203293 772896881 774199295 773119736 772149506 772914429 772747650 772377396 771860352
1094.6 771860352 773287048 774104156 773189621 772535553 772602997 772955322 771450119 770120926 769367447
1103.3G69367447P41882P88346l24097J03912n28564m37241r66644L72085L09067j083450
1112.9G68342743l57208n87845j18561n79300l07312l41339m28696M00620l43628L18527
1122.6G65998001O18515L82080j37787p11212l77045j19018j18027j06201L46603l39431
1132.2G65436478O1569J64719n73502M42200J459961J355133r9793p46765l48053Q65631
1141.9G68017578M16794o32935o1111p09381m06647p6980m0207M43725R28726K79694
1151.5G68159256j021957j22986J59073P4234l80555L26615K18200j480941K93045
1160.2G66223984L31802p33948k79541P00531P52182q01239p23800K670O25229k29
1169.8G66097641l55377q67844j149521L70484N07049M21448j39236k76413j65482
$$ plain form
1103.3 769367447 770109329 770897675 770573578 770677490 770148926 769711685 768745041 769117126 769426193 768342743
1112.9 768342743 767985535 767397690 767279129 766699829 766392517 766051178 765622482 766023102 765679474 765998001
1122.6 765998001 766616516 766998596 766860809 766149597 765772552 765653534 765535507 765429306 765775909 765436478
1132.2 765436478 765498047 765662766 765089264 765531464 766991425 768346558 768246765 767500000 767151947 768017578
1141.9 768017578 768434372 767801437 767740326 767030945 766624298 766547318 766507111 766950836 767879562 768159256
1151.5 768159256 767137299 767014313 767173386 767247620 766867065 767193680 767411880 765930939 766223984
1160.2 766223984 766555786 765821838 765542297 766242828 766995010 766193771 765469971 765472641 766097870 766097641
1169.8 766097641 765742264 764874420 763724899 764095383 764602432 765023880 764884644 764608231 764442749
1178.5G64442749J74255P18079m47083m91485n12695o59409j59531M53720l09829j031418
1188.1G62177353J09634J77613K44293l55759Q7280N72281l28140L7537n59693l47595
1197.8G61814804K67944L41950o72760j219711O05239N84412J40686l1357k29187N341
1207.4G61607361J15967P7972j67007k36664r69010p02896k93274j37863q621o2943
1217.1G59223022k51541o70318N76629O47812j06964o75659q98972m6310L4637J49308
1226.7G57981644l93524l88642k40021n70602k47726J33056K27509n96466k46659j49002
1236.4G55509567k41852j39617m67301J56174l53699q36563p90176k10343J72730k51999
1246G52546921l67050p50199m25262j88217K51541L9749m72794p6370k51999j85394
$$ plain form
1178.5 764442749 764617004 765335083 764888000 764396515 763883820 763224411 763064880 763518600 763208771 762177353
1188.1 762177353 762286987 762464600 762708893 762353134 762440414 763012695 762684555 762722092 762162399 761814804
1197.8 761814804 762082748 762424698 761751938 760532227 761137466 761721878 761862564 761831207 761602020 761607361
1207.4 761607361 761723328 761801300 761634293 761397629 760428619 759725723 759432449 759294586 759285965 759223022
1217.1 759223022 758971481 758301163 758877792 759525604 759418640 758742981 757844009 757797699 757832336 757981644
1226.7 757981644 757588120 757199478 756959457 756388855 756141129 756274185 756501694 755905228 755658569 755509567
1236.4 755509567 755267715 755128098 754660797 754816971 754463272 753626709 752836533 752626190 752798920 752546921
1246 752546921 752179871 751429672 751004410 750816193 751067734 751107483 750634689 750558319 750306320 750120926
1255.7G50120926n83191r83658j239014p28454K54364J96457K48108q3084m52958l85742
1265.3G46363754k98309p87659k29187M86832k81143k72064p77436p54547k44598k41852
1274.9G42963791k36664l97873N6534j30463m8141N5466j36033j74789m22440m97665
1284.6G41031723q53500n58472o17828q55179l58429M98504M71726m74930m57916m20227
1294.2G37405472j79138J15890m29611K8000K528686N66254l146591j206894o57425
1302.9G35024643k66342P8888q48465o6147n01862m7531o6910k14691k22854o70548
1312.5G32198181m62646p28073K99682n21774n93109L52173l66288q0795r8877J16120
1322.2G30114594Q2855L25851J20545j23673k16217p17316k04620n85937l12119l82462
$$ plain form
1255.7 750120926 749537735 748554077 747315063 746586609 746840973 747037430 747285538 747202454 746749496 746363754
1265.3 746363754 746065445 745277786 745048599 745535431 745254288 744982224 744204788 743450241 743205643 742963791
1274.9 742963791 742727127 742329254 742385788 742255325 742207184 742262650 742126617 741951828 741529388 741031723
1284.6 741031723 740178223 739619751 739001923 738146744 737788315 738286819 738758545 738283615 737825699 737405472
1294.2 737405472 737226334 737342224 736912613 736940613 739469299 740035553 736888962 735682068 735024643
1302.9 735024643 734758301 734837189 733988724 733922577 733420715 733373184 733306274 733091583 732868729 732198181
1312.5 732198181 731735535 731007462 731307144 730785370 730192261 730544434 730178146 730097351 729998474 730114594
1322.2 730114594 730197449 730523300 730643845 730520172 730303955 729586639 729382019 728796082 728483963 728101501
1331.8G28101501j88827L88641J06888L69187k36512k65503j174240j172180K58255
1340.5G26187210M35028N66254l09220j19400o2789J65481n340l68577R4376k56348
1350.2G26326675L68195l2043k14921k73818m06723q8807l96728k01111o34079L51105
1359.8G24797745o15769j157531K18582j003418J378479J369018N6076k35748j065903
1368.5G23741531n80215K81143j3809l84369o10428k152099l78495J287613R82514
1377.2G22173386K88238n00793R8114n31311K38647J89819n99441l47061o83518o75506
1386.8G19650574k460861P13729J536637n0278K16827M77829M25339k205353j923065
1395.5G16381378N71137Q25882K68402j842499L40652J003418K44904p3471k82593
$$ plain form
1331.8 728101501 727912674 728301315 728408203 728777390 728540878 728275375 727101135 725928955 726187210
1340.5 726187210 726622238 727188492 726879272 726759872 726697083 726862564 726857224 726488647 726583023 726326675
1350.2 726326675 726694870 726662827 726447906 726174088 725767365 725678558 725281830 725080719 724446640 724797745
1359.8 724797745 724181976 723024445 723243027 722239609 723618088 724987106 725043182 724807434 723741531
1368.5 723741531 723161316 723442459 723428650 723044281 722433853 720281754 719903259 721190872 722173386
1377.2 722173386 722461624 721960831 722058945 721527634 721766281 721956100 721356659 721009598 720326080 719650574
1386.8 719650574 717189713 717903442 719440079 719389801 719606628 720084457 720509796 718304443 716381378
1395.5 716381378 716952515 717778397 718046799 716204300 716544952 717548370 717793274 717719803 717437210
1404.2G17437210j944046k51236J635590O2866J51825j19934l98789q18863o26220
1412.8G15128403P44629m64478l88946j144333o59790O05163l971405P54471K607727
1421.5G13211441J238709p50046j691361N36576R28192n58319m45938m63639k269592
1430.2G09736023K02179R81827k8534l69797M71878O01959m822464J59760K795181
1438.9G09728012J044388n35431o28815l64990l9291l88794p48062O07605p77436k233200
1448.5G05663986R73511J561508J59073j342545k03247j4572m64782q06809o259766
1457.2F99266357l709030L447647L922501K283707N98526k6932R00802l573989j841431
1465.9G01268158K339172N89066J58691l02810O35528j761246o115112n0812K520371
$$ plain form
1404.2 717437210 715493164 715241928 716877518 716940384 717092209 716972275 716573486 715754623 715128403
1412.8 715128403 715873032 715408554 715019608 713875275 713215485 713820648 709849243 710603714 713211441
1421.5 713211441 714450150 713700104 712008743 712545319 713473511 712915192 712469254 712005615 709736023
1430.2 709736023 709938202 710920029 710891495 710521698 710993576 711595535 706773071 706932831 709728012
1438.9 709728012 710772400 710236969 709608154 709243164 709203873 708815079 708067017 708674622 707897186 705663986
1448.5 705663986 706637497 708199005 708358078 707015533 706812286 706797714 706332932 705526123 699266357
1457.2 699266357 695557327 699004974 702927475 705211182 705809708 705782776 706683578 703109589 701268158
1465.9 701268158 703607330 704196396 704355087 704052277 704687805 702926559 696811447 696760635 699281006
1474.6F99281006L170013k497558o08597K452469N87768L96042j805496p29218P58210
1483.2G01004639l68195p11670J05438j153488k201690J686706j890106k617645K433548
1491.9F96287537J985626N37872R3460m20227n911789K320099J062317k535171J973190
1500.6F95392914K25525o07071J05438J162262Q79822p303086p160492K172547L781357
1509.3F88649216J379165K713623N99900j412125J422653o45904q68531l042602l462906
1518F85332489M351959L019486m088440o300278J792297L862610K055130k502060N97916
1526.6F88121109J450577j467362O26984J301498j87606O7977j800460n054322K699128
1535.3F85757523K436370J056595J240998p343674j0846634O610565L871536j331100
$$ plain form
1474.6 699281006 702451019 699953461 699344864 701797333 702385101 702781143 700975647 700246429 701004639
1483.2 701004639 700636444 699924774 700030212 698876724 696675034 698361740 696471634 693853989 696287537
1491.9 696287537 698273163 698811035 698904495 698484268 692572479 694892578 695954895 693419724 695392914
1500.6 695392914 695618439 695011368 695116806 696279068 697158890 689855804 682695312 684867859 688649216
1509.3 688649216 690028381 692742004 693341904 691929779 693352432 692706528 691837997 688795395 685332489
1518 685332489 689684448 692703934 688615494 682315216 684107513 687970123 690025253 687523193 688121109
1526.6 688121109 689571686 688104324 688731308 690032806 689845200 689913177 688112717 683058395 685757523
1535.3 685757523 688193893 689250488 690491486 683147812 672301178 678911743 682783279 681452179
1543F81452179K806015J522217j687317K855072J345749O11114j764831k924652K249145
1551.7F86464691J488266N29785n418014r02405M729843L024750j1328125j3027649
1559.4F65561142Q659515O676331M076614J550904j22376k348404q7280J687622N23224
1568.1F86177292q87299o795883K528381K971955k02103n81283M65927L2043q191299
1576.8F75517731L629760L238831Q6441k39410q33893M23431m23126m48532m31900
1585.5F80519333m76227K15454l27759J8464j171494n93643l47290K64587L40882j081467
1595.1F77360840l62015r22241j21613m97360n75409m81720o20498p8278r81216J53274
1604.7F72873764m54178p87506p30972k22855q17947j278534P26852o89010R7046o32096
$$ plain form
1543 681452179 684258194 685780411 684093094 686948166 688293915 688905029 687140198 684215546 686464691
1551.7 686464691 687952957 688482742 683064728 682162323 686892166 689916916 678588791 665561142
1559.4 665561142 674220657 680896988 684973602 686524506 686402130 684053726 683966446 685654068 686177292
1568.1 686177292 685289993 678494110 681022491 683994446 683792343 683211060 683676987 683709030 675517731
1576.8 675517731 679147491 682386322 682472763 682233353 681399460 681822891 681399765 680951233 680519333
1585.5 680519333 680043106 680258560 679930801 679949265 678777771 678184128 677836838 678101425 678442307 677360840
1595.1 677360840 676998825 676076584 675954971 675457611 674882202 674400482 673779984 673701706 672720490 672873764
1604.7 672873764 672419586 671632080 670901108 670678253 669860306 668581772 669308624 668619614 668716660 668084564
1614.4F68084564J96152M42657q934784L185425K711029P34940n26810L17841J10626
1623.1F66321640m800796J685333J452484J070862j195603j759262J956330N14679
1630.8F65245667J67007p98950O94122L264999p922515k783661L642196K171555J615066
1639.5F65295486J096955L02048N98831m75006O70547J879501l930053l210068Q08105
1648.1F63036346L212815K698364J618652L438034l974609j2232819P051545M220199
1655.9F69068527K470322O30493Q41827P25251K23159R80835o38809k159271J772079
1664.5F73914413K155686n8975M51584P45544m456253m39987K541122J17798J120987
1673.2F76091919L290253q34580m693985K835083K182236R04236n24903k372970J463013
$$ plain form
1614.4 668084564 668280716 668723373 659788589 662974014 665685043 666419983 665893173 666211014 666321640
1623.1 666321640 661520844 663206177 664658661 665729523 664533920 662774658 664730988 665245667
1630.8 665245667 665412674 664613724 665307846 668572845 660650330 657866669 661508865 663680420 665295486
1639.5 665295486 666392441 666694489 667293320 666818314 667488861 669368362 665438309 662228241 663036346
1648.1 663036346 666249161 668947525 670566177 674004211 670029602 657796783 664848328 669068527
1655.9 669068527 671538849 672169342 673011169 673736420 673959579 674940414 674301605 672142334 673914413
1664.5 673914413 676070099 676011124 676462708 677208252 672751999 672312012 674853134 674970932 676091919
1673.2 676091919 679382172 678547592 673853607 676688690 678870926 679775162 679250259 676877289 678340302
1681.9F78340302K661209k075806j0586395L318557N425797K244568r82285N69306
1689.6F78915253r5215Q48999J017227m77905J895599J703873r678498k31323L883972
1698.3F77781982N209198o82449j3958206O238022M584350N59769j117325k4872j123047
1707F77467422R42460K218093l65219j131973P42416J50681K19574k338638k132416
1715.6F75772400K915802j4572p047348L207931L705445J002578J90430l38516n83420
1724.3F78810730N86853r4681o04095j11313R62829k098999j851730K965164J863633
1733F80428391l325654o573791L627396L065033k61231R53903j789245l276520K594757
1741.7F75443039J189346k184524k66648J398468k01873r7580q97217j713791K529678
$$ plain form
1681.9 678340302 681001511 678925705 668339310 671657867 677083664 679328232 678345947 678915253
1689.6 678915253 678820038 679669037 680686264 680208359 682103958 683807831 674129333 673898010 677781982
1698.3 677781982 682991180 682308731 668350525 674588547 679172897 679732666 678615341 678590469 677467422
1707 677467422 678409882 680627975 680262756 679130783 679873199 680023880 680243454 677904816 675772400
1715.6 675772400 678688202 678673630 671626282 674834213 678539658 679542236 679732666 679394150 678810730
1724.3 678810730 679397583 679302902 678698807 678587494 679550323 677451324 675599594 678564758 680428391
1733 680428391 677102737 670528946 674156342 677221375 676960144 677914047 676124802 672848282 675443039
1741.7 675443039 676632385 674447861 674181213 675579681 675377808 675280228 674383011 672669220 675198898
1750.4F75198898k92129k447739K522812P14874J25504J147308l001556j72501J101837
1759F74897308p6751R25750l209304j059876K265930R86557k50320J39389J87912l210602
1768.7F71595993J043778K091064j727829l748093j366501L775483J756897j173401
1776.4F72247391J165008O9733j74332k47116j329727O65054O36979L16848j026535
1785.1F72323303j079635J294860J46790k14691O13098r62143m9896k097855j188812
1793.8F68785019K785950R42916j305770J85241J222458q29391j795426J063919m06036
1802.4F70648880k82135J359406L19061K56119P3700p16248N41687M99802j848298
1811.1F70851974l02581J000824J46484j62048l57361M21524j62354l63311N67550
$$ plain form
1750.4 675198898 674906769 672459030 674981842 675696716 675822220 676969528 673967972 673795471 674897308
1759 674897308 674820557 675746307 672537003 671477127 673743057 674729614 674479294 674618683 674806595 671595993
1768.7 671595993 672639771 674730835 673003006 669254913 667888412 671663895 673420792 672247391
1776.4 672247391 673412399 673482132 673307800 673060684 671730957 672396011 673032990 673349838 672323303
1785.1 672323303 671243668 672538528 672685318 672470627 673083725 672121582 672071686 669973831 668785019
1793.8 668785019 671570969 672513885 671208115 671393356 672615814 671786423 669990997 671054916 670648880
1802.4 670648880 670366745 671726151 672045212 672301331 672375031 671658783 672200470 672700272 670851974
1811.1 670851974 670549393 671550217 671696701 671534653 671177292 671598816 671436462 671073151 671640701
1819.8F71640701r6283J05667n13000L58200J163788k905731n01252J374894P19833
1828.5F71346817l3951l926925J032104K409744k6550j8616j31988K90832j00174q11233
1838.1F70030060N56793L41721Q5678p09687N02243P14264n143814R50165K499771
1846.8F69827194l21884k69699O37131K25143k90756K8763j88141n2338J09024k80533
1856.4F69423904R3155k09579k73132J78375J96075l52936k79312k670l75137k69699
1866.1F68129044m89655K09351p67289j517028J105270J005936L75137J12534P9803
1874.8F68243103j82495m67911J1749l0136J1597o7215Q7814m1732j42899k38113n11322
1885.4F66672440O7825o16379L04794L77045k181549M40903J008911l38822L13645
$$ plain form
1819.8 671640701 671544418 671650085 671137085 671495285 672659073 669753342 669252090 670626984 671346817
1828.5 671346817 671312866 667385941 668418045 670827789 670801239 670782623 670650635 670941467 670841293 670030060
1838.1 670030060 670586853 670928574 671014252 670304565 670806808 671521072 666377258 667327423 669827194
1846.8 669827194 669505310 669235611 669872742 670097885 669807129 669835892 669647751 669595413 669704437 669423904
1856.4 669423904 669517059 669307480 669034348 669212723 669408798 669055862 668776550 668773880 668398743 668129044
1866.1 668129044 667639389 667848740 667081451 665564423 666669693 667675629 668050766 668163300 668243103
1874.8 668243103 668060608 667592697 667604446 667574310 667585907 667518692 667606506 667564774 667421875 667183762 666672440
1885.4 666672440 666740265 666123886 666428680 666805725 664624176 665065079 666073990 665735168 666048813
1894.1F66048813J29242o26145j9302N0812l23563k36053j06736K10724N1194j46408
1903.7F65032578l57361l39737L03955m4861j76773j72501q04748N8059Q08945J33057
1913.3F64440613L8605m48151l29895J214599j591568j539688J258850Q5907K32239
1922F63361511o26297q80661P96738L80402n0354l37067K06756O4850o89468p1411
1931.7F62154999k8916k71148J80587K79770J77918J49155l43552m02451l30352M10079
1941.3F61976089l46984k096939J119079J065521p21740p477r5749p5150j9226J92185
1951F60989609q240m45328K0142J12457j3428k15683m9133R7351J65329k12021o21566
1961.6F59819489n9205O8055o1341J22681N6992j096802n31311Q24737J62964k26135
$$ plain form
1894.1 666048813 666178055 665551910 665532608 665583420 665259857 665023804 664917068 665127792 665178986 665032578
1903.7 665032578 664675217 664335480 664639435 664594574 664417801 664245300 663440552 663498611 664307556 664440613
1913.3 664440613 664479218 664031067 663701172 664915771 663324203 661784515 663043365 663129272 663361511
1922 663361511 662735214 661854553 662651291 663031693 662981339 662644272 662851028 662915878 662226410 662154999
1931.7 662154999 662126083 661854935 662035522 662315292 662493210 662642365 662298813 661896362 661566010 661976089
1941.3 661976089 661629105 659532166 660651245 661716766 660995026 660987549 660891800 660816650 660797424 660989609
1951 660989609 660981369 660536041 660556183 660668640 660655212 660439529 660390396 660487747 660653076 660441055 659819489
1961.6 659819489 659760284 659828339 659766998 659889679 659946671 658849869 658318558 659143295 659306259 659080124
1971.2F59080124j20087J45645j95083k93350K84423J14594j57395p10144k14004N20859
1980.8F58455582L55911M7226j63040m4403m19617l01666n9433l19901l25393N40771
1990.5F57766037L21045j647949m60511O44761M00466J92643j27869K22397k07214
1999.2F57103806l69492q0261k07444j79672Q5678K29569L81O0654j29852k10190k17362
2009.8F56085815j06887j03302k85111N0583j46561M8752k98233o81686L59573M10462
2019.4F55333405n2338l86276j32904R2926K4185J4953l90625l68576q1558K58408
2029.1F54311600l1281j39160M8370l43856P1182J89285j24740J62735J46942l98865
2038.7F53892212m44870J068j75934k78396p5150J4343J00327k0447k93274j08414
$$ plain form
1971.2 659080124 658960037 659105682 658910599 658617249 658901672 659016266 658858871 658148727 657934723 658455582
1980.8 658455582 658811493 658858719 658695679 658651276 658231659 657929993 657870560 657550659 657225266 657766037
1990.5 657766037 658087082 656439133 655978622 656623383 657023849 657216492 657088623 657311020 657103806
1999.2 657103806 656734314 656654053 656446609 656266937 656352615 656582184 656582565 656643219 656513367 656303177 656085815
2009.8 656085815 655978928 655875626 655590515 655641098 655494537 655543289 655245056 654563370 654922943 655333405
2019.4 655333405 655281067 654894791 654761887 654854813 654878998 654893951 654503326 654134750 654053192 654311600
2029.1 654311600 654280319 654141159 654189529 653845673 653916855 654106140 653981400 654144135 654291077 653892212
2038.7 653892212 653447342 653448410 653272476 652994080 652918930 652933273 653033600 653013153 652719879 652611465
2048.4F52611465K81525K6169p8049N5619j38855l79181k62223l967j73645k69012
2058F51669846m8447J04752j0682j37634j54343n3405k14920l94287K46887K09961
2067.6F51217728l64609k73438q0642j98593j28403L36914R7961m26559l32794K26822
2077.3F50074387L95813n5771l40348j75323K58789j12610j62201J14823k24610k66037
2086.9F49506912l53546j9913O9123j86463j526K60544J98670k80686p3929k22244
2096.6F48896942k23083P0037l27835k71988k13546J61895L10975J30691N0125k97775
2106.2F48286438k63443j31302K01645o7825l35617j5717j41601k08664n6611L23639
2115.9F47590942J38169m120J10321j62811j81961m15879l16162P858P3700J17875
$$ plain form
2048.4 652611465 652892990 652919159 652841110 652896729 652757874 652378693 652116470 652112503 651938858 651669846
2058 651669846 651621399 651726151 651715469 651577835 651423492 651370087 651155167 650760880 651007767 651217728
2067.6 651217728 650853119 650579681 650499039 650300446 650172043 650508957 650606918 650180359 649847565 650074387
2077.3 650074387 650470200 650414429 650074081 649898758 650157547 650044937 649882736 649997559 649772949 649506912
2086.9 649506912 649153366 649133453 649202576 649016113 649014587 649275131 649473801 649193115 649119186 648896942
2096.6 648896942 648673859 648743896 648416061 648144073 647930527 648092422 648403397 648534088 648584213 648286438
2106.2 648286438 648022995 647891693 648093338 648025513 647689896 647674179 647532578 647323914 647267303 647590942
2115.9 647590942 647729111 647724991 647835312 647672501 647490540 647074661 646758499 646766357 646840057 646957932
2125.5F46957932l2197k21557l93982J5716L46756N0812l7994q3313l62244r0561J34735
2136.1F46284103k32467j84479k51007K6245M25873L0365o5232q0108j98136k94418
2145.8F45460739o4850J09024j05133K13394J04294m27780l38898L3722m8294k06451
2155.4F44729767K01645J87225j20468k19650k90070j99737J13067L87650j12763n99899
2165F44076767j91574K36664J31836p1030j41296j47706j1978K4643j19629k19650
2174.7F43567047j04141R3460K19498K52914j00098k44751R2545l2654m46701k77481
2184.3F43019638M5624j984L7918j05285j51062K28729J07193k3728p2555j88522J52587
2194.9F43048553n8593m11606P0419K43759j37024j95083m9362k9450q2245j65634
$$ plain form
2125.5 646957932 646925735 646704178 646310196 646325912 646672668 646723480 646685486 646602173 646239929 646149368 646284103
2136.1 646284103 646051636 645867157 645616150 645642395 646068268 646098633 646033401 645953293 645755157 645460739
2145.8 645460739 645395889 645504913 645399780 645613174 645717468 645289688 644950790 644984512 644936218 644729767
2155.4 644729767 644931412 645118637 644998169 644778519 644488449 644288712 644401779 644789429 644676666 644076767
2165 644076767 643885193 644121857 644253693 644182663 644041367 643893661 643881683 643906326 643786697 643567047
2174.7 643567047 643462906 643556366 643775864 644028778 643928680 643683929 643776474 643743820 643297119 643019638
2184.3 643019638 643065262 643063278 643101196 642995911 642844849 643073578 643180771 643157043 643084488 642895966 643048553
2194.9 643048553 642989960 642578354 642648773 642892532 642755508 642560425 642511063 642481613 642399368 642233734
2204.6F42233734o8130J17416J31989j34354n6381J25808l07769j95694l7995j72348
2214.2F41636276j81503l98789Q3542K27280l7918J9226k56577r0789k4491k17666
2223.9F40758591N2337K58255J60218k9374j86691l28140k91061j94550J44119L19901
2233.5F40663605r1324k99988j70135j10245j45493K0523l776o6643l2005k37770p4921
2244.1F39451828M7989j45874j75247R2659J09634k89917k17476m5547l0251J16730
2253.8F38914528J81999P5150L852N1995q1940k66914j95809J20278P7934j26991j56250
2264.4F38597832k04926k861K3079q9950j107j12686j54762J56326q4686j87912M59785
2275F38398132J21422n86891l00102K02102m921N608K6207l74565m4518k09198n3596
$$ plain form
2204.6 642233734 642165604 642283020 642415009 642280655 642224274 642350082 642042313 641846619 641808624 641636276
2214.2 641636276 641454773 641055984 641139526 641366806 641328888 641348114 641091537 641000748 640976257 640758591
2223.9 640758591 640810928 641069183 641229401 641200027 641013336 640685196 640394135 640199585 640343704 640663605
2233.5 640663605 640572281 640272293 640102158 639991913 639846420 639866943 639863167 639796524 639764519 639526749 639451828
2244.1 639451828 639499817 639353943 639178696 639271355 639380989 639091072 638873596 638828049 638797798 638914528
2253.8 638914528 639096527 639171677 639175529 639227524 639145584 638878670 638682861 638803139 638881073 638754082 638597832
2264.4 638597832 638392906 638390045 638413124 638323174 638322067 638209381 638054619 638210945 638126259 637938347 638398132
2275 638398132 638519554 637932663 637632561 637834663 637829742 637835350 637861557 637486992 637442474 637233276 637179680
2285.6F37179680K58026m7302J53045j79023j26877k39716m12407j05819J13983N54733
2295.2F37148323m9095k99835k14615j93825l54881m94347J47667l3150R3766L1471
2304.9F35781479M4670j57318m54064J51101j12458N85022P5417n21431m70085p28417
2314.5F34193916P71065N722o15730n91011k84462L63769O6109P51381m83284k96936
2324.2F33880539j32752m20112J24664n60264J98822k26365j15280J10245m5395q80050
2333.8F31934052o65246J375695m41132l43475P0495p06443K26745J200295J009178
2342.5F33660164q08716r00154j730499o22483K99836Q54988J912613O48765m6539
2351.2F33267975k68517p0610j47094j008759L9291n66177J72691n93681k67143L17688
$$ plain form
2285.6 637179680 637437706 637390404 637543449 637364426 637237549 636997833 636585426 636479607 636593590 637148323
2295.2 637148323 637099228 636799393 636584778 636390953 636036072 635541725 635689392 635656242 635750008 635781479
2304.9 635781479 635826149 635668831 635214767 635365868 635253410 635838432 635913849 635392418 634922333 634193916
2314.5 634193916 634964981 634970703 634354973 633763962 633479500 633843269 633909378 634660759 634177475 633880539
2324.2 633880539 633747787 633327675 633452339 632892075 633090897 632864532 632749252 632859497 632814102 631934052
2333.8 631934052 631268806 632644501 632203369 631859894 631930389 631223946 631450691 632650986 633660164
2342.5 633660164 632851448 631951294 630220795 629598312 629898148 630753136 632665749 633314514 633267975
2351.2 633267975 632999458 632928848 632781754 631772995 631812286 631246109 631418800 630825119 630557976 630875664
2360.8F30875664j452675q64258p43523P04689N88685J48773M32052N42679K91672
2369.5F30523758q06885m63447k84996K08396M68789O17523J88103k46621M96979L09296
2379.1F31010895K63786N9090j93672J08490J81846L27721K46506Q1138l28178k56539
2388.8F31501083J92719p1488m64744k56539L77236K23274j41525k52037j09902L10479
2398.4F31308556R3994j12648j34354l26195q2321J54915k80151j03188K95067j77345
2408.1F30636330k69242J26801L09524j57089k49595J28746q7395j8959j67771m47464
2417.7F29803886L3760J53389j52320p8736n7220j33896j80512J6327N07012J06849
2427.3F30018539l28178j96609p4006J0605k55508k61803m387J99662J4114j22185
$$ plain form
2360.8 630875664 629422989 628558731 627815208 628519897 629108582 629257355 629689407 630232086 630523758
2369.5 630523758 629716873 629253426 628968430 629176826 629645615 630263138 630451241 630204620 630701599 631010895
2379.1 631010895 631274681 631333771 631140099 631248589 631430435 631758156 632004662 632085800 631757622 631501083
2388.8 631501083 631693802 631622314 631157570 630901031 631278267 631501541 631360016 631107979 630998077 631308556
2398.4 631308556 631402550 631289902 631155548 630829353 630747032 630901947 630621796 630518608 630813675 630636330
2408.1 630636330 630367088 630493889 630803413 630646324 630396729 630525475 630438080 630419121 630251350 629803886
2417.7 629803886 629837646 629991035 629838715 629759979 629702759 629568863 629388351 629404678 629911690 630018539
2427.3 630018539 629690361 629493752 629419746 629430351 629174843 628913040 628908653 629108315 629122429 629000244
2437F29000244r2468p5874K51846m5433j76659j79214l14331j1406J68152J21498K5634
2447.6F28671989J48735l85665m19388O256Q3275M81643j9302l59497k93160J14403
2457.2F28029289K68097m43687l48931p7591J51635N3596J40114J84898k10075j14327
2466.9F27633018k12821M6920k5139j72691K709r1553l0937l3303K27890J28174J3008
2477.5F27485275l22189m28162L6660J678J47553j43090k33955k28424q7242J12991
2487.1F26341095k74467J56784l1815l22113n8785J26267J05095m01650j28173k6513
2496.8F25485725j18370j26190q6479L59001L24249n8212k58064r6359N2452L08342
2506.4F25786095r3918l17917O9122k45094j15585j73417q7509J26763k61231r2964
$$ plain form
2437 629000244 628907776 628831902 629083748 629038315 628861656 628682442 628368111 628356705 628524857 628646355 628671989
2447.6 628671989 628820724 628435059 628015671 628021927 628105202 628586845 628567543 628208046 627914886 628029289
2457.2 628029289 628297386 627853699 627504768 627427177 627578812 627632408 627772522 627957420 627747345 627633018
2466.9 627633018 627420197 627467117 627441978 627269287 627271996 627180443 627149506 627116203 627344093 627472267 627485275
2477.5 627485275 627163086 626734924 626771584 626773262 626920815 626777725 626543770 626315346 626228104 626341095
2487.1 626341095 626066628 626223412 626191597 625869484 625810699 625936966 626042061 625640411 625512238 625485725
2496.8 625485725 625367355 625241165 625154686 625513687 625837936 625779724 625521660 625425301 625477753 625786095
2506.4 625786095 625692177 625374260 625443382 625198288 625082703 624909286 624821777 624948540 624687309 624594345
2516.1F24594345j08032k26860J86653L83186k16369l78189k43035j64451K57682N4474
2525.7F24139404K8878n036l5629j13297l44429J01433K01416Q0986p6599P668o0196
2536.3F23924599j69640J04523j67122k92320k36397K60734L51258P7286P8659m15688
2546F23515892o4201J74141q355J03074k48528o03905m06303k6360q0986Q7090N8975
2556.6F22500534j35307j45912J51481N78308k823k82669k49900j29052P6294O2371
2566.2F22423325J84211m20913k84119J06010n05256l30315K64931K56119J63765J21879
2575.9F21979637o0768M9057j17836k69661l2043j63803J11732L01819j23863k13318
2585.5F21460953j72501k90108k77938j18103K12287L15819J14403l3455m00848l39127
$$ plain form
2516.1 624594345 624486313 624259453 624446106 624829292 624612923 624234734 623991699 623827248 624084930 624139404
2525.7 624139404 624168282 624163246 624127617 624014320 623669891 623771324 623972740 624053726 623977127 623984795 623924599
2536.3 623924599 623754959 623859482 623692360 623400040 623163643 623424377 623775635 623852921 623931580 623515892
2546 623515892 623451691 623625832 623617477 623720551 623472023 622868118 622461815 622435455 622354469 622441559 622500534
2556.6 622500534 622365227 622219315 622370796 622949104 622946281 622663612 622413712 622284660 622360954 622423325
2566.2 622423325 622607536 622186623 621902504 622008514 621503258 621172943 621437874 621693993 621857758 621979637
2575.9 621979637 621918869 621967926 621850090 621580429 621548386 621384583 621496315 621798134 621674271 621460953
2585.5 621460953 621288452 620998344 620720406 620602303 620814590 621130409 621244812 621211357 620810509 620471382
2595.1F20471382L6965R9449J32599R8877r1553p8049K05574k51083j66588M04625
2604.8F20862198O9122k48031m87137j07270J05668M3563M6540l33176k3041K24152
2614.4F20152588Q5525k04429n9853k34794m70314N88912K46048k23388M0016l21541
2624.1F19598770k4223J50490o3744p6218j19247k05917J71318K63443k59934m19426
2633.7F19015312k66609K39983K60963r3346k14042k49748K9411J74217j00632p934
2643.4F18787575M03442j08490l06320J3351O2294n8021k43149K17438j30196l69873
2653F18268051q2550j4419L72695q8310k92396k12097q5145K18316J28250N4588l45001
2663.6F17921982k36016l5057r8152M2877J77651J34659j12877k90756n47867j12686
$$ plain form
2595.1 620471382 620508347 620607796 620740395 620839272 620747719 620669670 620875244 620624161 620457573 620862198
2604.8 620862198 620931320 620683289 620196152 620088882 620194550 620238113 620284653 619951477 619928436 620152588
2614.4 620152588 620238113 620033684 619973831 619739037 619268723 619857635 620103683 619880295 619920311 619598770
2624.1 619598770 619574547 619725037 619661293 619585075 619465828 619259911 619431229 619694672 619434738 619015312
2633.7 619015312 618748703 618988686 619249649 619156303 618942261 618692513 618721924 618896141 618795509 618787575
2643.4 618787575 619191017 619082527 618776207 618789558 618851852 618793831 618550682 618768120 618637924 618268051
2653 618268051 618185501 618171082 618543777 618455467 618163071 617950974 617865829 618084145 618212395 618266983 617921982
2663.6 617921982 617685966 617650909 617552757 617595634 617773285 617907944 617795067 617504311 616956444 616843758
2673.3F16843758J94015K87132K92664r3994J09138R842K32620L20511j64871j89476
2682.9F17841339l21998n72739m98963L41149M11606j99128n78155k83814N63012n6458
2692.5F16645851l41835J16119o1950j28784L5362j19133l38707J73187K83852K47841
2702.2F16511803Q2016l58925l63236l12652k8382n2375L56636L75023l46947j12839
2711.8F15750122k0981j04255o7406L3531j49803l57170L0212K03209M30031K26707
2721.5F15974197k08320K5558J76659k31972m85840k74925k40631R2201L91121J40419
2731.1F15358467j53808l28522k2812K09885o3668q9378L5858j24283j98250j15585
2740.8F14507904K64244L88756r4872l35998k31056M6806r4109k00233p0915J6212
$$ plain form
2673.3 616843758 617037773 617324905 617617569 617523575 617632713 617642555 617875175 618195686 618030815 617841339
2682.9 617841339 617519341 616946602 616447639 616788788 617200394 617001266 616423111 616139297 616702309 616645851
2692.5 616645851 616304016 616420135 616358185 616229401 616264763 616145630 615806923 615980110 616263962 616511803
2702.2 616511803 616593819 616234894 615871658 615559006 615530624 615478249 615834885 616209908 615862961 615750122
2711.8 615750122 615729141 615624886 615557480 615591011 615441208 615084038 615114250 615317459 615747490 615974197
2721.5 615974197 615765877 615791435 615968094 615736122 615250282 614975357 614734726 614826927 615218048 615358467
2731.1 615358467 615204659 614876137 614853325 615063210 614999542 614910164 614946022 614821739 614623489 614507904
2740.8 614507904 614772148 615160904 615066032 614730034 614498978 614545784 614451675 614251442 614180527 614196739
2750.4F14196739L51219N1194k50855j69411J20507J96113k31971P8392J90506k57302
2760F14275131m67720o6871L75022j44729l23601r8534j00746j1558J39007J88561
2769.7F13763962L7346j5793k06223k78511L3226n0049o7024M72450L46261l00675
2779.3F13734970m64935l24402k25525j07002K47574M30717L98483l35960p64160J33323
2789F12723083K89994K07329K48222k69241m89350k31781J63689O6261r4375j8883
2798.6F12594948K83432n5390o49070j01662J37405O2371R384q354J22490J91879J84517
2809.2F12771950n70526o42395J47514M69208j1101k63939J27335j28670p5340j1940
2818.9F11812096j54000R6093k060j71814j14441K24304J24397k07786m49295j9494
$$ plain form
2750.4 614196739 614547958 614599152 614348297 614178886 614299393 614495506 614263535 614341927 614532433 614275131
2760 614275131 613807411 613740540 614115562 613970833 613647232 613548698 613447952 613436394 613575401 613763962
2769.7 613763962 613801308 613785515 613579292 613300781 613334007 613283958 613216934 613689384 614035645 613734970
2779.3 613734970 613270035 612945633 612720108 612613106 612860680 613291397 613689880 613353920 612589760 612723083
2789 612723083 613013077 613220406 613468628 613199387 612710037 612478256 612641945 612708206 612613831 612594948
2798.6 612594948 612878380 612822990 612173920 612072258 612209663 612272034 612281418 612273064 612395554 612587433 612771950
2809.2 612771950 612201424 611559029 611706543 612175751 612164650 611900711 612028046 611899376 611824036 611812096
2818.9 611812096 611658096 611754189 611752129 611580315 611465874 611690178 611814575 611606789 611157494 611138000
2828.5F11138000M50593k11220J04561P2021k22244M69093Q4496L1280J97296l30314
2838.2F11783562l99666p25L10822K75497K24876l11279j95732M38538O4163L15666
2847.8F12505722L20282n27687l31497K2392j1253q736J75819L72696P6599k70538
2857.4F12323799n27458l63274R2659Q6861m58j26762m79355k50359K95716K4605j0109
2868.1F11065865L04298N0354k16904j42402L50456J52283l29476m33578m04435J76774
2877.7F10573235j8197k51007q7928k56005J96991L78304L2768k32506l17688j32866
2887.3F09885101q1939k2583L46450O71387K89383m80385k83699L84293k87132o97976
2897F09722900n1345K5444o1646J04637L36609K37236K30522J12267j46027J03073
$$ plain form
2828.5 611138000 611588593 611377373 611481934 611553955 611331711 611800804 611885300 611916580 612113876 611783562
2838.2 611783562 611383896 611383171 611693993 611969490 612194366 611883087 611687355 612125893 612190056 612505722
2847.8 612505722 612826004 612298317 611966820 611989212 611977959 611969223 612145042 612517738 612594337 612323799
2857.4 612323799 611796341 611433067 611525726 611612587 611612129 611485367 611006012 610755653 611051369 611075974 611065865
2868.1 611065865 611370163 611420517 611203613 611061211 611411667 611563950 611234474 610800896 610396461 610573235
2877.7 610573235 610555038 610304031 610216103 609960098 610157089 610535393 610568161 610335655 610017967 609885101
2887.3 609885101 609803162 609780579 610127029 610798416 611087799 610607414 610323715 610708008 610420876 609722900
2897 609722900 609671555 609696999 609635353 609739990 610076599 610313835 610544357 610656624 610510597 610613670
2906.6F10613670j47667k97470j72424J32484K74506P5302L40462k5177M082M53071
2916.3F11250839L47977o5651n37834K30446N25856l91808m46167K55852M13513M32205
2925.9F12015228Q8082n95932j71166k34947n93758k89802k69814j55563n1689j52436
2935.6F09588203j98364p5416j7777J54419j64413k87552K40326k41852k32849K49557
2945.2F09014282J92795J57318j84440o04630m08440K58980m0092k62490J16768J58196
2954.8F08398247K09656L67851J65100p57103m87633J31302n722N1270j25885l94249
2964.5F07552834n58815j63079j48887Q430M29993K42462J1139o41060k79732l4523
2974.1F06418762l29857r7313L2845K77557j90L21159K11830l42064j41258j47095
$$ plain form
2906.6 610613670 610466003 610168533 609996109 610128593 610403099 610478401 610818863 610793686 610797768 611250839
2916.3 611250839 611598816 611533165 610995331 611225777 611751633 611359825 610913658 611169510 611583023 612015228
2925.9 612015228 612103310 611507378 611336212 611101265 610507507 610217705 609947891 609792328 609740639 609588203
2935.6 609588203 609389839 609314423 609296646 609451065 609286652 608999100 609239426 608997574 608764725 609014282
2945.2 609014282 609207077 609364395 609179955 608575325 608166885 608425865 608385773 608123283 608240051 608398247
2954.8 608398247 608607903 608975754 609140854 608383751 607896118 608027420 608021698 608072968 607947083 607552834
2964.5 607552834 606994019 606830940 606682053 606690483 607120476 607362938 607374077 606733017 606453285 606418762
2974.1 606418762 606088905 605991592 606024437 606301994 606301804 606622963 606834793 606492729 606351471 606204376
2983.8F06204376J297l66592P0839L04680l72239J0338O2866J19553K47803k62795
2993.4F06020126p49817j80130O64711O8131n43366k55050P8316J08451K40326J8425
3003.1F05470123l25737j78718l5591l2540k38952L41873L64723l52631Q393k213m577
3013.7F05014153J66549j81198k96440l42903k25754J03722q2054j83983J86233R766
3023.3F04168091K01950J88179l64838q0070j79100p897J83106l02048o2675l3989
3033F03710709k70996j24512K88429K86484m03214l13491p8736l27988j12304Q5487
3042.6F02739868J61934J53542J7051j06620m22364k20909J87988J51368k11640m55780
3052.2F01994438Q316K22550j831l52478m61235J29470K42310J95885M94613R880l91349
$$ plain form
2983.8 606204376 606205673 605839081 605909920 606214600 605842361 605852699 605915565 606035118 606282921 606020126
2993.4 606020126 605270309 605090179 605754890 605823021 605279655 605024605 605102921 605211372 605451698 605470123
3003.1 605470123 605144386 604965668 604930077 604897537 604658585 605000458 605365181 605012550 605020943 605018730 605014153
3013.7 605014153 605180702 604999504 604703064 604360161 604134407 604238129 604156075 603972092 604158325 604168091
3023.3 604168091 604370041 604558220 604193382 604113312 603934212 603926315 604109421 603807373 603744698 603710709
3033 603710709 603439713 603315201 603603630 603890114 603486900 603173409 603094673 602766685 602654381 602739868
3042.6 602739868 602901802 603055344 603072395 602965775 602543411 602322502 602510490 602661858 602450218 601994438
3052.2 601994438 602002754 602225304 602223473 601870995 601409760 601539230 601781540 601977425 602472038 602481918 602090569
3062.9F02090569k71569m85916L33977O36597k56119j88828l48663k61307k58407p7477
3072.5F00912857P33337k4948j46484J49422k86980j83334O256L1967m11453k70272
3082.1F00510368J53122L22419M54826m5395n20935m86717J33590K29874m40865m50935
3091.8E99859352K39182L03840j35269l61671n25589K84843P06482J77498k43416m31709
3101.4E99873543O4850O5612k83203n52215k19040O17065K80419O8855n4283k07978
3111.1E99653625L35808J564m10156j70174k91557k1934J96075j77078k41738Q2589
3120.7E98957024O37130J76125k02675K62337m11835p00073l38631Q9722N51071p8506
3130.4E98941689k87400K96974j32713m65240K64358J6861m0588M10652J52702K16141
$$ plain form
3062.9 602090569 601819000 601333084 601667061 602303658 602047539 601858711 601510048 601248741 600990334 600912857
3072.5 600912857 601646194 601621246 601474762 601624184 601337204 601153870 601160126 601192093 600780640 600510368
3082.1 600510368 600663490 600985909 601440735 601395340 600874405 600387688 600521278 600751152 600310287 599859352
3091.8 599859352 600098534 600402374 600267105 599905434 599379845 599664688 600371170 600548668 600305252 599873543
3101.4 599873543 599938393 600004005 599720802 599168587 598949547 599566612 599847031 599915886 599861603 599653625
3111.1 599653625 599989433 599990997 599580841 599410667 599119110 599097176 599293251 599116173 598874435 598957024
3120.7 598957024 599594154 599770279 599567604 599829941 599418106 598718033 598379402 598469124 599020195 598941689
3130.4 598941689 598654289 598951263 598818550 598353310 598617668 598634529 598593941 599004593 599157295 599373436
3140E99373436l77274o03103l35236k78930M06532M39224L4294m24614j30996O92939
3149.6E98796272N34020N5542Q3923L44353j76163k74315r5634m20075l9863Q5869
3159.3E98893929M5738K81219j16768n88531l44429L53889K92435n56641q5182P76138
3168.9E98951797K48337J55449K56043j09330j18255j02348k05651N570L63731n2147
3178.6E99393196J1749K41928l49159p6523L41645J09100l9902P2365N3444j55830
3188.2E99602013J22184L28370k81792m21791J70822r4528l09296K51198N29175j63765
3197.9E99732590l42408N16778N6037j99661o8664N226L98941m29917l52859N32799
3207.5E99848862Q79860K62374p86247l68385j34163q2130k09656k43721P37686J137733
$$ plain form
3140 599373436 598996162 598393059 598057823 597778893 598185425 598624649 598658943 598234329 598103333 598796272
3149.6 598796272 599330292 599385834 599469757 599814110 599637947 599363632 599267998 598847923 598808060 598893929
3159.3 598893929 598939667 599220886 599104118 598515587 598171158 598525047 598817482 598260841 598175659 598951797
3168.9 598951797 599200134 599355583 599611626 599502296 599384041 599281693 599076042 599081612 599445343 599393196
3178.6 599393196 599404945 599646873 599297714 599221191 599562836 599671936 599632034 599704399 599757843 599602013
3188.2 599602013 599724197 600052567 599770775 599348984 599519806 599425278 599115982 599367180 599896355 599732590
3197.9 599732590 599390182 599906960 599962997 599763336 599694672 599699898 600098839 599668922 599316063 599848862
3207.5 599848862 600728722 600991096 600204849 599836464 599702301 599620171 599410515 599166794 599904480 601042213
3217.2F01042213L97263o21757m06533J49307l10936m83856K00539M97513M02336K19917
3226.8F01086006n24063J26610P16095k31438K33803Q00819l9596j40000r9105r84345
3236.4F00944786o10771M90341K03209j61514L02849J21421j47743M37241j59493k93655
3246.1F01126671O58035L05290j84707k61269J14136L78265k594m28161K8228O18668
3255.7F02352562l03612k86636N72738K13089l12995k0371M05235K4033j93253j07498
3265.4F02343292L17192O18821q40l75251r3384j54763l63807o5727m3030O29310L77770
3276F03189583p37953K68745O14967J16005l58390k61651L02163k36779J15929j18065
3285.6F02894554n44052M84352M08402O86K69089J56212k27471k37312r9983L49274
$$ plain form
3217.2 601042213 601439476 600817719 600411186 600560493 600249557 599765701 599966240 600463753 600866089 601086006
3226.8 601086006 600561943 600688553 601404648 601173210 601407013 602207832 602168236 602028236 601929131 600944786
3236.4 600944786 600334015 600824356 601027565 600866051 601168900 601290321 601142578 601579819 601420326 601126671
3246.1 601126671 601784706 602089996 601905289 601644020 601758156 602136421 602133827 601705666 601733894 602352562
3255.7 602352562 602048950 601762314 602335052 602548141 602235146 602214775 602620010 602644043 602450790 602343292
3265.4 602343292 602660484 603279305 603278465 602903214 602809830 602655067 602291260 602225533 602182503 602811813 603189583
3276 603189583 602451630 602720375 603335342 603451347 603092957 602831306 603133469 602896690 603012619 602894554
3285.6 602894554 602350502 602834854 603243256 603243942 603513031 603669243 603441772 603204460 603104477 603453751
3295.3F03453751L53546l56598l39241J67122M46052Q0414J49880L06816r2545K44713
3304.9F04413910J87530j4534K47155N2261k02751r9945m0283j62392k06795k88963
3314.6F03885193r232l4523j50604J63765k07634l9062M53224K06794j23329j18789
3324.2F04025803N06439J95083p48825m48951K89344N82734M52308P6218m32243l44925
3333.8F04152985K48527R0561l4904K89268L79639r0332n38826K07748K31018m83703
3343.5F04451981J23863M27704l14255l22723L74679L46603K85302J67465n91202q40988
3353.1F04108429k37618O61316K70195n71746q2245N70907N40619L81279J21880p17850
3362.8F05045166j69907O68869k16140m73175p096N7526K30026L20816n11665j99051
$$ plain form
3295.3 603453751 603807297 603450699 603111458 603278580 603724632 603805046 603954926 604261742 604169197 604413910
3304.9 604413910 604601440 604586906 604834061 604886322 604683571 604583626 604543343 604380951 604174156 603885193
3314.6 603885193 603875961 603841438 603690834 603854599 603646965 603607903 604061127 604267921 604144592 604025803
3324.2 604025803 604532242 604727325 603978500 603529549 603818893 604401627 604853935 604930153 604497910 604152985
3333.8 604152985 604401512 604492073 604457169 604746437 605126076 605035744 604496918 604704666 604935684 604451981
3343.5 604451981 604575844 605003548 604689293 604366570 604741249 605087852 605373154 605540619 604949417 604108429
3353.1 604108429 603870811 604532127 604802322 604230576 604148331 604719238 605259857 605641136 605763016 605045166
3362.8 605045166 604875259 605544128 605327988 604854813 604847717 604905243 605135269 605456085 604944420 604745369
3372.4F04745369P35512q9188k99606j5717K25601J65863j12838j41754n86472K38571
3382.1F04865341L52593K52838L37257p10831K57607L97644k50244Q8882J09024N02777
3391.7F06202888m77218q18367L18260M83093K40479j63498K82440N05867N3749l03078
3401.3F06324615q5144O72951j90391n24025L5171l204N95093J58004j90887L15628
3411F07107811J10092l98102n12886j12419k02484M04320O50329N48363L61900j439857
3420.6F06517067m39644P96700k27547j93825K09923O20956K12403q9989K95982o9084
3430.3F07632942l26423N6800J34812L73878O51055K11105L5934o79359l76778L49617
3439.9F08063583K23732k365j314163k1477Q15125J313820J110611l086624q95577
$$ plain form
3372.4 604745369 605480881 605391693 605092087 605076370 605301971 605467834 605354996 605213242 604626770 604865341
3382.1 604865341 605217934 605470772 605808029 605097198 605354805 605752449 605502205 605591087 605700111 606202888
3391.7 606202888 605725670 604907303 605225563 605708656 605949135 605785637 606068077 606573944 606627693 606324615
3401.3 606324615 606239471 606912422 606722031 606198006 606233177 606229973 606825066 606983070 606792183 607107811
3411 607107811 607217903 606819801 606306915 606194496 605992012 606396332 607046661 607595024 607956924 606517067
3420.6 606517067 606077423 606874123 606646576 606452751 606662674 607283630 607496033 607406044 607702026 607632942
3430.3 607632942 607306519 607363319 607498131 607872009 608523064 608734169 608770103 608090744 607713966 608063583
3439.9 608063583 608287315 608284950 606970787 606949310 607764435 609078255 610188866 607102242 606206665
3448.6F06206665J701736P75567K81677n99747J28174M02641J88027k2774K34718M71993
3458.2F09768677k5749J75666l54080K57569J39884l69300P13691P77130N47333q8424
3467.9F11542397p8812k94418l92037J96877j36872N7412l13645k62451K84271j18408
3477.5F10484314J42975O20994N12543J03874p53364j380615M42619J590423P31850
3486.2F12495613M68788m52919n79605N66635K71073l27111j564N07431Q22754M97666
3495.8F14268761p36733q22410K18315K83203K85187J157951N23567j448021j367035
3504.5F12362785O4049P16515Q72955J167793r09691j742172J329041J409263J50071
3513.2F15420609j27564m0321K47879j82534q6860Q1444m97017J95656J367073k41013
$$ plain form
3448.6 606206665 607908401 608683968 608965645 608365898 608494072 608896713 609084740 609061966 609296684 609768677
3458.2 609768677 609742928 609918594 609564514 609822083 609961967 609592667 610306358 611083488 611630821 611542397
3467.9 611542397 611463585 611169167 610777130 610974007 610837135 610894547 610580902 610318451 610602722 610484314
3477.5 610484314 610627289 611248283 611760826 611864700 611111336 609730721 610173340 611763763 612495613
3486.2 612495613 612964401 612511482 611931877 612498512 612769585 612442474 612440910 612948341 613771095 614268761
3495.8 614268761 613532028 612709618 612927933 613211136 613496323 614654274 615177841 613729820 612362785
3504.5 612362785 612426834 613143349 614016304 615184097 614274406 612532234 613861275 615270538 615420609
3513.2 615420609 615293045 615252724 615500603 615318069 615231209 615312653 614815636 615011292 616378365 616137352
3522.9F16137352j423416J30920J090355R70192o64787o51703J19400K89421o2866
3531.5F15934868j7433Q68606L25852J615562L46489k220268K94456K13127m63981
3540.2F16897278J79214N62134L52631Q38623O38466o81267Q01k002525J14975J848869
3549.9F18749199J587715J441002l622437j131210P78923R57031J941262j036377J65863
3558.5F19830971N41343m89006n94215J106300j22642j488075M711074j02386l067513
3567.2F20325851j777839l123970M347534J285438m6157J170387q77o61736q84171
3575.9F20634460J054574q76885J355019R43489j124840R73587L4256p35779q17413
3584.6F21440468M849815P40662o066132M34990m206352K235527L202782J686744m30565
$$ plain form
3522.9 616137352 614713936 614844856 615935211 616905403 616240616 615588913 615708313 615997734 615934868
3531.5 615934868 615917435 616786041 617111893 618727455 619073944 616853676 617148132 617361259 616897278
3540.2 616897278 617076492 617638626 617991257 618829880 619468346 618787079 618787880 616785355 616900330 618749199
3549.9 618749199 620336914 621777916 618155479 617024269 617803192 618760223 620701485 619665108 619830971
3558.5 619830971 620372314 619883308 619289093 620395393 620272751 618784676 623495750 623393364 620325851
3567.2 620325851 618548012 615424042 619771576 621057014 621010857 622181244 622180367 621518631 620634460
3575.9 620634460 621689034 620812149 622167168 623110657 621985817 622959404 622993660 622257881 621440468
3584.6 621440468 626290283 627030945 620964813 621399803 617193451 619428978 622631760 624318504 623887939
3593.2F23887939j015625L176957m767609N55229K777023j297988K483673j626244
3601F24173355j776848P06215P06635L17650J965942J338806m361038L079109l678207
3609.6F22471619l700562Q773308k20337n521698K136917l070183L640137M342041
3617.4F28851242k604103P35512l449707j614304K082901N70374P68623N57632n35812
3626F25362358Q03528Q785362m97818k0282059L090134N409737O525039j06926n339202
3634.7F23750153J186866K617455R16595k115860j4190Q08715M94423j250763j416931
3643.4F24976463J037941J275940M183274m955330n081902P054100M40750o358833
3651.1F22572403n906029N559616M450760L415642M885712j1457100k18125M715653
$$ plain form
3593.2 623887939 622872314 626049271 621281662 621836891 624613914 623315926 625799599 624173355
3601 624173355 622396507 623102722 623809357 624127007 626092949 627431755 623070717 626149826 622471619
3609.6 622471619 618771057 627544365 627324028 621802330 623939247 620869064 624509201 628851242
3617.4 628851242 626247139 626982651 623532944 621918640 624001541 624571915 625340538 625898170 625362358
3626 625362358 626165886 634951248 634453430 614171371 617261505 622671242 629196281 629089355 623750153
3634.7 623750153 624937019 627554474 628471069 626355209 626341019 627149734 627644157 626393394 624976463
3643.4 624976463 626014404 627290344 631473618 626518288 621436386 628490486 628931236 622572403
3651.1 622572403 616666374 622225990 626676750 630092392 634978104 623521004 623302879 628018532
3658.8F28018532l70598M6844j36756O17370p66029j88599j73340j226387L306275
3667.5F29127312J363296k355499q67653j1669426P44896J0166931J1512528K030029
3675.2F40052414k5613632L42865Q982582N018234l858223j008873K777176N43175
3682.9F27235718J76544j536369j357994M283943P445678j1546096o529045J0745735
3690.6F28918114o593895k203636N793151L51372J410294p09229j310501M16985p68433
3699.3F25304222K321091M007149o086235m794350M739570J395569j008682j740341
3707F24137993K254181N228767q800850N149422O491661j6939545K516175M372596
3714.8F24410400P6142L15666K261620J17111m565392J463471O610717m548912o165580
$$ plain form
3658.8 628018532 627647934 627694778 627558022 628175392 627409363 627220764 627047424 625821037 629127312
3667.5 629127312 630490608 628135109 627267456 615598030 616342926 626509857 638022385 640052414
3675.2 640052414 614438782 614781647 623764229 628782463 624924240 623915367 626692543 627235718
3682.9 627235718 627412262 625875893 624517899 628801842 636247520 624701424 618172379 628918114
3690.6 628918114 622324219 620120583 625913734 626265106 627675400 626966171 625655670 626072655 625304222
3699.3 625304222 627625313 631632462 625546227 620751877 625491447 626887016 625878334 624137993
3707 624137993 626392174 631620941 622820091 627969513 634461174 617521629 620037804 624410400
3714.8 624410400 624486542 624802208 627063828 627180939 622615547 624079018 630689735 626140823 619975243
3723.4F19975243O048355J868553j044808n408897j324234L866081Q65517O400909
3731.2F31246719m127731q747444J0683479K714844j0486908m07944J253357j327781
3738.9F20800591L116874K075882n044441N046005J5256615j2000351k5238113J2163925
3746.6F16176987P480545P580299m522362j2903595J5331269n306130j1343918O182251
3754.3F18675346O065827L858948o288796L112068O760979r037705l654785L958817
3762F23450699J582680N44700M291420l170013o477890L215408O579361J409302j0771713
3770.7F20653954J186409L553543K99339P53517p60384N95208P01942K961006p31239
3779.4F29213295q969536K720947K829361R31206K501831k992706j613121J020546
$$ plain form
3723.4 619975243 626023598 627892151 626847343 621438446 620114212 623980293 624845810 631246719
3731.2 631246719 627118988 618371544 629055023 631769867 621282959 620875015 622128372 620800591
3738.9 620800591 623917465 625993347 620948906 625994911 641251526 629251175 604013062 616176987
3746.6 616176987 623657532 631237831 626715469 613811874 629143143 623837013 612493095 618675346
3754.3 618675346 624741173 628600121 622311325 625423393 632184372 623146667 619491882 623450699
3762 623450699 625033379 625578079 629869499 626699486 620221596 623437004 630016365 631425667 620653954
3770.7 620653954 621840363 625393906 625693245 626446762 625686378 626281586 626983528 629944534 629213295
3779.4 629213295 620243759 622964706 625794067 626725273 629227104 626234398 624621277 625641823
3787.1F25641823N36079M22058m68483K29950n226k01797j328621J424522M154892
3795.8F30405197n079803n260163K624741O541634Q641471r235077j4374046L857117
3803.5F18121071L246574N697708P182274j1214027n342064O057816K209434J97868
3811.2F26156654j73797q02651J577072P007370k455482j8583565N558701P753563
3818.9F26037865P366562M420929k1492081j27945N802994K681999M136772O92673
3826.6F29519768n204506n52979J631508M204025J575776j1573296K722092Q210830
3834.3F30533218p140884k63557J0838470r451828o440315R344787n637703L23677
3842.1F22105865P940903l603630m777870K884750J529351n63050J366349j254158
$$ plain form
3787.1 625641823 626177902 626599960 626131477 626361427 626356201 626154404 624825783 626250305 630405197
3795.8 630405197 625325394 620065231 622689972 629231606 637873077 628638000 614263954 618121071
3803.5 618121071 621367645 627065353 634247627 623033600 617691536 623749352 625958786 626156654
3811.2 626156654 625982857 625180206 626757278 633764648 631309166 612725601 618284302 626037865
3818.9 626037865 633404427 637825356 616333275 616205330 622008324 624690323 628827095 629519768
3826.6 629519768 624315262 623762283 625393791 629597816 631173592 619600296 622322388 630533218
3834.3 630533218 623392334 623128777 633967247 624515419 618075104 627419891 621782188 622105865
3842.1 622105865 630046768 626443138 621665268 624550018 626079369 625516319 626882668 625628510
3849.8F25628510K438087O247902n043755N100670k0746040p10335J2574959j337242
3857.5F24152756k228241K916260K954826K492409o570778Q81080R348946p442894
3865.2F26504364q800049N243263P219620P654495r197654j1617775M876823P986984
3872.9F29870071M423409j2005196j26304M377746k73704K846985N505943p776375
3880.6F26842575r784775O868782K554207L876991O826172j6755829p4462N164222
3888.3F25517883J987992O744117j57165j0908508P29484L106155j273956J499634
3896.1F27245636Q93593K772445R13926j1052780O936454K520943n450478N788842
3903.8F30568581m752999k100563J109925J101684K769508j36489L07808k94037j01776
$$ plain form
3849.8 625628510 628066597 634314499 629270744 634371414 613625374 612915039 625489998 624152756
3857.5 624152756 621924515 624840775 627795601 630288010 623717232 624598312 633947258 626504364
3865.2 626504364 617704315 622947578 630167198 637821693 628624039 617006264 621883087 629870071
3872.9 629870071 634293480 622288284 622161980 626539726 626266022 629113007 634618950 626842575
3880.6 626842575 617057800 623926582 626480789 630357780 637183952 620428123 620353661 625517883
3888.3 625517883 627505875 634249992 634092827 623184319 623913803 627019958 625746002 627245636
3896.1 627245636 628139229 630911674 631825600 620772820 627709274 630230217 624779739 630568581
3903.8 630568581 625815582 623715019 624824944 625926628 628696136 628559647 628867455 628573418 628471642
3912.5F28471642l59040n76362J930465K105904m187851l920097N910911P78694m995880
3921.1F25158386K312279K211609J145210l204536l125878K613869J939659J132355
3928.8F30182953j403847o05049J761093l071823j831703K308998J074371P55425Q55102
3937.5F30025520q51173o35033k25334K182465J795730n126152q15963K044219J579590
3946.2F29973869J762047k627754j54991J38321j473236J795501K32239m7798K07939
3954.9F29806137l53851m69055p38984J272316P51191M34990p20063k249603P17735
3963.6F28450813N32875q4800M49257j23978Q73718p1182o15044J298714J82533j038666
3973.2F29854240l3950K51197P363l67317k75116J44081L82919M83627L51067j12228
$$ plain form
3912.5 628471642 628112602 627536240 629466705 631572609 627384758 623464661 629375572 630154266 625158386
3921.1 625158386 627470665 629682274 630827484 627622948 624497070 627110939 629050598 630182953
3928.8 630182953 628779106 628174057 629935150 626863327 625031624 627340622 628414993 629170418 630025520
3937.5 630025520 629174347 628539314 628313980 630496445 632292175 627166023 626350060 628394279 629973869
3946.2 629973869 631735916 629108162 628953171 629091492 627618256 629413757 629645996 629598198 629806137
3954.9 629806137 629452286 628983231 628244247 629516563 630267754 630702744 629982681 627733078 628450813
3963.6 628450813 628983688 628898888 629348145 629224167 630097885 630026703 629411659 630710373 630892906 629854240
3973.2 629854240 629820290 630071487 630078850 629711533 629436417 629580498 629963417 630447044 630798111 630685883
3982.8F30685883J30577O96716l07922j96801n6800o16265P63130K65389o48651j33400
3992.5F30581856L47290Q00514r79500j041794N11017L09410K31934N9051
4000.2F30819778
$$ plain form
3982.8 630685883 630816460 631513176 631205254 631008453 630951653 630335388 631098518 631363907 630715256 630581856
3992.5 630581856 630929146 631729660 630750160 629708366 630219383 630528793 630760727 630819778
4000.2 630819778
##END=$$ End of the data block
