##TITLE=Laranja II $$ Begin of the data block
##JCAMP-DX=5.00 $$ ACD/SpecManager v 10.08
##SPECTROMETER/DATA SYSTEM=Alpha
##DATE=25 Jun 2015 11:03:10
##DATA TYPE=INFRARED SPECTRUM
##DATA CLASS=XYDATA
##ORIGIN=
##OWNER=
##NPOINTS=1765
##FIRSTX=399.76428223
##LASTX=3997.64306641
##MAXX=3997.64306641
##MINX=399.76428223
##MAXY=0.85790372
##MINY=0.39525047
##XFACTOR=1.0000000000
##YFACTOR=1.000000000000000e-9
##FIRSTY=0.78180206
##DELTAX=2.03961372
##XUNITS=1/CM
##YUNITS=ARBITRARY UNITS
##XYDATA=(X++(Y..Y))
399.8 781802058 781826079 783353925 785617769 786873996 787044346 788144410 789909780 791387498 792543530
418.1 792543530 790754855 785426199 780108452 777924716 779070377 781313241 783734322 786706924
434.4 786706924 789675891 792432427 795341194 797178984 797366560 797238529 796878397 796167016 796083331
452.8 796083331 796364725 795271218 792466164 789496958 786578178 783794224 781467319 777961731 771472096
471.2 771472096 763507068 759839833 763065755 769025385 774439752 779116213 782087147 782795131 780930221
489.5 780930221 775465310 765956521 751269102 732228100 717412174 715680540 725033998 737229347
505.8 737229347 747118652 753196657 756485224 758369148 758011639 753170490 745557725 740678191 741235256
524.2 741235256 746583819 754548490 760332584 759075463 750699520 739548266 730918586 727565587
540.5 727565587 726907372 722420037 711690664 701758921 700172067 705157101 710007608 710777938 706777751
558.9 706777751 699760675 692701697 686382532 679019630 670002282 661876202 659640849 668721974
575.2 668721974 689605772 714644790 735039473 748226285 754728138 753704667 744397044 725746393
591.5 725746393 698301911 671184540 660672307 678043127 715652585 751794755 773785949
605.8 773785949 783377945 786702573 788266063 788613141 786909044 784108222 781439543 779492497 778489351
624.1 778489351 776460469 769355178 754070163 737626731 732462347 731208622 711704552 667666316
640.4 667666316 614706814 576116979 571145356 608139217 675443351 741345286 781794786 798315704
656.8 798315704 803704798 805959582 807003260 806827962 805805504 804216921 802137375 799165606 795034766
675.1 795034766 789391875 782583356 775511324 767677426 759710371 753133237 743929088 725143313
691.4 725143313 698041201 671825051 655107260 654976487 676474750 712822855 747186542 768792987
707.7 768792987 777766049 777444780 771764278 767938256 772515714 783949494 794256091 797879040
724.1 797879040 793471038 780762494 762440622 746897876 742070735 745285392 745177448 732189715
740.4 732189715 706246376 677852869 658370197 647716820 637842655 622955918 603682339 587414443
756.7 587414443 584057748 602263570 641778886 688862562 728662729 755789876 772224486 782674909
773 782674909 790640771 797765374 805380166 813633442 820708811 824979663 826259673 824438930 819649756
791.4 819649756 813710392 808525980 804179788 800244749 796519518 791943908 785552979 777856231
807.7 777856231 769757867 761814296 754541099 747432530 738860726 727861702 713269532 691664875
824 691664875 661165893 625899196 593354821 572485745 571223974 587567747 609644949 629527986
840.3 629527986 648573816 667335212 682615161 695246816 708979011 725849926 746321440
854.6 746321440 767528355 784458816 794448316 798150897 797464371 793743372 789066851 786900342
870.9 786900342 789347470 795812070 804993153 815609396 825278044 832258880 837185919 840737164
887.2 840737164 842716753 843823075 844831467 845202267 844686508 843716621 841596067 838899314 839092672
905.6 839092672 842433691 844964802 845365524 845255435 845033228 844385087 843912959 843776464 843270719
923.9 843270719 842524290 842058837 841376126 840018690 838399172 836334944 833199978 829706252 826866746
942.3 826866746 824354410 821678281 818993807 816732764 815730572 815801799 815113962 812975943 811229825
960.7 811229825 811200023 811216295 809602320 807035804 804083169 800112367 795030236 789036691 781077087
979 781077087 769262314 753193915 737559438 732380092 743537903 763593316 779159427 784059107
995.3 784059107 779540420 766389906 741431057 704744279 672058403 666005909 688418627 720003068
1011.6 720003068 744617701 757905066 761719048 758780539 749681413 733142674 706611931 667091846
1028 667091846 615564466 560881078 517271519 495788485 496460259 510527492 531537294 558865488
1044.3 558865488 595988989 649979770 715027452 768591940 798397541 810404778 813631237
1058.6 813631237 813249469 811432123 808709979 805435002 802045763 798435509 794460177 790389657
1074.9 790389657 786275387 781846941 777099013 771980047 766020119 758828461 750358999 740732014
1091.2 740732014 730351150 719714403 708233476 694090605 676252544 656682551 639899254
1105.5 639899254 627988517 615818501 594840229 561451852 520103157 480036795 449168712
1119.8 449168712 431381434 429784268 449059784 491802871 551604986 612027168 657924831
1134 657924831 685914338 701120377 709325910 712861598 710247576 700412512 685774922 670126438
1150.3 670126438 656195164 645242989 637452006 630726755 620490611 604172707 584056079 564145744
1166.7 564145744 546252906 529756963 513504207 497554600 483801007 473910421 467166990 461995602
1183 461995602 457531959 452857524 447416544 442162871 439145297 439981639 444027334 447613388 446028709
1201.3 446028709 436672360 420718133 403913110 395250469 400562733 416660935 435611755 453907430
1217.7 453907430 472518086 490589857 505164623 515335798 523210585 531831861 542760551 555148840
1234 555148840 566836715 575980723 582122564 586611032 591384053 596346319 598758399 596190214
1250.3 596190214 590259194 587167799 593040645 608232737 627413034 644556940 657190621 667507529
1266.6 667507529 679665804 694892526 710921645 725643873 738407433 749332368 758862317
1280.9 758862317 767141879 774094701 779893279 784492433 787372708 788528860 788622856 787887156 786537468
1299.2 786537468 785690665 786560655 789307415 792611122 794440985 793652117 790744960 787354767 784769058
1317.6 784769058 783365667 783750057 786498070 790840328 795292556 798893571 801155090 802259088
1333.9 802259088 803292334 805099785 807630599 810830235 814707637 818377256 820919096 822461843
1350.2 822461843 823298097 823257685 822440445 821484089 820306182 817882419 814330220 811199129 808737338
1368.6 808737338 806338847 803187251 797668159 789904654 781662226 773405731 765247941 758057535
1384.9 758057535 751552224 745363712 740912259 737833440 733843744 729659915 728166580 730455339
1401.2 730455339 736127555 744215310 753091872 760770321 765036523 765911043 766881049 771289110 778901577
1419.6 778901577 786518574 793022096 797942817 800982416 802187860 801401377 800247073 798726439
1435.9 798726439 794181645 787465632 779846907 770081043 755925834 734629095 710354209 696377993
1452.2 696377993 703176200 729871690 755459905 763491511 763890505 761053264 753872752 747077048
1468.5 747077048 746760786 750726879 748519599 737101734 720383167 702154517 687733412 679422796
1484.9 679422796 671753466 657781720 637268424 616685152 596643567 572940707 546980619
1499.1 546980619 523001611 503201723 486271650 472158551 468681723 477684796 497494429 527617514
1515.4 527617514 564813256 602881193 640789449 672944307 698644817 722327352 742591739
1529.7 742591739 759825051 773610950 781987727 788077593 792177439 788656056 778737426 764550149
1546 764550149 746283889 725066006 708775103 705699682 713468432 722023487 719943464 712310791
1562.4 712310791 705608368 700404823 699085712 704403102 716992557 736744821 758692503 770273626
1578.7 770273626 771529913 767643869 761502564 754532456 745277882 730308831 707754552 682465374
1595 682465374 666542172 667287111 678867757 692392766 705880821 718147874 722602248 713509142
1611.3 713509142 692287445 659668386 619860232 594466746 593228102 612483382 638049841
1625.6 638049841 656615973 668940783 682600617 703417897 728632450 745747685 755193353
1639.9 755193353 763689041 772691429 781907737 788618565 793428361 800362170 805635691 805917263
1656.2 805917263 807177424 811092436 815954447 819589853 822958529 827589929 831308365 833234608
1672.5 833234608 835353494 837229133 838843524 841978431 846637011 848985791 847464979 846371055
1688.8 846371055 846696019 848318875 851338804 854283571 856182873 855710447 853885174 853125513 852336049
1707.2 852336049 851317286 851574361 853420198 855925679 856809855 854805887 852614522 851772547 851843238
1725.5 851843238 852603495 854057670 856256723 857903719 856800854 855526149 855564833 855452299 855149150
1743.9 855149150 855646551 856908202 857431531 856268942 855130374 854950070 854919612 855045974 854956686
1762.2 854956686 854251027 854242086 855365455 856735229 856770456 855085254 853655457 853257477 853209078 853083909
1782.6 853083909 852810442 852469623 852987051 854374588 854542494 853230655 852541268 852684796 852464199
1801 852464199 851583123 850773811 850467682 850564003 850538969 850046873 849560618 849411905 849398255 849569380
1821.4 849569380 850178897 850861967 851406097 851670265 851042449 850170076 849749625 849519253 849597335 850374639
1841.8 850374639 851071537 850498080 849365711 848565638 848232388 848286629 848397851 848458767 848573446 848668873
1862.2 848668873 848902047 849670947 850214660 849248230 847613335 846561015 845858157 845079482 844382644
1880.5 844382644 843898177 843468368 843220770 843143225 842612028 841736913 841073930 840485811 839833975 839321792
1900.9 839321792 839028955 838804781 838568807 838328302 837940454 837487102 837474048 837814331 837782681 837498844
1921.3 837498844 837318957 837081373 836859882 836872876 837141991 837412953 837539375 837754309 838195026 838496387
1941.7 838496387 838252246 837715328 837134123 836513400 836079597 835887492 835753143 835743845 835953772 836198032
1962.1 836198032 836464643 836848915 837096989 837104499 837175310 837368190 837430775 837316215 837193131 837055504
1982.5 837055504 836840391 836715519 836767256 836766064 836486518 836110890 835861623 835650086 835476577 835384488
2002.9 835384488 835243464 835066736 834983230 834888220 834716201 834618449 834469140 833976209 833291233 832624376
2023.3 832624376 832059801 831963480 832315862 832552731 832446814 832217693 832081676 831975341 831767619 831539512
2043.7 831539512 831362486 831134617 830889463 830748737 830602467 830371618 830188811 830053329 829844058 829631686
2064.1 829631686 829486251 829300046 829067409 828919590 828802049 828576088 828343451 828225613 828134775 828032434
2084.5 828032434 828016698 828027427 827914953 827756166 827655613 827509224 827298343 827148855 827036142 826864779
2104.9 826864779 826717138 826659143 826556146 826368153 826199830 826019287 825750291 825506508 825382173 825269878
2125.3 825269878 825135231 825069308 825020730 824909449 824823260 824790239 824703634 824569762 824473381 824376583 824252486
2147.7 824252486 824184000 824150920 824043274 823885024 823753715 823593318 823359966 823135972 822904527 822555304
2168.1 822555304 822240591 822156131 822138667 822024107 821895778 821783841 821601331 821376204 821192265 820998073
2188.5 820998073 820755005 820560694 820439517 820296586 820140898 820020080 819863856 819649816 819470942 819342077
2208.9 819342077 819202065 819076300 818996131 818900228 818765402 818645537 818504989 818258226 817980111 817771077
2229.3 817771077 817548633 817286015 817089915 816928566 816747427 816670716 816747189 816829920 816849649 816886425
2249.7 816886425 816933990 816916049 816874623 816836298 816727698 816552639 816383421 816213667 816017449 815859914
2270.1 815859914 815761745 815632224 815463305 815333545 815228224 815106332 814996243 814895570 814780354 814678550
2290.5 814678550 814595580 814487100 814352572 814246774 814168513 814052165 813884139 813705921 813517153 813295662
2310.9 813295662 813071132 812820375 812445045 811986685 811584711 811273754 811009943 810706496 810266912 809717715
2331.3 809717715 809200048 808742881 808252990 807719529 807258129 807012618 807142079 807564378 807831645 807676792
2351.7 807676792 807275712 806960046 806774199 806666732 806666613 806746900 806842625 806969702 807183683 807436824
2372.1 807436824 807621598 807777464 807996631 808245778 808455765 808591425 808611751 808518469 808390141 808283925
2392.5 808283925 808146358 807927847 807685137 807437897 807148039 806858480 806615353 806355417 806069791 805833340
2412.9 805833340 805644095 805468976 805310369 805144727 804937303 804723740 804547489 804369032 804150760 803935528
2433.3 803935528 803722203 803426743 803063273 802742600 802468598 802182376 801933289 801777959 801675797 801598072
2453.7 801598072 801548243 801466107 801324368 801184297 801049232 800874233 800671458 800480664 800268769 800008893
2474.1 800008893 799767733 799551368 799293220 799028575 798827291 798658788 798491418 798352301 798227906 798054039
2494.5 798054039 797842443 797663510 797484934 797248662 797009706 796806455 796596885 796376944 796145499 795852959
2514.9 795852959 795524359 795237124 794983149 794719160 794460595 794223845 793966889 793689549 793447554 793206871
2535.3 793206871 792908370 792582750 792268038 791951597 791641414 791382968 791166306 790940583 790711999 790511549
2555.6 790511549 790333450 790187001 790072203 789947212 789808035 789657474 789448380 789151311 788809717 788462996
2576 788462996 788074434 787629545 787177384 786737978 786292195 785873353 785534620 785240412 784955502 784709930
2596.4 784709930 784499407 784291446 784095228 783924103 783728361 783493817 783300817 783158779 782997251 782826602
2616.8 782826602 782702029 782606900 782494485 782352567 782160938 781929612 781747997 781637013 781498730 781305671
2637.2 781305671 781132042 780976117 780793846 780635297 780529201 780398786 780222952 780037105 779803336 779521942
2657.6 779521942 779274166 779062867 778825343 778564095 778305173 778027475 777727842 777427495 777119040 776763022
2678 776763022 776343346 775861502 775320113 774781644 774296343 773800015 773224950 772649825 772168636 771744251
2698.4 771744251 771372020 771133780 771014452 770958185 771008492 771185637 771439612 771758020 772151709 772559702
2718.8 772559702 772894204 773152530 773345351 773378134 773208797 772968411 772727549 772477269 772252262 772011697
2739.2 772011697 771670938 771275997 770911574 770495594 769914865 769240677 768541873 767804563 767106593 766531169
2759.6 766531169 766066313 765743494 765598595 765548706 765549719 765658677 765830159 765891969 765800416 765675724
2780 765675724 765534699 765317500 765095115 764956236 764820635 764628470 764492393 764459848 764428198 764320493
2800.4 764320493 764150798 763930976 763690591 763460279 763148069 762700260 762206912 761696935 761141062 760581374
2820.8 760581374 760033965 759454131 758867979 758359432 757944643 757562459 757215083 756932735 756525338 755818427
2841.2 755818427 754993021 754202843 753372252 752519608 751823485 751392663 751186788 751168787 751242936 751218319
2861.6 751218319 751056433 750824273 750523925 750238836 750063002 749795794 749246180 748595119 748011172 747452259
2882 747452259 746897340 746355116 745807350 745272040 744782090 744320929 743837774 743338168 742902398 742530048
2902.4 742530048 742134571 741630137 740997493 740345657 739715874 739021659 738275766 737619400 737167478 736963511
2922.8 736963511 736961722 737093210 737318575 737501144 737552166 737552881 737564504 737577081 737591386 737585366 737470865
2945.2 737470865 737156451 736678898 736207843 735728979 735091567 734390914 733742535 733042419 732221305 731352210
2965.6 731352210 730508745 729776084 729313254 729182005 729254365 729443371 729714692 729918957 729961216 729894638
2986 729894638 729718149 729374409 728915393 728410900 727831185 727182746 726553500 725932956 725190818 724300742
3006.4 724300742 723315597 722177982 720798612 719209611 717480779 715647221 713831484 712137520
3022.7 712137520 710555971 709166825 708114445 707344532 706688225 706110060 705569804 704937041 704220712
3041.1 704220712 703580737 703078151 702694237 702482104 702363551 702133358 701779842 701416016 701169014 701324046
3061.5 701324046 702157617 703567564 705082476 706377506 707531035 708669901 709845901 710978568
3077.8 710978568 711766124 712112486 712242842 712240517 712013364 711560845 711013556 710578978 710393250 710494936
3098.2 710494936 710806191 711122453 711441815 711914718 712459803 712880373 713233292 713656187 713956952 713931859
3118.6 713931859 713639021 713161349 712650836 712279916 711996615 711645365 711185575 710702360 710286379 709897518
3139 709897518 709439337 708925724 708394647 707872093 707447410 707091510 706584632 705872536 705136657 704436362
3159.4 704436362 703771710 703184962 702610433 702006340 701439857 700917125 700368524 699805200 699273169 698711455
3179.8 698711455 698069215 697412133 696757555 696065664 695366561 694672406 693928778 693112254 692247212 691326618
3200.1 691326618 690354168 689400971 688488722 687549591 686582446 685661376 684735119 683738947 682731688
3218.5 682731688 681718051 680665374 679624200 678660810 677755535 676869094 675990999 675028086 673947155
3236.9 673947155 672885597 671902657 670943975 669972241 668956816 667902768 666883171 665955663 665087640
3255.2 665087640 664200425 663303614 662462652 661673546 660902679 660207212 659646809 659032583 658191919 657243729
3275.6 657243729 656300068 655389249 654531062 653660536 652749836 651864886 651060522 650271893 649306774 648114324
3296 648114324 646796644 645471096 644328535 643403530 642345309 640817881 638947248 637082577 635330498
3314.4 635330498 633574426 631785750 629982352 628158748 626321435 624316275 622060180 619763076
3330.7 619763076 617562890 615431547 613301039 610988796 608446538 605799913 603043735 600310266
3347 600310266 597794592 595176578 592142165 588962615 585925281 583005190 580047429 577036500 574197650
3365.4 574197650 571537852 568671703 565373063 561994493 558970511 556265414 553691030 551178515
3381.7 551178515 548723161 546385527 544331789 542677581 541026294 538945317 536857605 535331249
3398 535331249 534073949 532393992 530285120 528379858 526905954 525612175 524316013 522949278 521618485
3416.3 521618485 520536244 519616246 518678129 517876744 517392039 517103434 516788781 516534984 516508639 516442716
3436.7 516442716 516151190 515964925 516134143 516577482 517105222 517570198 518065751 518733799 519564569 520565510
3457.1 520565510 521743178 522879958 523949742 525341451 527019262 528376818 529265285 530195832 531477094
3475.5 531477094 533076227 534756660 536161959 537416518 538872719 540384650 541744947 543163180
3491.8 543163180 544820249 546591341 548277497 549959362 551753938 553326070 554625690 556141496
3508.1 556141496 557940662 559791327 561594963 563353479 565194070 567265809 569579363 571789324
3524.4 571789324 573661923 575397968 577162027 579079568 581278622 583538473 585652113 587953568
3540.8 587953568 590673685 593373060 595463097 597208917 599256873 601492763 603636920 605959117
3557.1 605959117 608637929 611465812 614424646 617665708 620644510 622673213 624428332 626747847
3573.4 626747847 629544914 632446945 635423839 638644516 642248809 646099210 649369299 651681781
3589.7 651681781 654039085 656985700 660026968 662917972 665788174 668542504 671380341 674643695
3606 674643695 678018510 680967033 683627307 686220765 688824058 691457212 693448067 694775343 696692765
3624.4 696692765 699839711 703123033 704570770 704984844 705880523 707175970 708652258 710305452 712249994
3642.7 712249994 714987636 718594790 721462429 721703649 720880091 721050262 721838713 722326279 722754419
3661.1 722754419 723438680 724675894 726715982 728887200 730150521 731021881 731540442 730593264 729244173
3679.4 729244173 728673577 729011476 730390847 732518613 733728528 732983232 731790960 731342137 731607378
3697.8 731607378 732214749 732563674 732389450 732594967 733829021 735231876 735147357 733694136 732605696
3716.2 732605696 732452393 732753575 733023167 733036757 732748330 732614338 733380914 734993100 736081541
3734.5 736081541 735492587 734200299 733816922 734614551 735384285 735338032 735410035 735168636 733638883 732125878
3754.9 732125878 731603444 731379390 730685949 730071902 730098546 730403364 730402470 729719698 728774428 728420317
3775.3 728420317 728814840 729137182 728711724 728063583 727596343 727174044 726832867 726745307 727115512 727832675
3795.7 727832675 728542387 729186952 729236901 728475928 727765441 726934016 725980341 725872099 726794183 727853000
3816.1 727853000 728401065 728540361 727631330 726092100 725203991 725016952 725284815 725865602 726651192
3834.4 726651192 727429211 727404714 726360202 725033343 723871768 723322272 723971069 725733399 726968467
3852.8 726968467 725666046 723581672 722626567 722744286 723231316 723405540 723433316 723528981 723106384 722124040
3873.2 722124040 721163809 720792294 721122324 721334875 721236050 721015215 720409453 719977140 719765723 719188988
3893.6 719188988 718845189 719363987 720210314 720472515 719792128 718430996 717133284 716427624 716292322
3912 716292322 716576338 717001200 717052817 716719568 716437280 716257274 716051340 715941072 715965509 715819776
3932.3 715819776 715400755 715009749 714836895 714853108 714869797 714796722 714802861 714755118 714387596 713918746 713605642
3954.8 713605642 713446379 713389218 713343263 713211119 712978005 712728798 712550938 712435246 712327480 712179303
3975.2 712179303 711988151 711824656 711733282 711637735 711452961 711282253 711177886 710997283 710769236 710574627
3995.6 710574627 710352778
3997.6 710352778
##END=$$ End of the data block
