##TITLE=Lacre 0001998 $$ Begin of the data block
##JCAMP-DX=5.00 $$ ACD/SpecManager v 10.08
##SPECTROMETER/DATA SYSTEM=Alpha
##DATE=24 Apr 2015 08:22:40
##DATA TYPE=INFRARED SPECTRUM
##DATA CLASS=XYDATA
##ORIGIN=
##OWNER=
##NPOINTS=1667
##FIRSTX=599.64648438
##LASTX=3997.64306641
##MAXX=3997.64306641
##MINX=599.64648438
##MAXY=1.00199568
##MINY=0.02138617
##XFACTOR=1.0000000000
##YFACTOR=0.000000010000000
##FIRSTY=1.00000000
##DELTAX=2.03961372
##XUNITS=1/CM
##YUNITS=ARBITRARY UNITS
##XYDATA=(X++(Y..Y))
599.6A00000000k2846Q851M5657M2593K7097M1389M4406J2421m780l028j6773k2804
624.1A00152183j5104j8013l0172k6714j6642j2267q881k4390m0418o4963m9454p570
648.6I9837595J4377o247k9450j7166R912L2490N3817M8554o723k2912M9025L6728
673.1A00000000j9473l5643j0574N376J8770K2089j5724p4118j11020j44261j99109
695.5I9436313k40600k47121k58988l21377m44287o16318q33642j104617j452154j883882
715.9I2033327k198738j855868o08707P92158J524865J562196J261479R11588O19876
734.3I4042176L73799J40804j76847p15858j305264j376027o62398L53235J036250
752.6I1709870J214928J084083Q71122O92117N51951M21965L25996K89368K58500K15852
$$ plain form
599.6 100000000 99977154 99986005 100031662 100074255 100101352 100142741 100187147 100199568 100194788 100191760 100174987 100152183
624.1 100152183 100137079 100119066 100088894 100062180 100045538 100033271 100024390 100000000 99959582 99894619 99845165 99837595
648.6 99837595 99851972 99845725 99816275 99799109 99809021 99841511 99895328 99943882 99937159 99914247 99963272 100000000
673.1 100000000 99980527 99944884 99934310 99939686 99958456 99980545 99964821 99890703 99779683 99635422 99436313
695.5 99436313 99195713 98948592 98689604 98368227 97923940 97307622 96473980 95369363 93917209 92033327
715.9 92033327 89834589 87978721 87370014 88162172 89687037 91249233 92510712 93422300 94042176
734.3 94042176 94415975 94556779 94379932 93664074 92358810 90982783 90320385 90673620 91709870
752.6 91709870 92924798 94008881 94880003 95572120 96124071 96546036 96872032 97161400 97419900 97635752
773I7635752K03431J95258J59371J35678J47289J54800J25634P9048L0261j4662l0429
795.4I8821431l6573n7274o9273o1500n4580p5900j16569j49924j18476N919J16068
817.9I8203349J31065Q9490M0084N055j2207l2068n7810o9738q2606j08271j28365
840.3I7977978j34629j40774j62286j76644j73402j83427k05386k16013k11954k02847
860.7I6170616j84887j37461o5291J6129Q3709J07163Q0037R996n7524p0942n2941
883.2I5898604o0290q3708n7084K0433P7438P2849K9653l779k581K0451K8759J389
907.6I5942134m8769j00821j41001j69718j75750j50586j31863j49947j99765k62243
928I4411671l23862l93772m44943m03469k76250j70129j51766j97148k68066l48419
$$ plain form
773 97635752 97839183 98034441 98193812 98329490 98476779 98631579 98757213 98836261 98866522 98851860 98821431
795.4 98821431 98784858 98727584 98658311 98596811 98542231 98466331 98349762 98199838 98081362 98087281 98203349
817.9 98203349 98334414 98423904 98463988 98469043 98456836 98424768 98366958 98297220 98214614 98106343 97977978
840.3 97977978 97843349 97702575 97540289 97363645 97190243 97006816 96801430 96585417 96373463 96170616
860.7 96170616 95985729 95848268 95782977 95799106 95882815 95989978 96070015 96080011 96022487 95951545 95898604
883.2 95898604 95838314 95754606 95697522 95717955 95795393 95868242 95897895 95894116 95891535 95911986 95940745 95942134
907.6 95942134 95893365 95792544 95651543 95481825 95306075 95155489 95023626 94873679 94673914 94411671
928 94411671 94087809 93694037 93249094 92845625 92569375 92399246 92247480 92050332 91782266 91433847
948.4I1433847m11189m35137m37862m57937n08105n68366o14977n81730l75002J0663
968.8H7054205M31859O77586O65939N16242L80677L15600L03883L00252K80821K56062
989.2I1183126K38204K31445K38848K50023K55978K58136K47395K25622K01499J78099
1009.6I3508375J59967J37412R3842L0863k7442o9845j09243j33580j18959q0723l9213
1032I3351454n502R221L111k5570o7586j17951j91165l13514n04571p43383r53162
1054.5I0441382j025558r12219o73759m14634k01833n4252M6879J31232K00140K62976
1074.9H7800354L32999L91752M16100L81916K89309J80376P4494l0047j21832j98298
1095.3H9517123k63936l32010m20469n49358p29990r34386j132131j326501j525289
$$ plain form
948.4 91433847 91022658 90587521 90149659 89691722 89183617 88615251 88000274 87418544 87043542 87054205
968.8 87054205 87486064 88163650 88829589 89345831 89726508 90042108 90345991 90646243 90927064 91183126
989.2 91183126 91421330 91652775 91891623 92141646 92397624 92655760 92903155 93128777 93330276 93508375
1009.6 93508375 93668342 93805754 93899596 93930459 93903017 93833172 93723929 93590349 93471390 93390667 93351454
1032 93351454 93345952 93355173 93358284 93332714 93265128 93147177 92956012 92642498 92137927 91394544 90441382
1054.5 90441382 89415824 88503605 87829846 87415212 87213379 87159127 87206006 87337238 87537378 87800354
1074.9 87800354 88133353 88525105 88941205 89323121 89612430 89792806 89867300 89837253 89715421 89517123
1095.3 89517123 89253187 88921177 88500708 87951350 87221360 86286974 85154843 83828342 82303053
1113.6H2303053j703316j811898j827657j772457j685780j614893j636565j813864
1129.9F8436623k124167k475577k772022k963370l069627l107399k977693k504525
1146.3D6442243j594090l77160Q39731J741484K130076K001160J519013R15581L67737
1164.6E3985775m9764l18683m26983l43240l6174M72963J103610J715177K130330K252882
1185F0485893K114743J849521J638812J626336J844943K191764K486008K583426K440197
1203.4G9261643K094030J640141J172149P26426L08359q2034m49676p94845j130033
1221.7H2746160j463509j781374k066326k282697k368373k240431j829147j141143
1238.1F7573160k80386N79971J280224J721567J856315J679099J262069P49868K40379
$$ plain form
1113.6 82303053 80599737 78787839 76960182 75187725 73501945 71887052 70250487 68436623
1129.9 68436623 66312456 63836879 61064857 58101487 55031860 51924461 48946768 46442243
1146.3 46442243 44848153 44470993 45310724 47052208 49182284 51183444 52702457 53618038 53985775
1164.6 53985775 53936011 53617328 53190345 52847105 52810931 53283894 54387504 56102681 58233011 60485893
1185 60485893 62600636 64450157 66088969 67715305 69560248 71752012 74238020 76821446 79261643
1203.4 79261643 81355673 82995814 84167963 84894389 85202748 85120714 84671038 83876193 82746160
1221.7 82746160 81282651 79501277 77434951 75152254 72783881 70543450 68714303 67573160
1238.1 67573160 67292774 67872745 69152969 70874536 72730851 74409950 75672019 76421887 76662266
1256.4G6662266k51657o93237r88663j038259p70879j81818N99194J332962J809860
1274.8G6479769J985705J938069J745224J453977J119620Q12268N55372L23785J49435
1293.1H6563224J25050K38425L51512L86405L73966L57264L52770L55202L41284K95639
1313.5H9740741K26224J70111J67340K07764K53243K79635K63679J94901R9462q386
1333.9I1594714j45215k86019l22443k17915j54036k47079m01908m67581l98785k83253
1354.3H8670480k44212l37112n76854r29975j033670p39586n32103p78544j565957
1372.7H1932467k367931j716847M21137K181518K225036J323372Q03142Q21394R79090
1391H6602378J095158R66102N21958K08687K54941N26917Q43555R33188P75415N13548
$$ plain form
1256.4 76662266 76410609 75717372 74728709 73690450 72919571 72737753 73336947 74669909 76479769
1274.8 76479769 78465474 80403543 82148767 83602744 84722364 85534632 86090004 86413789 86563224
1293.1 86563224 86688274 86926699 87278211 87664616 88038582 88395846 88748616 89103818 89445102 89740741
1313.5 89740741 89966965 90137076 90304416 90512180 90765423 91045058 91308737 91503638 91603100 91594714
1333.9 91594714 91449499 91163480 90841037 90623122 90469086 90222007 89820099 89352518 88953733 88670480
1354.3 88670480 88426268 88089156 87512302 86582327 85548657 84809071 84276968 83498424 81932467
1372.7 81932467 79564536 77847689 78268826 80450344 82675380 83998752 84801894 85623288 86602378
1391 86602378 87697536 88663638 89185596 89394283 89649224 90176141 91019696 91952884 92728299 93241847
1411.4I3241847K37244N0569q3095k51800l92527o10053r90033j445210k040011k318287
1431.8H5398644k135658k328450k651649k441597k519942k671736k529389k373045
1448.1F5747178k237511k268803k319527k314001j840067j104868j096838j352728
1464.5E1212835l29989K294189N263245P544643O161058L431832K171678J406014P79843
1482.8G9935348N34678R47350K036440K918565K594483K141112J959759J415945Q49437
1501.2I5333117N80168N10257M68219K74646J78498J89650K19065K23261J86950J29694
1521.6I8293525Q4293P3701P5895Q2796R1869O7854P2914J12796Q3107k0027j8156
1544I9000567K4921M4787M3863L7503N2667Q0442M0335p9584j5128L9875L4357Q553
$$ plain form
1411.4 93241847 93479091 93529660 93446565 93194765 92802238 92192185 91202152 89756942 87716931 85398644
1431.8 85398644 83262986 80934536 78282887 75841290 73321348 70649612 68120223 65747178
1448.1 65747178 63509667 61240864 58921337 56607336 54767269 53662401 52565563 51212835
1464.5 51212835 50882846 53177035 58440280 65984923 72145981 75577813 77749491 79155505 79935348
1482.8 79935348 80470026 81417376 83453816 86372381 88966864 91107976 93067735 94483680 95333117
1501.2 95333117 95913285 96423542 96891761 97166407 97344905 97534555 97753620 97976881 98163831 98293525
1521.6 98293525 98377818 98451519 98527414 98610210 98702079 98769933 98842847 98955643 99038750 99018723 99000567
1544 99000567 99025488 99070275 99114138 99151641 99204308 99284750 99325085 99245501 99230373 99270248 99304605 99313158
1568.5I9313158j9592J4645L1465k0975l2407j67n90o074p122k468j741j1211k1595
1595I9235326k9927l2968m6974m8304k7287l272K384J0389L0202K7472o873r30R948
1621.5I9119186l7312n5283m2910l0708j210j723j16294j58900k5577R0319J51450
1643.9I8891038J15215L8183N5307M5526j20806r3478q583p940n1784q4216n0813p1543
1668.4I8656106j39660j51837k14886l38239l29011k85310l18664m43334l29309j51462
1688.8I5954394j19596q6016j48892k73079m64880q00622r00108j178747j777679k274650
1709.2H7930125k937454m004365n861509r040231r904140q020618p330424o501153
1725.5C4330231m638353k802411r59778J368592L575250M943240P720712J0027513
$$ plain form
1568.5 99313158 99293566 99308211 99339676 99318701 99286294 99286127 99285537 99279463 99272341 99269873 99268132 99256921 99235326
1595 99235326 99205399 99172431 99125457 99077153 99049866 99046594 99048978 99059367 99089569 99117041 99110168 99109238 99119186
1621.5 99119186 99081874 99026591 98983681 98952973 98951763 98950040 98833746 98674846 98649269 98739588 98891038
1643.9 98891038 99006253 99044436 99099743 99145269 99024463 98930985 98922402 98914462 98862678 98778462 98727649 98656106
1668.4 98656106 98516446 98364609 98149723 97811484 97482473 97197163 96878499 96435165 96105856 95954394
1688.8 95954394 95834798 95748782 95599890 95326811 94861931 94061309 93161201 91982454 90204775 87930125
1709.2 87930125 84992671 80988306 75126797 66086566 56182426 48161808 40831384 34330231
1725.5 34330231 29691878 26889467 25929689 27298281 30873531 35816771 43537483 53564996
1741.9E3564996J0093128R067106P361943N667156L841376K261544J514476J174355
1758.2I4546080Q49717O78742N06944L92842L37428K94566K44850J79917J54382J41448
1778.6I8326916J23178Q5688Q1259P8911R4104P9268M1967L1132N0962N1260K1911
1801I9066556K3138L1316L0327J4365J4764J3214J7035J5849J1867J4431J2642P021
1825.5I9272525J08r388j9902R906J4651j270K951J7905k50j9354R507J8627R238L064
1854I9308318P898L761P307J7798K3466J8561n573j9365r156O080J2165J5426P445
1880.5I9394131k367o359M243N490q827o974m83K909l10l16k170n430n650n388p964
1911.1I9354535k044J0979M971q684j2428j3792j1945l922m8K825k896j2791q917N179
$$ plain form
1741.9 53564996 63658124 72725230 80087173 85754329 89595705 91857249 93371725 94546080
1758.2 94546080 95395797 96074539 96581483 96974325 97311753 97606319 97851169 98031086 98185468 98326916
1778.6 98326916 98450094 98535782 98617041 98695952 98790056 98869324 98911291 98942423 98993385 99044645 99066556
1801 99066556 99089694 99121010 99151337 99165702 99180466 99193680 99210715 99226564 99238431 99252862 99265504 99272525
1825.5 99272525 99272633 99263245 99243343 99253249 99267900 99266630 99269581 99287486 99287236 99267882 99277389 99296016 99305254 99308318
1854 99308318 99316216 99319977 99327284 99345082 99368548 99387109 99381536 99362171 99353015 99359095 99371260 99386686 99394131
1880.5 99394131 99391764 99385405 99389648 99395138 99386311 99379337 99378854 99381763 99381453 99381137 99378967 99373537 99367887 99362499 99354535
1911.1 99354535 99352491 99363470 99368441 99359757 99347329 99333537 99321592 99317670 99317622 99320447 99317551 99304760 99295843 99301022
1939.7I9301022O140n818o91M893M036J651m316n764J383N472N060P958m65p671p28
1970.3I9312162N591Q834O634n490j1659o37J3441J5103N794j961o80Q280J0395L99
1998.8I9366206m429oj776o878o438r584j7101k1189k5457k2930p147K176o08L594
2027.4I9248433R334L231N638K0934K7024K1452J8615K2161J8668J1211K0469L3551
2051.9I9460721K8420J9902J7440J7595K1285K4629K3734J9288J5646J4925J6016J8710
2076.4I9698311J6874J0252J1361J9222K0290J2386J1813K2412K7561J7833J0789J5283
2100.8I9894387J3428R144J1307J2147Q333O002N448Q440J1748N633j556q46N966R012
2129.4I9998593J407o747o068j0955k0862j7172j2749j5909j5569r560j0193j4358
$$ plain form
1939.7 99301022 99307162 99301344 99300653 99305546 99309582 99311233 99306917 99301153 99302536 99308008 99313068 99321026 99320561 99312890 99312162
1970.3 99312162 99317753 99326587 99333221 99327731 99316072 99315435 99328876 99343979 99349773 99347812 99347132 99355412 99365807 99366206
1998.8 99366206 99361777 99361771 99359995 99353117 99346679 99337095 99319994 99298805 99273348 99250418 99243271 99245447 99244839 99248433
2027.4 99248433 99257767 99260998 99266636 99287570 99314594 99336046 99354661 99376822 99395490 99406701 99427170 99460721
2051.9 99460721 99489141 99509043 99526483 99544078 99565363 99589992 99613726 99633014 99648660 99663585 99679601 99698311
2076.4 99698311 99715185 99725437 99736798 99756020 99776310 99788696 99800509 99822921 99850482 99868315 99879104 99894387
2100.8 99894387 99907815 99916959 99928266 99940413 99948746 99954748 99960196 99968636 99980384 99986017 99984461 99983615 99989581 99998593
2129.4 99998593 100000000 99993253 99987185 99976230 99955368 99938196 99925447 99909538 99893969 99884409 99874216 99859858
2153.9I9859858j0252o158q350p230n269o628l350p51n084j0038j1068j1492j0008
2180.4I9764180q106n376j759n704o354p45l189o395k671m887j2297j0478j55K336
2208.9I9698400n853r292o080p009j0127o884o247j2714j2862m375J859j25q535j4365
2237.5I9595791j3059j2952j4365j0657q035j4222j9991j4895j1957j5283j0872r870
2262I9439633j8925j9204j2338j3745j4836o217m178j2475j3793r137j5980k6107k2119
2288.5I9250579j3840j2070j7274k0647j9866k5707l3015l5507l2067k7490l1513l1209
2312.9I8950374j9288j6880k6327k1184K641J7339J5479J5724J4752M166N478K0486
2337.4I8962760K8133J5355k7538n7995q905N6183P2265O0612N9253M6825p27l7134
$$ plain form
2153.9 99859858 99849606 99843448 99835098 99827868 99822599 99815971 99812621 99811870 99806786 99796748 99785680 99774188 99764180
2180.4 99764180 99756074 99750698 99748939 99743235 99736881 99736136 99732947 99726552 99723881 99718994 99706697 99696219 99696064 99698400
2208.9 99698400 99692547 99683255 99677175 99670166 99660039 99653155 99646908 99634194 99621332 99616957 99618816 99618691 99610156 99595791
2237.5 99595791 99582732 99569780 99555415 99544758 99536723 99522501 99502510 99487615 99475658 99460375 99449503 99439633
2262 99439633 99420708 99401504 99389166 99375421 99360585 99354368 99350190 99337715 99323922 99314785 99298805 99272698 99250579
2288.5 99250579 99236739 99224669 99207395 99186748 99166882 99141175 99108160 99072653 99040586 99013096 98981583 98950374
2312.9 98950374 98931086 98914206 98887879 98866695 98869336 98886675 98902154 98917878 98932630 98936796 98942274 98962760
2337.4 98962760 98990893 99006248 98978710 98920715 98911810 98967993 99040258 99100870 99160123 99206948 99206221 99169087
2361.9I9169087l7139l7396m8906l6835p886l404o288J0842L8338N4449M5544K7555
2386.4I9167961K0009J1307l654n215N519O235m071r245n000N227J7232K3448K0897
2412.9I9250650J2559M464O980J6600J5318J1081J9819K5385J6117J0407J5015J6635
2437.4I9421030J4413J7816K5337K3675J5665J9168K2543J5336J8519L0166L0440J8990
2461.8I9673098J1200J1170J3637J6714J2183P09l588L797O717m458j6302j6558j1659
2488.3I9696660j3959k5362k9457j6469j3065k5332l1447k9880k6858k5564k4176k1768
2512.8I9413323k4968l4183l9590l4636k8807k6834k3293k6679l0160k1112j3167j1057
2537.3I9098837r113r537j3745j7255k1506k5665k2972k5588l7903m1574l9357m2027
$$ plain form
2361.9 99169087 99131948 99094552 99045646 99008811 99000925 98997521 98991233 99002075 99040413 99094862 99140406 99167961
2386.4 99167961 99187970 99199277 99195623 99190408 99195927 99202162 99198091 99188846 99183846 99189073 99206305 99229753 99250650
2412.9 99250650 99263209 99267673 99274653 99291253 99306571 99317652 99337471 99362856 99378973 99389380 99404395 99421030
2437.4 99421030 99435443 99453259 99478596 99502271 99517936 99537104 99559647 99574983 99593502 99623668 99654108 99673098
2461.8 99673098 99684298 99695468 99709105 99725819 99738002 99738711 99735123 99738920 99745637 99741179 99724877 99708319 99696660
2488.3 99696660 99682701 99657339 99627882 99611413 99598348 99573016 99541569 99511689 99484831 99459267 99435091 99413323
2512.8 99413323 99388355 99354172 99314582 99279946 99251139 99224305 99201012 99174333 99144173 99123061 99109894 99098837
2537.3 99098837 99089724 99080187 99066442 99049187 99027681 99002016 98979044 98953456 98915553 98873979 98834622 98792595
2561.8I8792595m9967n8055n5653n3548n9480o0719n8204n9110o3044o6638o2871n7793
2586.2I8087513o5618o8289m9800m0484m5937m0000l6818m4370m3523l7921l6394l8809
2610.7I7539550m3052m4197l7164k6875k6733l7170m5609m2373k6876j9121l1739m0329
2635.2I7118312m0054m3476m1556m0657m6366m6599m6235n7471p2443p8935p5966p1633
2659.7I6456921q1170j00034j05637r2244p6902o2722m0365k6697k4265p695K1655
2682.1I5860845M2140M9681N8001P5048Q6463Q4102Q2564Q2112O8593L9428R543j4937
2706.6I6523583m3589p0029q6064r1123q5300q4013r8246j15419j15269q0413k7353
2729I5626765J7244N4520P7606Q2957Q1140O8367M1812Q208j0478K771K0921Q637k3556
$$ plain form
2561.8 98792595 98742628 98684573 98628920 98575372 98515892 98455173 98396969 98337859 98274815 98208177 98145306 98087513
2586.2 98087513 98021895 97953606 97903806 97863322 97817385 97777385 97740567 97696197 97652674 97614753 97578359 97539550
2610.7 97539550 97496498 97452301 97415137 97388262 97361529 97324359 97278750 97236377 97209501 97190380 97158641 97118312
2635.2 97118312 97078258 97034782 96993226 96952569 96906203 96859604 96813369 96755898 96683455 96604520 96528554 96456921
2659.7 96456921 96375751 96275717 96170080 96077836 96000934 95938212 95897847 95871150 95846885 95839190 95860845
2682.1 95860845 95902985 95952666 96010667 96085715 96172178 96256280 96338844 96420956 96489549 96528977 96538520 96523583
2706.6 96523583 96479994 96409965 96323901 96232778 96147478 96063465 95965219 95849800 95734531 95654118 95626765
2729 95626765 95644009 95698529 95776135 95859092 95940232 96008599 96050411 96058619 96048141 96050912 96071833 96080470 96056914
2755.5I6056914m4465n7232o4248n5611n2869p0829j00070j37734j67400j67465j66226
2778I4972765j89656k25222k65312k96855k99078k77585k69544k99531l43919l64602
2798.4I2141461l79026m25642m88216n40715n93335o50477p04122p66820q51148r56351
2818.8H5785609j080131j225805j409030j652664j991838k473003l136647m030508
2835.1F8785983n179590o512797p834503q759081q851048p965052o297781m127507
2851.4A3258624j735041N65540K576113M093609M828936M621929L592271K245176J373267
2869.7C5420424J473751K170632K571797K155951J060664k66245j467076k355513k838087
2888.1C7926298k917137k726689k448067k221343k104050k056271k051015k099604
$$ plain form
2755.5 96056914 96012449 95955217 95890969 95835358 95782489 95711660 95611590 95473856 95306456 95138991 94972765
2778 94972765 94783109 94557887 94292575 93995720 93696642 93419057 93149513 92849982 92506063 92141461
2798.4 92141461 91762435 91336793 90848577 90307862 89714527 89064050 88359928 87593108 86741960 85785609
2818.8 85785609 84705478 83479673 82070643 80417979 78426141 75953138 72816491 68785983
2835.1 68785983 63606393 57093596 49259093 40500012 31648964 23683912 17386131 13258624
2851.4 13258624 11523583 12089123 14665236 18758845 23587781 28209710 31801981 34047157 35420424
2869.7 35420424 36894175 39064807 41636604 43792555 44853219 44586974 43119898 40764385 37926298
2888.1 37926298 35009161 32282472 29834405 27613062 25509012 23452741 21401726 19302122
2904.4A9302122k187302k288799k374529k408369k330961k080141j654000j126724
2920.7B851297n90751j21929K75438O31181R53637J334552J831976K335225K687971
2939.1A2188597K770603K463729J751444Q21161j633l96269k63420L05149J170075
2957.4B0809436K155694L150171M121742M997843N604899N795029N569795N022597
2973.8E7227206M305995L583586K938259K400595J988393J682865J455856J289874
2990.1G6872629J170695J093083J037980R99701R79447R62752R57561R52005R23884
3008.4H5949737Q96329Q77499Q45307Q05718P59399O91074O15084N55152N07927M46987
3028.8I2950213L81613L45808L38000L20643K68120K17652K05690K18159K21145J93107
$$ plain form
2904.4 19302122 17114820 14826021 12451492 10043123 7712162 5632021 3978021 2851297
2920.7 2851297 2260546 2138617 2414055 3045236 3998873 5333425 7165401 9500626 12188597
2939.1 12188597 14959200 17422929 19174373 19995534 19993901 19597632 19334212 19639361 20809436
2957.4 20809436 22965130 26115301 30237043 35234886 40839785 46634814 52204609 57227206
2973.8 57227206 61533201 65116787 68055046 70455641 72444034 74126899 75582755 76872629
2990.1 76872629 78043324 79136407 80174387 81174088 82153535 83116287 84073848 85025853 85949737
3008.4 85949737 86846066 87723565 88568872 89374590 90133989 90825063 91440147 91995299 92503226 92950213
3028.8 92950213 93331826 93677634 94015634 94336277 94604397 94822049 95027739 95245898 95467043 95660150
3049.2I5660150J66547J62208J48607J32072J24484J07378Q7547P9715R7430J29855
3069.6I6895993J33312R5152M1569J9669N0706Q5068Q9031Q4943P2968O3759P7796
3092.1I7709966P7748M3482J2052J7857M7404M3881N823L660M0358L6085r638j6040
3116.5I8012638K4343O4003P6532N9927L4618J6404J9043L1781J7888k1786l1995J1682
3141I8315078M2844L0339Q273j9628l2455L350M5556L9613J4418J1641J8293J2660
3165.5I8489982K009N185J2338J0872O199o020n084J1217J0288N752J0055J3358K6512
3192I8592663L9249K7627J6427K1661K1547J8531K5254L3117K0825K265J2911L2949
3216.5I8865026K5749J6624J6147R650J4281J3161j6856l6305L296N7983N8836K9325
$$ plain form
3049.2 95660150 95826697 95988905 96137512 96269584 96394068 96501446 96588993 96668708 96766138 96895993
3069.6 96895993 97029305 97124457 97166026 97185695 97236401 97321469 97410500 97495443 97568411 97632170 97709966
3092.1 97709966 97787714 97831196 97843248 97861105 97908509 97952390 97958213 97961873 98002231 98038316 98028678 98012638
3116.5 98012638 98036981 98100984 98177516 98237443 98272061 98288465 98307508 98339289 98357177 98335391 98303396 98315078
3141 98315078 98357922 98388261 98396534 98376906 98344451 98347801 98393357 98432970 98447388 98459029 98477322 98489982
3165.5 98489982 98491991 98497176 98509514 98520386 98526585 98520565 98515481 98526698 98536986 98542738 98552793 98566151 98592663
3192 98592663 98631912 98659539 98675966 98697627 98719174 98737705 98762959 98796076 98816901 98819166 98832077 98865026
3216.5 98865026 98890775 98907399 98923546 98933196 98947477 98960638 98943782 98907477 98910773 98968756 99027592 99056917
3240.9I9056917n412m2742k9940L2753N0914M864k5868l302K0408R656n716j1104k3854
3267.5I9027574m6307k6756K8497M8715L8182J7876q05o68K689j2893m2188m7112j6516
3294I8970288J6433L2079J9455j9830n4562m9311K736N1200N2172K9784J6189J3322
3318.4I9079955L332k4790l9631j1188K5076K8419N871k8729n0676k8247J0974K7984
3342.9I8998350L4171J2261l6341k0897M7177N2106j305k9254q709K397m2379o5601
3367.4I8941976r340O6536Q1808L2824q52O890J8734J3608q840l7992n9247l1876K9712
3393.9I9043941K9260l4600n6672R221P7200N0753j8919m4429l3599j2749J770k2346
3418.4I8988831n7203n1295m5181q4793j07980o1452m0776o6489K1953J98048K52747
$$ plain form
3240.9 99056917 99051505 99008763 98978823 99011576 99062490 99067354 99041486 99038184 99058592 99068248 99062532 99051428 99027574
3267.5 99027574 98981267 98954511 98983008 99031723 99069905 99087781 99086976 99086308 99088997 99076104 99033916 98986804 98970288
3294 98970288 98986721 99018800 99038255 99018425 98963863 98914552 98917288 98968488 99020660 99050444 99066633 99079955
3318.4 99079955 99083287 99058497 99018866 99007678 99032754 99061173 99067044 99038315 98987639 98959392 98970366 98998350
3342.9 98998350 99032521 99044782 99008441 98987544 99034721 99086827 99085522 99056268 99047559 99049956 99007577 98941976
3367.4 98941976 98932636 98999172 99080980 99113804 99112952 99119842 99138576 99152184 99143344 99105352 99046105 99014229 99043941
3393.9 99043941 99073201 99038601 98981929 98991150 99068350 99119103 99100184 99055755 99022156 99009407 99011177 98988831
3418.4 98988831 98931628 98880333 98835152 98750359 98642379 98580927 98540151 98473662 98495615 98693663 98946410
3440.8I8946410J79261J06615R0039J17308J29908J20008R6905J0491n9164K4772N9175
3463.2I9821728j22368k18093q768K53904K41792L1805j24854j18035K7025N1397o6727
3485.7I9768806p6426j7386l8374p9769p4625l5566p933j7768N847N1463L4761k0432
3510.2I9492598n5337l6818M732P761k6119n5325l7128N949J842k5559m0435n3925
3534.6I9182236l6341M858j061m1580l9697P969L2533P915j2803M476J4252k986L141
3561.1I9122912N0234N4080l3617o0284J8644N4526K9570J997n341k837J0497K7972
3585.6I9268353P653m703K2346J4585k5165m0334l8850l4672P373N1778L8862J6767
3610.1I9283993J4514M947J9175k68p0477m7725M7648R9647N710r6047k2060J6052
$$ plain form
3440.8 98946410 99125671 99232286 99322325 99439633 99569541 99689549 99786454 99796945 99737781 99762553 99821728
3463.2 99821728 99699360 99481267 99472499 99726403 99968195 100000000 99875146 99757111 99784136 99835533 99768806
3485.7 99768806 99692380 99674994 99636620 99556851 99482226 99446660 99438727 99420959 99426806 99478269 99513030 99492598
3510.2 99492598 99437261 99400443 99405175 99412936 99386817 99331492 99294364 99300313 99302155 99276596 99236161 99182236
3534.6 99182236 99145895 99150753 99149692 99108112 99068415 99076384 99108917 99116832 99104029 99108505 99122757 99119771 99122912
3561.1 99122912 99173146 99227226 99193609 99133325 99151969 99206495 99236065 99238062 99232721 99229884 99240381 99268353
3585.6 99268353 99276006 99271303 99293649 99308234 99283069 99242735 99203885 99169213 99176586 99228364 99267226 99283993
3610.1 99283993 99298507 99303454 99322629 99322361 99251884 99204159 99251807 99351454 99357164 99261117 99239057 99255109
3634.6I9255109Q28n608o134K9749Q5050O9821o6871j19000K7662P8708k0391m7904
3659I9281019J7738M7106O2871Q8936M0281k7180J8525j448n8729k9105j1080J5312
3683.5I9444246L6937j4013q7148m8661K3413N0390P4946P6682j747l6096L7235R2071
3708I9648255O2746m8781n8621J3101K5511J5766R709j901j2946J4418O5303O0385
3732.5I9792945m1860j30737m4036J16003J54340J1343j9997O4575j6856j05202m9216
3754.9I9731302J1277Q959j0586J5521J9336m226j6284j6427O014J8251n859l6502
3779.4I9720776p892K0898k998j5486j6713J067M1050K6625Q935K2405l2931l1895
3803.9I9733841n519l9667P171P8106P3117k2072m5782k7091p6860n972N3477M0478
$$ plain form
3634.6 99255109 99255937 99250329 99244195 99273944 99358994 99428815 99361944 99242944 99270606 99349314 99328923 99281019
3659 99281019 99298757 99345863 99408734 99497670 99537951 99510771 99529296 99527848 99469119 99440014 99428934 99444246
3683.5 99444246 99481183 99467170 99380022 99331361 99354774 99405164 99480110 99556792 99555045 99518949 99556184 99648255
3708 99648255 99711001 99662220 99603599 99616700 99642211 99657977 99667686 99665785 99652839 99667257 99732560 99792945
3732.5 99792945 99751085 99620348 99576312 99692315 99846655 99857998 99838001 99902576 99885720 99780518 99731302
3754.9 99731302 99742579 99751538 99740952 99756473 99775809 99771583 99755299 99738872 99744886 99763137 99757278 99720776
3779.4 99720776 99712884 99733782 99730784 99715298 99698585 99699652 99740702 99767327 99776262 99798667 99765736 99733841
3803.9 99733841 99728322 99688655 99695826 99773932 99847049 99824977 99779195 99752104 99675244 99669272 99722749 99763227
3828.3I9763227M3100L1942J5795r149n5963o2865l7706q655M3661J14864J55854N895
3852.8A00000000k24459j04660M4030N9861J0693j5616M4077L5644n9372m0675J4079
3875.2I9763602M1586K6125q959m47m6837j9914P7009K2471l5399J7983L8218K0707
3899.7I9896145J5771k1326o2377k1576K4163J2297N448K1094N895j4294J8734M0805
3924.2I9920779J0312q315j502l904n722J5754K6726O682p713J7959K8944l886j9682
3950.7I9976432n245J8019K4646J1611J2O044K1088J0336j0682j8382k7513l1233j4150
3977.2I9960983q017j3977j5968j1850J5891J8710j4520j8674N054K8622
3997.6I9946254
$$ plain form
3828.3 99763227 99806327 99838269 99854064 99844915 99788952 99726087 99688381 99679726 99723387 99838251 99994105 100000000
3852.8 100000000 99775541 99670881 99714911 99774772 99785465 99769849 99813926 99849570 99790198 99749523 99763602
3875.2 99763602 99805188 99831313 99822354 99821907 99775070 99755156 99832165 99854636 99819237 99837220 99875438 99896145
3899.7 99896145 99911916 99890590 99828213 99806637 99830800 99843097 99848545 99869639 99875534 99861240 99879974 99920779
3924.2 99920779 99931091 99922776 99921274 99917370 99911648 99927402 99954128 99960810 99953097 99971056 100000000 99996114 99976432
3950.7 99976432 99971187 99989206 100013852 100025463 100025475 100031519 100052607 100062943 100052261 100033879 100006366 99975133 99960983
3977.2 99960983 99952966 99938989 99923021 99911171 99927062 99945772 99931252 99912578 99917632 99946254
3997.6 99946254
##END=$$ End of the data block
