##TITLE=LPD-48 tubo 4 $$ Begin of the data block
##JCAMP-DX=5.00 $$ ACD/SpecManager v 10.08
##SPECTROMETER/DATA SYSTEM=Alpha
##DATE=21 Jul 2015 09:23:44
##DATA TYPE=INFRARED SPECTRUM
##DATA CLASS=XYDATA
##ORIGIN=
##OWNER=
##NPOINTS=1765
##FIRSTX=399.76428223
##LASTX=3997.64306641
##MAXX=3997.64306641
##MINX=399.76428223
##MAXY=0.84751350
##MINY=0.15904638
##XFACTOR=1.0000000000
##YFACTOR=1.000000000000000e-9
##FIRSTY=0.84504658
##DELTAX=2.03961372
##XUNITS=1/CM
##YUNITS=ARBITRARY UNITS
##XYDATA=(X++(Y..Y))
399.8H45046580k562463J702725L326655k358854j458824L414452j052737n604207
$$ 845046580 842484117 844186842 847513497 845154643 843695819 847110271 846057534 840453327
416.1H40453327l36528K349555k014219Q01444L848016j734734k929151K965749J078128
$$ 840453327 840116799 842466354 840452135 841253579 845101595 843366861 840437710 843403459 844481587
434.4H44481587m101276J26243K756953k922952k423525L404260K94685l800988J217305
$$ 844481587 840380311 840506554 843263507 840340555 837917030 841321290 841615975 837814987 839032292
452.8H39032292K829373l136754j747012L418922q14497l839254J816392K411842l396511
$$ 839032292 841861665 838724911 836977899 840396821 839582324 835743070 837559462 839971304 836574793
471.2H36574793j142562L367126j319468l527879K060115J641989l614724n01990L309011
$$ 836574793 835432231 838799357 837479889 833952010 836012125 837654114 834039390 833537400 836846411
489.5H36846411j668334l413558K184391J230717l942549o22332L138840j923323l402650
$$ 836846411 835178077 831764519 833948910 835179627 831237078 830614746 833753586 831830263 828427613
507.9H28427613K025842R10044l994226r66370K390563k009571k966582J910984O76632
$$ 828427613 830453455 831363499 827369273 826402903 828793466 826783895 823817313 825728297 826404929
526.2H26404929l673971m18424K542496j997292l057421J962543R14991l565908o78897
$$ 826404929 822730958 822312534 824855030 822857738 819800317 821762860 822677851 819111943 818433046
544.6H18433046K491057j485586k518535K044738J162708k921641j69874K914310r15051
$$ 818433046 820924103 819438517 816919982 818964720 820127428 817205787 817035913 819950223 819035172
562.9H19035172k212643K093732J548410k327144j26362K589225p99775j891076K244651
$$ 819035172 816822529 818916261 820464671 818137527 818011165 820600390 819800615 817909539 820154190
581.3H20154190J822949k062321j52469K645135n36859j961470J800120J667261j993298
$$ 820154190 821977139 819914818 819762349 822407484 821870625 819909155 821709275 823376536 821383238
599.6H21383238m33088K385796m14670k065778J256049J414657k018989r47713K002477
$$ 821383238 820950150 823335946 822921276 820855498 822111547 823526204 821507215 820559502 822561979
618H22561979R716j546800J445949J970827r84728q2910K442658K54214j743317P50601
$$ 822561979 822571695 821024895 822470844 824441671 823456943 823374033 825816691 826070905 824327588 825078189
638.4H25078189J415253j214802n58377J964033K89738j751184L92556J192451j477302
$$ 825078189 826493442 825278640 824720263 826684296 826974034 825222850 825615406 826807857 825330555
656.8H25330555j449585Q40843j95086k221107j412988K51889m83334o7949J578331
$$ 825330555 823880970 824721813 824526727 822305620 820892632 821144521 820661187 820593238 822171569
675.1H22171569P10189p98285Q34942J853883o1929l89337J283526L92973j653969
$$ 822171569 822881758 822083473 822918415 824772298 824710369 824321032 825604558 825997531 824343562
693.5H24343562j135468q13425k587914k413094K02596R00328K06590J391053K333939
$$ 824343562 823208094 822394669 819806755 817393661 817596257 818496585 818703175 820094228 822428167
711.8H22428167P92503k0146J013636O34373o54340J39415J137793R9778k95877J011193
$$ 822428167 823220670 823200524 824214160 824848533 824194193 824333608 825471401 825571179 825275302 826286495
732.2H26286495Q92400m09007O5089R08374q7380n71132N41270M55380o42479p1525
$$ 826286495 827178895 826769888 826834977 827743351 827655971 827084839 827626109 828081489 827439010 827367485
752.6H27367485P92443j59681o96599L35813L80873m61161K54989J198172L38674j94132
$$ 827367485 828159928 828000247 827303648 827639461 828020334 827559173 827814162 829012334 829351008 829156876
773H29156876P82609O93202n04673j77801N71728m47392j204968l02613k96235j530945
$$ 829156876 829939485 830632687 830128014 829950213 830521941 830074549 828869581 828566968 828270733 826739788
793.4H26739788j433372q94070k176523l317595k577722k286792k978861k255082j036048
$$ 826739788 825306416 824412346 822235823 818918228 816340506 814053714 811074853 808819771 807783723
811.8H07783723j685500k278924q83520N3942n12659M7028J399576P49290m19378K77996
$$ 807783723 806098223 803819299 802935779 802989721 802477062 802524090 803923666 804672956 804253578 804531574
832.2H04531574N65648q89897j126230J46210j17898j007795O5684J066387J30236
$$ 804531574 805097222 804207325 803081095 803227305 803109407 802101612 802167296 803233683 803363919
850.5H03363919k7060J442134J551390N94675J353562K344609J244783M66466J475930
$$ 803363919 803336859 804778993 806330383 806925058 808278620 810623229 811868012 812334478 813810408
868.9H13810408J262307m30047l42369O31869k96891j089931J80543O31809o12557
$$ 813810408 815072715 814642668 814300299 814932168 814635277 813545346 813725889 814357698 813745141
887.2H13745141l76046R58801L30150p26640L09050R69529l88921p42316L81589j78277
$$ 813745141 813369095 814327896 814658046 813931406 814240456 815209985 814821064 814078748 814460337 814282060
907.6H14282060j586259q66651Q9526j017988j532018k54452l35694j729071j329660
$$ 814282060 812695801 811829150 811918676 810900688 809368670 809114218 808778524 807049453 805719793
926H05719793l47257j335442k137959j016021p58528k083063j942635o60360j058042
$$ 805719793 805372536 804037094 801899135 800883114 800124586 798041523 796098888 795438528 794380486
944.3G94380486j761794m95434N19931j77681P6473J652956J636863O08146J108646
$$ 794380486 792618692 792123258 792643189 792465508 792541981 794194937 795831800 796439946 797548592
962.7G97548592J597345K76267n09023K96354M5240j334012j225411n21899j376688
$$ 797548592 799145937 799422204 798913181 799209535 799254775 797920763 796695352 796173453 794796765
981.1G94796765k057433j050830o05107j489698j321435k21432n27978j341104p05540
$$ 794796765 792739332 791688502 791083395 789593697 788272262 788050830 787522852 786181748 785476208
999.4G85476208j92166j149475j612962j026391j482308k707899k691984k073229j960396
$$ 785476208 785284042 784134567 782521605 781495214 780012906 777305007 774613023 772539794 770579398
1017.8G70579398j157523L21389K15113j289368j676440j100957j380027j782954j095652
$$ 770579398 769421875 769743264 769958377 768669009 766992569 765891612 764511585 762728631 761632979
1036.1G61632979o08981j061678r53376j84178k68638p56562l94464r0837q07464j430154
$$ 761632979 761023998 759962320 759008944 758824766 758556128 757799566 757405102 757314265 756506801 755076647
1056.5G55076647j400233j847147k728105k843618k604723l036142l438890l104865
$$ 755076647 753676414 751829267 749101162 746257544 743652821 740616679 737177789 734072924
1072.8G34072924k934337l291845l241539k783060k743602k799034k310813j830160
$$ 734072924 731138587 727846742 724605203 721822143 719078541 716279507 713968694 712138534
1089.2G12138534j802743j606405j071393q26299q39055n60522j65045j13070j49370
$$ 712138534 710335791 708729386 707657993 706831694 705992639 705432117 705267072 705154002 705004632
1107.5G05004632K5630J53900J74939L90888P17520Q12948P63893P90000O96600M80175
$$ 705004632 705030262 705184162 705359101 705749989 706467509 707280457 708044350 708834350 709530950 710011125
1127.9G10011125N66840P92444O93321M08768J92106Q6189J06453J98305L45469O49273
$$ 710011125 710577965 711370409 712063730 712472498 712664604 712750793 712857246 713055551 713401020 714050293
1148.3G14050293J069725J401901J659572J993835K273917K340376K378822K468645
$$ 714050293 715120018 716521919 718181491 720175326 722449243 724789619 727168441 729637086
1164.6G29637086K322495J979411J841903J752615J294493Q50857Q91089R98080Q81612
$$ 729637086 731959581 733938992 735780895 737533510 738828003 739678860 740569949 741568029 742449641
1183G42449641R73046J195908R52363N58257O11841O69659L11434P5221J49667j21414
$$ 742449641 743422687 744618595 745570958 746129215 746741056 747410715 747722149 747797370 747947037 747825623
1203.4G47825623o45817o66260m46380n47409m15444K45869N50211K79724K85447M54962
$$ 747825623 747179806 746513546 746067166 745519757 745104313 745350182 745900393 746180117 746465564 746920526
1223.8G46920526o2704p75755q56101r65118j567007j775383j460791j626611k069831
$$ 746920526 746857822 746082067 745225966 744260848 742693841 740918458 739457667 737831056 735761225
1242.1G35761225j801669j333654j442313j310230m95553p1823k39790M8518N74947
$$ 735761225 733959556 732625902 731183589 729873359 729377806 729305983 729066193 729114711 729689658
1260.5G29689658L02612j14381K23279M06802p9394j96337J18494k06113q12531o70194
$$ 729689658 729992270 729877889 730101168 730507970 730428576 730232239 730350733 730144620 729332089 728661895
1280.9G28661895m15266q42392j017630n09501m85360j008332q91507m39346o63221
$$ 728661895 728246629 727404237 726386607 725877106 725391746 724383414 723491907 723052561 722389340
1299.2G22389340q56816k20299K68280O9023K21729P97570O84559J57535K42829L10541
$$ 722389340 721532524 721312225 721580505 721649528 721871257 722668827 723353386 723510921 723753750 724064291
1319.6G24064291l82960o80387m2379K52664k2054K25425N55932j75952j189948j587391
$$ 724064291 723681331 723000944 722958565 723211229 723189175 723414600 723970532 723794580 722604632 721017241
1340G21017241k571821m274845m595518l241718k023637j276732j92165O12319L19659
$$ 721017241 718445420 714170575 709575057 706333339 704309702 703032970 702840805 703453124 703772783
1358.4G03772783Q4877Q74877J237810M99248K57016L77178o0022j54018L51190J36674
$$ 703772783 703857660 704732537 705970347 706469595 706726611 707103789 707043767 706889749 707240939 707377613
1378.8G07377613r16481j204014R6738J612067J738429R09508K91466p0035q5831M40896
$$ 707377613 706461132 705257118 705353856 706965923 708704352 709613860 709905326 709835291 709749460 710190356
1399.2G10190356L77893l77416k71202O1632n83768j239240j397074k005517k757013
$$ 710190356 710568249 710190833 709919631 709981263 709397495 708158255 706761181 704755664 701998651
1417.5G01998651k130449q95321l07262L31998R59933J136243J83999j297473j560033
$$ 701998651 699868202 698972881 698665619 698997617 699957550 701093793 701277792 699980319 698420286
1435.9F98420286j112342j599133j968324j887739k175450k198100j539886j379669
$$ 698420286 697307944 695708811 693740487 691852748 689677298 687479198 685939312 684559643
1452.2F84559643j762628p68185J608551J174151k12192O3956O44743k81691q97050
$$ 684559643 682797015 682028830 683637381 684811532 684599340 684663296 685308039 685026348 684129298
1470.6F84129298M86791J846194J540542J115262R02474L30329n19633p14719L6299
$$ 684129298 684616089 686462283 688002825 689118087 690020561 690350890 689831257 689116538 689152837
1488.9F89152837O22392J25050j25766M53234M33385m27186j572669k597511k486884
$$ 689152837 689775229 689900279 689774513 690227747 690661132 690233946 688661277 686063766 683576882
1507.3F83576882j850307j578987p86483Q42750K350569K277076K012730J666307Q49068
$$ 683576882 681726575 680147588 679361105 680203855 682554424 684831500 686844230 688510537 689359605
1525.6F89359605M19498k43426m81426L7491o38306j609266m24087P69734J78516m5836
$$ 689359605 689779103 689535677 689054251 689091742 688453436 686844170 686420083 687189817 687368333 687322497
1546F87322497m20451q77082r98080j125097j630068o69897J703322M04954j163840
$$ 687322497 686902046 686024964 685026884 683901787 682271719 681601822 683305144 683710098 682546258
1564.4F82546258j459777j047254m65214j253903j639605k21312k4736j002669j038671
$$ 682546258 681086481 680039227 679574013 678320110 676680505 676459193 676434457 675431788 674393117
1582.8F74393117q55147j151324j400947j351416j480878j887917k135396k273202
$$ 674393117 673537970 672386646 670985699 669634283 668153405 666265488 664130092 661856890
1599.1F61856890k608657k871335k754867k654791k832949k892911k676249j949608
$$ 661856890 659248233 656376898 653622031 650967240 648134291 645241380 642565131 640615523
1615.4F40615523r16839j219213j895606j763940j669407j593053j448155j923025
$$ 640615523 639698684 638479471 636583865 634819925 633150518 631557465 630109310 628186285
1631.7F28186285j827716L3676Q41022j44303n18024m96864L74436J123488j62244
$$ 628186285 626358569 626392245 627233267 627088964 626570940 626074076 626448512 627572000 627409756
1650.1F27409756L97980L459931K133369L37720L42369J081169J449346N25535M10676
$$ 627409756 627807736 631267667 633401036 633738756 634081125 635162294 636611640 637137175 637547851
1668.4F37547851J275599R43601Q84473J267076L49223o70254k81334J826942J675010
$$ 637547851 638823450 639767051 640651524 641918600 642267823 641597569 641316235 643143177 644818187
1686.8F44818187J46270k78533r10342o79135j15514N5373J289844N87523l81589P5579
$$ 644818187 644964457 644685924 643775582 643096447 642980933 643036306 644326150 644913673 644532084 644607663
1707.2F44607663n2988p54357j426816j236737N54383J219750m8757l41177p6115m65333
$$ 644607663 644554675 643800318 642373502 641136765 641691148 642910898 642862141 642520964 642444849 641979516
1727.6F41979516r60589r83238N26547J234949k74420m02212r3222n47051p16209o02603
$$ 641979516 641018927 640035689 640562236 641797185 641522765 641120553 641027331 640480280 639764071 639161468
1748F39161468k2531M89473j25885n87999n70834n08428O0439j73211r40621r12368
$$ 639161468 639138937 639628410 639502525 638914526 638343692 637835264 637895703 637722492 636781871 635869503
1768.4F35869503n36501K17378L46660m40120p21813n25236m05013l26157n36680j202166
$$ 635869503 635333002 635550380 635897040 635456920 634735107 634209871 633804858 633478701 632942021 631739855
1788.8F31739855r84252J70887J8775p99775p48157l13819k09510m13060n76854n32925
$$ 631739855 630755603 630926490 630945265 630145490 629397333 629083514 628874004 628460944 627884090 627351165
1809.2F27351165k99037k54929m68492n32031m94242o64830p26342n08786n36740k91466
$$ 627351165 627052128 626797199 626328707 625796676 625302434 624637604 623911262 623402476 622865736 622574270
1829.6F22574270k4677m88340o38068m36425p78616j132965l65972K26497l85463o13034
$$ 622574270 622549593 622061253 621423185 620986760 620208144 619075179 618709207 618935704 618550241 617937207
1850F17937207m73141n34416o29425n72383n10991o55353r36389j005769m19020M3094
$$ 617937207 617464066 616929650 616300225 615727842 615216851 614561498 613625109 612619340 612200320 612243414
1870.3F12243414l45826o85394p03573o88672n94616n66364p19964q84056o92010m54545
$$ 612243414 611897588 611212194 610508621 609819949 609225333 608658969 607939005 607054949 606362939 605908394
1890.7F05908394o91474p33435n43535o59704p82490p02738p28011q51930o88195m14610
$$ 605908394 605216920 604483485 603939950 603280246 602497756 601795018 601067007 600215077 599526882 599112272
1911.1E99112272n80132r10103o02126k44558n34892n55754l27289m50730o49572o51955
$$ 599112272 598532140 597622037 597019911 596775353 596240461 595684707 595357418 594906688 594257116 593605161
1931.5E93605161n56946o11663p81238q18849n65707l74258n12898n71072n88238o96361
$$ 593605161 593048215 592436552 591655314 590836465 590270758 589896500 589383602 588812530 588224292 587527931
1951.9E87527931o20663m67062n38171o61850o13212o12796o59465n11170l79562n03302
$$ 587527931 586907268 586440206 585902035 585240185 584626973 584014177 583354712 582843542 582463980 581960678
1972.3E81960678o51956n68628m48227n62250o52194n22435n01275o90758o36995l33250
$$ 581960678 581308722 580740094 580291867 579729617 579077423 578554988 578053713 577362955 576725960 576392710
1992.7E76392710m04477o47426n35845m02570n46873o22213m67777m60863o31273o10411
$$ 576392710 575988233 575340807 574804962 574402392 573855519 573233306 572765529 572304666 571673393 571062982
2013.1E71062982m61936m94242o34193o97136r47475j112819m87447J36137j07050
$$ 571062982 570601046 570106804 569472611 568775475 567828000 566715181 566227734 566363871 566256821
2031.5E66256821n24938n43415m67539n81086o00219m19736m32193o37233o29723m69685
$$ 566256821 565731883 565188468 564720929 564139843 563539624 563119888 562687695 562050462 561420739 560951054
2051.9E60951054n34475o62923n37037m40658o36994o88673m57465m64618o64652o03556
$$ 560951054 560416579 559753656 559216619 558775961 558138967 557450294 556992829 556528211 555863559 555260003
2072.3E55260003m44413n42879o45876n07414m60088o23048o28829m60386m90367o43432
$$ 555260003 554815590 554272711 553626835 553119421 552659333 552036285 551407456 550947070 550456703 549813271
2092.7E49813271n72443m58003n70952o30260m68552m31299n79953n64278m43518n31375
$$ 549813271 549240828 548782825 548211873 547581613 547113061 546681762 546101809 545537531 545094013 544562638
2113.1E44562638o44565n17845m32968n89609o34909m65453m59134n94020n27501m08590
$$ 544562638 543918073 543400228 542967260 542377651 541742742 541277289 540818155 540224135 539696634 539288044
2133.5E39288044n31554o53506n43594m87089n84722n40614l95059m69089o30200n62370
$$ 539288044 538756490 538102984 537559390 537072301 536487579 535946965 535551906 535082817 534452617 533890247
2153.9E33890247m59015n63264o07967m65095m69387o40929o02305m19139m70460n98192
$$ 533890247 533431232 532867968 532260001 531794906 531325519 530684590 530082285 529663146 529192686 528594494
2174.3E28594494m90010m01080n48303o04629m72784m90070o09100n27262m07517n11825
$$ 528594494 528104484 527703404 527155101 526550472 526077688 525587618 524978518 524451256 524043739 523531914
2194.6E23531914n97954m91321m81606o23881o03080m55797n04017o31332n46992m43995
$$ 523531914 522933960 522442639 521961033 521337152 520734072 520278275 519774258 519142926 518595934 518151939
2215E18151939n45740o03795n00143n06043o27160n76258m53234n26130o04629n12004
$$ 518151939 517606199 517002404 516502261 515996218 515369058 514792800 514339566 513813436 513208807 512696803
2235.4E12696803m77016n80788n78821m86970n40793o34908n62668m85301n63681o06656
$$ 512696803 512219787 511638999 511060178 510573208 510032415 509397507 508834839 508349538 507785857 507179201
2255.8E07179201n16892m96089n87225n67317m74394n23150n95748n28872m74811n46038
$$ 507179201 506662309 506166220 505578995 505011678 504537284 504014134 503418386 502889514 502414703 501868665
2276.2E01868665n67078m93408n39422o79105o56128n58198o07729o84171o32227o01351
$$ 501868665 501301587 500808179 500268757 499589652 498933524 498375326 497767597 497083426 496451199 495849848
2296.6D95849848o89507p08371o78957p70151q49813p55966o15746o01679p58857r38534
$$ 495849848 495160341 494451970 493773013 493002862 492153049 491397083 490781337 490179658 489420801 488482267
2317D88482267r00656o79046m72695n13434p03723o23255l41505l90083o75648o78212
$$ 488482267 487581611 486902565 486429870 485916436 485212713 484589458 484247953 483857870 483182222 482504010
2337.4D82504010l87430l8952N46217P28727j132727l052086k713322r81987k4199
$$ 482504010 482116580 482077628 482623845 483352572 482219845 479167759 476454437 475472450 475448251
2355.8D75448251N1200J16766K00808J67578J43647J78278J62780N5343p0721j89215
$$ 475448251 475499451 475616217 475817025 475984603 476128250 476306528 476469308 476524651 476453930 476264715
2376.2D76264715l79771o14285p33853p00116o59376o57350o06328n31435n43714n86241
$$ 476264715 475884944 475270659 474536806 473836690 473177314 472519964 471913636 471382201 470838487 470252246
2396.6D70252246n48393n02765n29558n40435n06162n09263n46723n47707n17488n32567
$$ 470252246 469703853 469201088 468671530 468131095 467624933 467115670 466568947 466021240 465503752 464971185
2417D64971185n61029n40197n32627n74619n70923n00202m79013n31077n49227n26011
$$ 464971185 464410156 463869959 463337332 462762713 462191790 461691588 461212575 460681498 460132271 459606260
2437.4D59606260n46515n70118n23568m77761n14447n42939n22822n50300n96464n62638
$$ 459606260 459059745 458489627 457966059 457488298 456973851 456430912 455908090 455357790 454761326 454198688
2457.8D54198688m89562n00173n50598n44429n49793o02007n85645m90874m70340n40078
$$ 454198688 453709126 453208953 452658355 452113926 451564133 450962126 450376481 449885607 449415267 448875189
2478.1D48875189n71490n55843n65767n54174m86523m62770n25296n51075n19782n53191
$$ 448875189 448303699 447747856 447182089 446627915 446141392 445678622 445153326 444602251 444082469 443529278
2498.5D43529278n86599n18650m65512n15372n56260n26488n35518n75512n15879m42147
$$ 443529278 442942679 442424029 441958517 441443145 440886885 440360397 439824879 439249367 438733488 438291341
2518.9D38291341m90189n63204n60850n55128n84364n46813m63634m67062n14001n17547
$$ 438291341 437801152 437237948 436677098 436121970 435537606 434990793 434527159 434060097 433546096 433028549
2539.3D33028549n26547n57483n52922m96358m74036n29259n49972n25743n34892n39482
$$ 433028549 432502002 431944519 431391597 430895239 430421203 429891944 429341972 428816229 428281337 427741855
2559.7D27741855m94927m74214n33671n69611n29260n29736n72950n39422m84705n20885
$$ 427741855 427246928 426772714 426239043 425669432 425140172 424610436 424037486 423498064 423013359 422492474
2580.1D22492474n71549n40644n31882n79267n36412m53174m90010n69642n40584m94599
$$ 422492474 421920925 421380281 420848399 420269132 419732720 419279546 418789536 418219894 417679310 417184711
2600.5D17184711n37843n35369m48942m45813n31465n50568n12689n21124n30928m79907
$$ 417184711 416646868 416111499 415662557 415216744 414685279 414134711 413622022 413100898 412569970 412090063
2620.9D12090063m61608n26041n70774n50419n32627n23895m70966m26293m68880n27590
$$ 412090063 411628455 411102414 410531640 409981221 409448594 408924699 408453733 408027440 407558560 407030970
2641.3D07030970n26399n33431n54711n14120m57704m66764n15222n50807n73337n72920
$$ 407030970 406504571 405971140 405416429 404902309 404444605 403977841 403462619 402911812 402338475 401765555
2661.7D01765555n28276m68880m78476n38558n51283n45114n87792o30229o18101o23822
$$ 401765555 401237279 400768399 400289923 399751365 399200082 398654968 398067176 397436947 396818846 396195024
2682.1C96195024o72579o87301o77973o91592o92964o34551n61923n49972n86390o12259
$$ 396195024 395522445 394835144 394157171 393465579 392772615 392138064 391576141 391026169 390439779 389827520
2702.5C89827520o09875n90533n59300n43952n78493o05196n76734n52804n54263n33104
$$ 389827520 389217645 388627112 388067812 387523860 386945367 386340171 385763437 385210633 384656370 384123266
2722.9C84123266m95404n38677o35803o28322n73933n77868n68389n11945m65780m60506
$$ 384123266 383627862 383089185 382453382 381825060 381251127 380673259 380104870 379592925 379127145 378666639
2743.3C78666639m38958m11183m93914n92738n45770m55618m74512n40644n77718o16402
$$ 378666639 378227681 377816498 377322584 376729846 376184076 375728458 375253946 374713302 374135584 373519182
2763.7C73519182o16342n54025n20706n47349n90206o73234p66188p71135p11680o43283
$$ 373519182 372902840 372348815 371828109 371280760 370690554 370017320 369251132 368479997 367768317 367125034
2784.1C67125034n75840n70685o71208p71373p73818p03811o80685p52419p96915p81297
$$ 367125034 366549194 365978509 365307301 364535928 363762110 363058299 362377614 361625195 360828280 360046983
2804.5C60046983p60645p28965p31408p82222p72536p35044p59781p90715q18282q73506
$$ 360046983 359286338 358557373 357825965 357043743 356271207 355536163 354776382 353985667 353167385 352293879
2824.9C52293879r16481r36240r83894j073837j161844j216978j372039j612484j637102
$$ 352293879 351377398 350441158 349457264 348383427 347221583 346004605 344632566 343020082 341382980
2843.2C41382980j467079j391649j439392j402557j219541j015157q41468p53075p71433
$$ 341382980 339915901 338524252 337084860 335682303 334462762 333447605 332606137 331853062 331081629
2861.6C31081629p64132o86615o11246m77552k80500k81572m97073n72205m67121m00335
$$ 331081629 330317497 329630882 329019636 328542084 328261584 327980012 327482939 326910734 326443613 326043278
2882C26043278l98815l96460l88205m20511m62591m70400n27293o60360p06225o08445
$$ 326043278 325644463 325248003 324859798 324439287 323976696 323506296 322979003 322318643 321612418 321003973
2902.4C21003973n57154o24865o33419n12928m60088n95867p57367q06749p66039o04808
$$ 321003973 320446819 319821954 319188535 318675607 318215519 317619652 316862285 316055536 315289497 314684689
2922.8C14684689l66718j49548l3587q1390j08659l1948J3053N1260J40995K03669
$$ 314684689 314317971 314168423 314134836 314053446 313944787 313912839 313925892 313977152 314118147 314321816
2943.2C14321816J33038m4227j33157q2165r2566j47581o0111J08719K22027K33769
$$ 314321816 314454854 314410627 314277470 314195305 314102739 313955158 313895047 314003766 314225793 314459562
2963.6C14459562J68741J27077J49757K20597K60859K24322K32190K14279J6779j63406
$$ 314459562 314628303 314755380 314905137 315125734 315386593 315610915 315843105 316057384 316074163 315910757
2984C15910757j57029o4432M5597L7044j55061l11166m40121n88626o15209n84155
$$ 315910757 315753728 315689296 315734893 315771937 315616876 315305710 314865589 314276963 313661754 313077599
3004.4C13077599n56737m62592l42399l48508n23657o84023o95586o13630m71651l39717
$$ 313077599 312520862 312058270 311715871 311367363 310843706 310159683 309464097 308850467 308378816 308039099
3024.7C08039099k82586j65671J1951K7448j83165l70711l16620k58297m42922o74754
$$ 308039099 307756513 307590842 307602793 307630241 307447076 307076365 306759745 306501448 306058526 305383772
3045.1C05383772o86080m82857l65436m23759m09484l42011l20137k45571j13398j4603
$$ 305383772 304697692 304214835 303849399 303425640 303016156 302674145 302354008 302108437 301995039 301980436
3065.5C01980436j31160m17590n33283m49807k99423j79589k71112m85003o18219o75232
$$ 301980436 301849276 301431686 300898403 300448596 300149173 299969584 299698472 299213469 298595250 297920018
3085.9B97920018o28173n44280n80728n66274l88801k78711l36349m53890m88460l86148
$$ 297920018 297291845 296747565 296166837 295600563 295211762 294933051 294596702 294142812 293654352 293268204
3106.3B93268204l52383n21213n57154l26932k21789m05251p25210r22948q20339n84602
$$ 293268204 292915821 292394608 291837454 291510522 291288733 290883482 290158272 289235324 288414985 287830383
3126.7B87830383m80146n36382n57959m70847l67075l87490o00487p43776o66589n58495
$$ 287830383 287350237 286813855 286255896 285785049 285417974 285030484 284429997 283686221 283019632 282461137
3147.1B82461137m41015l36081m87417p54267p81178o69063o24656o20783o22898o29634
$$ 282461137 282020122 281684041 281196624 280442357 279661179 278992116 278367460 277746677 277123779 276494145
3167.5B76494145o27488o45756o74963o58602o00785n83291o35594o57201o42359o55413
$$ 276494145 275866657 275220901 274545938 273887336 273286551 272703260 272067666 271410465 270768106 270112693
3187.9B70112693o79969p06882p20501o76483o27875o49214o81549o89775p18087p44760
$$ 270112693 269432724 268725842 268005341 267328858 266700983 266051769 265370220 264680445 263962358 263217598
3208.3B63217598p25716o48588n91189o44028p02470o89656o99222p31409o85304n61208
$$ 263217598 262491882 261843294 261252105 260608077 259905607 259215951 258516729 257785320 257100016 256538808
3228.7B56538808m29362m38600o84768q75831q19951p12991n78195m20660m94331p38084
$$ 256538808 256109446 255670846 254986078 254110247 253290296 252577305 251999110 251578450 251084119 250346035
3249.1B50346035p87258o15389n07041n83202o51911o24299n96583n57348m37945l38420
$$ 250346035 249558777 248943388 248436347 247853145 247201234 246576935 245980352 245423004 244985059 244646639
3269.5B44646639m97371p30872p58887p30216o91504o14971o14017o49035n63368l94016
$$ 244646639 244149268 243418396 242659509 241929293 241237789 240622818 240008801 239359766 238796398 238402382
3289.9B38402382l83288n61103p29651q26209p83846n27933l03254m33817q03367j037106
$$ 238402382 238019094 237457991 236728340 235902131 235118285 234590352 234287098 233853281 233049914 232012808
3310.3B32012808j016289q63328p46280p30723p55415p18847o65277p71403r18850
$$ 232012808 230996519 230133191 229386911 228656188 227900773 227181926 226516649 225745246 224826396
3328.6B24826396r03294q17299p18370o18532o90803q76755r73895j000643q81076
$$ 224826396 223923102 223105803 222387433 221768901 221078098 220201343 219227448 218226805 217345729
3347B17345729o73428p70524j080245j095771q70198p56190p96243q10415o31600m88073
$$ 217345729 216672301 215901777 214821532 213725761 212855563 212099373 211303130 210492715 209861115 209373042
3367.4B09373042p28279j132802j178398q98391p50661q14870q84578q46728p46429
$$ 209373042 208644763 207511961 206333563 205435172 204684511 203869641 202985063 202138335 201391906
3385.7B01391906o25000m44770m42058p50958q64730n49778l78609p05197j024634
$$ 201391906 200766906 200322136 199880078 199129120 198264390 197714612 197336003 196630806 195606172
3404.1A95606172q78856o17131n78120o09994o59109p27951o34000m58494m48480m97013
$$ 195606172 194727316 194110185 193532065 192922071 192262962 191535011 190901011 190442517 189994037 189497024
3424.5A89497024m29139l34799l34248l30016k80663m17769o78823o68034m63724l19540
$$ 189497024 189067885 188733086 188398838 188068822 187788159 187370390 186691567 186023533 185559809 185240269
3444.9A85240269k06098k57552l98561l33473k03833j82107j82614j58787q9541Q5905
$$ 185240269 185034171 184776619 184378058 184044585 183840752 183658645 183476031 183317244 183227703 183313608
3465.3A83313608J64822j31652m62800l96833j67951o4716l8728o6235j10984p6950
$$ 183313608 183478430 183346778 182883978 182487145 182319194 182254478 182215750 182149515 182038531 181961581
3485.7A81961581m8891j07586j17674Q851J05157j5452j12578J05768J50010j97887
$$ 181961581 181912690 181805104 181687430 181696281 181801438 181785986 181673408 181779176 181929186 181731299
3506.1A81731299k03833J60634K68668N2020j50889j84521n4464K16320K76923Q7992
$$ 181731299 181527466 181688100 181956768 182008788 181857899 181673378 181618914 181835234 182112157 182200149
3526.5A82200149J03950J42396J9327J33052K91020N6773j40607R0792M51342M12166
$$ 182200149 182304099 182446495 182465822 182598874 182889894 182946667 182806060 182896852 183348194 183760360
3546.9A83760360m5851r8214K41086J84983j6480M8399n3794m60103j6600J356304
$$ 183760360 183714509 183616295 183857381 184042364 184025884 184074283 184020489 183560386 183543786 184900090
3567.3A84900090J239449q4311l70398L3021K29761K89008J19612l01108L2678J224652
$$ 184900090 186139539 186055228 185684830 185717851 185947612 186236620 186356232 186055124 186087802 187312454
3587.7A87312454R33811l05697r6679O02528N38126M24072K88517l30672m13805N28514
$$ 187312454 188246265 187940568 187843889 188446417 188984543 189408615 189697132 189366460 188952655 189481169
3608.1A89481169R04888M95613J34557k41891O60405J670524K56554j585573j288757
$$ 189481169 190386057 190881670 191016227 190774336 191434741 193105265 193361819 191776246 190487489
3626.4A90487489J904950K889752J74999m89503L904J1996o8292o14360j336709l96624
$$ 190487489 192392439 195282191 195457190 194967687 194971591 194983587 194915295 194300935 192964226 192567602
3646.8A92567602K570212K788379m87267r46567Q99941N61729n46038o83710j101941
$$ 192567602 195137814 197926193 197438926 196492359 197392300 197954029 197407991 196724281 195622340
3665.2A95622340j119390O51180R32903n58347J383245K144739l79592j117423j255021
$$ 195622340 194502950 195154130 196087033 195528686 196911931 199056670 198677078 197559655 196304634
3683.5A96304634j370057L37884K291888J075789p38174j053810r38684m28185N31033
$$ 196304634 194934577 195272461 197564349 198640138 197901964 196848154 195909470 195481285 196012318
3701.9A96012318P7993j389265j431614K97725J956314O62535j236454j206845m30420
$$ 196012318 196090311 194701046 193269432 193567157 195523471 196186006 194949552 193742707 193312287
3720.2A93312287m217J35750J07169p77498j397058l80263J303375J730427l77655
$$ 193312287 193308070 193443820 193550989 192773491 191376433 190996170 192299545 194029972 193652317
3738.6A93652317k855599j763895J596033K46063j396805J231343J483708j203730
$$ 193652317 190796718 189032823 190628856 190874919 189478114 190709457 192193165 190989435
3754.9A90989435j581431o4224J20089r39310q24824k20150M06251N80564n21824j206159
$$ 190989435 189408004 189343780 189463869 188524559 187699735 187479585 187885836 188466400 187944576 186738417
3775.3A86738417n77063L75852O5044n58555k15933j51783n01290p33882p77290m02644
$$ 186738417 186161354 186537206 186602250 186043695 185827762 185675979 185174689 184440807 183663517 183260873
3795.7A83260873o38992l30418J195520Q4669n49779P41989m79311k125174j276031
$$ 183260873 182621881 182291463 183486983 183571652 183021873 183763862 183284551 181159377 179883346
3814.1A79883346N43281L5912J38745J403138k45139j283601r01461p20694m86091
$$ 179883346 180426627 180462539 180601284 182004422 181759283 180475682 179574221 178853527 178367436
3832.4A78367436o03750M4614J178547M88177l46049m47944j328543k605498k159238
$$ 178367436 177763686 177808300 178986847 179475024 179128975 178681031 177352488 174746990 172587752
3850.8A72587752K230972M427553k98754k550423j596630k12952J23277o97091n1886
$$ 172587752 174818724 179246277 178947523 176397100 174800470 174587518 174710795 174013704 173961818
3869.1A73961818J008660J91644o62729j250238o88344J75357j70276L03761l1934
$$ 173961818 174970478 175162122 174499393 173249155 172560811 172736168 172565892 172869653 172837719
3887.5A72837719q88928J20848P3716j399428j356259j14083P61509J031578L91185
$$ 172837719 171948791 172069639 172143355 170743927 169387668 169273585 170035094 171066672 171457857
3905.8A71457857p07150r27373p32437p25597k29717L48315N260m59120j91316j46344
$$ 171457857 170750707 169823334 169090897 168365300 168135583 168483898 168489158 168030038 167838722 167692378
3926.2A67692378o48737m28170K53305J04338m54858o27935m22507n7966j31354l96281
$$ 167692378 167043641 166615471 166868776 166973114 166518256 165890321 165467814 165409848 165278494 164882213
3946.6A64882213j70142l710j93015l44664l49029k52814j34497j52812k91079l30597
$$ 164882213 164712071 164708361 164515346 164170682 163821653 163568839 163434342 163281530 162990451 162659854
3967A62659854k74733k38016k05860j78158k25484k81826k56628k09212k46018l02732
$$ 162659854 162385121 162147105 161941245 161763087 161537603 161255777 160999149 160789937 160543919 160241187
3987.4A60241187k51860k08109k20791k26855k87190
$$ 160241187 159989327 159781218 159560427 159333572 159046382
3997.6A59046382
$$ 159046382
##END=$$ End of the data block
