##TITLE=LPD-48 tubo 3 $$ Begin of the data block
##JCAMP-DX=5.00 $$ ACD/SpecManager v 10.08
##SPECTROMETER/DATA SYSTEM=Alpha
##DATE=21 Jul 2015 09:23:44
##DATA TYPE=INFRARED SPECTRUM
##DATA CLASS=XYDATA
##ORIGIN=
##OWNER=
##NPOINTS=1765
##FIRSTX=399.76428223
##LASTX=3997.64306641
##MAXX=3997.64306641
##MINX=399.76428223
##MAXY=0.80682361
##MINY=0.09607907
##XFACTOR=1.0000000000
##YFACTOR=1.000000000000000e-9
##FIRSTY=0.79977667
##DELTAX=2.03961372
##XUNITS=1/CM
##YUNITS=ARBITRARY UNITS
##XYDATA=(X++(Y..Y))
399.8 799776673 803299546 806823611 804014027 801676273 805249214 806674421 802239716 799887002
416.1 799887002 802058399 801356614 798497915 800509095 803388774 800382853 797092915 799268603 800046027
434.4 800046027 795613348 793844879 796511948 795709789 791613519 792208731 795232594 793115020 789501190
452.8 789501190 790613651 791559696 788056970 786637068 789520085 789705098 785927832 784989178 787007213
471.2 787007213 785721242 782680631 783647835 785510361 782858968 779870749 781406045 782261968 778830409
489.5 778830409 776798129 778274298 777496159 774030924 773403108 774986863 773363590 769904494 769631743
507.9 769631743 770269871 767490327 764382780 764482617 764240503 760894597 758608103 759194851 758247972
526.2 758247972 754882038 753692210 754508376 752590775 749003112 748499513 749244452 747043014 744572639
544.6 744572639 745436132 746267855 744172573 742971241 744854689 745746911 744130969 744131744 746388614
562.9 746388614 746602595 744957149 745939732 748585820 748480916 747217894 748796999 750873446 750088036
581.3 750088036 749481320 751706958 753296614 752177835 752032161 754256487 754881978 753193319 753240943
599.6 753240943 755230844 755363226 754043818 754782021 756477058 755769730 754287064 755158722 756526411
618 756526411 755733907 755068958 756810904 758510411 758339942 759073794 761898160 763408363 762401998
636.4 762401998 762024283 763203502 763448536 762966573 764324605 766355395 766053200 764716387 764916480
654.7 764916480 765148044 763363302 761444330 761279762 761489928 760677338 759352148 758728683 757926106
673.1 757926106 756757319 757117510 759146512 760217071 760147035 761194110 762857378 762736917 761169851
691.4 761169851 759750724 757237494 751915514 745956063 742544591 741426587 741327226 743052244 746781051
709.8 746781051 750165939 751859903 753222108 754800320 755081058 754085958 754065037 755318940 755964577
728.1 755964577 755967557 756925046 758379579 758723199 758565784 759241462 759842813 759196639 758508265 758955002
748.5 758955002 759327888 758678675 758109272 758265495 758037627 756949604 756363809 756897390 757389307 757564366
768.9 757564366 758487225 759921014 760485053 760313272 760558009 760856450 760060191 758559644 757348299
787.3 757348299 755934179 753447056 750455737 747570693 743779659 738064051 731017053 723611116
803.6 723611116 716242909 709545672 704258740 699939013 695400119 690730512 687392116 685985088
819.9 685985088 685723484 686189890 687612534 689461231 690456212 690205276 689400434 688222229 686329007
838.3 686329007 684239686 682833433 682057679 681461990 681369424 682351947 684132874 686279953 689247012
856.6 689247012 693372130 697776556 701727688 705680549 709739685 712936044 714875877 716195583
873 716195583 717049420 716941178 716138542 715661108 715685546 715510488 715165973 715385497 716031253 716382742
893.4 716382742 716671586 717454255 718234658 718247831 717680693 716981292 715806186 713813424 711637735
911.7 711637735 709846914 707994163 705721438 703541160 701664329 699397922 696477532 693549275
928 693549275 690776229 687482715 683578789 679784179 676222980 672418833 668652534 665739179 663681328
946.4 663681328 662102222 661611974 663123488 666303694 670246184 674844623 679978788 684547365 687722027
964.7 687722027 689884424 691394150 691768289 690858424 689442873 687808216 685390770 682374656 679686129
983.1 679686129 677412868 674952328 672485948 670796931 669716835 668427169 666993022 665898740
999.4 665898740 664766610 662916481 660458088 657628298 653807998 648480177 642277122 636432052
1015.7 636432052 632256985 630751610 631381392 631761968 629903734 626272380 622586668 619521141 616640091
1034.1 616640091 614015758 612396777 611681640 611129642 610856414 611249745 611701548 611377597 610311210
1052.4 610311210 608543694 605285347 600085676 593612432 586453676 578404665 569476724 560357034
1068.8 560357034 551374435 542140305 532631159 523461759 514796078 506333888 498354405 491442949
1085.1 491442949 485469848 480001092 475242287 471602261 468845278 466550350 464922518 464295685
1101.4 464295685 464396030 464863867 465803921 467208683 468653947 470022708 471864134 474463701 477298856
1119.8 477298856 480054528 482971191 485820860 487966239 489496678 490960002 492262870 493007630
1136.1 493007630 493470550 494238079 495321393 496551037 498375297 501420438 505622983 510663927 516785860
1154.4 516785860 524140418 532058179 539910495 547789156 555608571 562606335 568470538 573731959
1170.7 573731959 578479767 582097352 584643662 587055683 589739859 592393398 595087051 598055840
1187.1 598055840 600809038 602805853 604462087 606318295 607971191 608898044 609356403 609523118 608893692
1205.4 608893692 607373655 605877399 605114341 604903460 605164230 606253088 607922375 609252930 609889328
1223.8 609889328 610028684 609314859 607169211 603936732 600428820 596710026 592438340 587903023 583612740
1242.1 583612740 579466581 575404644 572108150 570210159 569554389 569837928 571182787 573433936 575764000
1260.5 575764000 577655137 579364181 580926299 581875980 582157969 582137406 581721961 580524325 578764141
1278.8 578764141 577021837 575320601 573399186 571524322 570057929 568711340 567092478 565430999
1295.2 565430999 564097047 563010097 562141359 561990201 562940538 564708352 566926360 569606125 572498024
1313.5 572498024 574762523 575959504 576319039 575961590 575125217 574645698 575242877 576692104 578253567
1331.9 578253567 579489112 580058098 579003751 574706912 566179872 554553509 542757630 533767045
1348.2 533767045 528862655 527516007 528396130 530418456 533001721 536066055 539666355 543104529
1364.5 543104529 545839369 548219144 550053060 551480114 553284407 555108488 556263804 556674838
1380.8 556674838 556776285 557758808 560419917 563320994 564813972 565636694 566649258 567537785 568446755
1399.2 568446755 569080949 569033444 569015086 568901241 568049610 566341758 563585639 559540212 554768443
1417.5 554768443 550466776 547437251 546572089 548160911 550871789 553585470 554594755 552740753
1433.9 552740753 549489737 546024799 541907787 537261069 532414973 527596831 523283362 519630790
1450.2 519630790 516458273 514221072 514944196 518422782 519934714 519920290 520716369 521651506 521030545
1468.5 521030545 520371437 522325158 526144445 529650569 532509863 534692764 535966456 536136985 536053956
1486.9 536053956 537107170 538878381 539540052 540062129 542029381 543657124 542984366 540127516 536449790
1505.2 536449790 532831967 527962923 523371637 521869004 524727762 530450821 536020696 541252077
1521.6 541252077 544809163 546341002 547453046 547344923 546789289 547318995 546611965 544470310 544958651
1539.9 544958651 547294438 547842503 547235429 546143949 545247495 544344664 542666137 540254712 540825009
1558.3 540825009 544526398 544089854 541773140 539987385 538948476 538398921 536372542 534262240 534677207
1576.6 534677207 534947991 533877850 533045650 532300413 531185925 529944479 528597891 526894331 524804592
1595 524804592 522350669 519362688 515874565 512236297 508692801 505203605 501659691 498063058 494723648
1613.4 494723648 493260592 494029582 493251115 490974009 489359856 487671405 485669971 483722121 480838031
1631.7 480838031 478135586 478337646 479222238 478150755 476309061 474703431 475186884 476447612 474928796
1650.1 474928796 475312740 481080621 483185053 482264429 482249081 484036744 485855758 485862285 486558914
1668.4 486558914 488867491 489798456 490725815 492677987 492851317 491204113 490903109 494564176 496853411
1686.8 496853411 496241540 495386213 493924886 493119657 493106365 493604779 496071249 496619463 495842963
1705.1 495842963 496127009 495829761 494286180 492166996 491074324 492816538 494555473 493955344 493370116
1723.5 493370116 493441761 493065000 492110193 491311222 493185520 495332569 494463116 493964195 494254082
1741.9 494254082 493573606 492475450 491824985 492381096 493212432 492664844 491907120 491404444 490730882
1760.2 490730882 490933627 490830213 489626706 488401026 487888545 489017814 489835531 488788694 487689883
1778.6 487689883 487324178 486894101 486416042 485810578 484337091 483302414 483959079 484099716 482837051
1796.9 482837051 481728464 481582642 481651455 481045306 480038881 479446650 479485571 479323596 478674680 478206456
1817.3 478206456 477859169 476993620 476097703 475747257 475284517 475182861 475426078 474886477 474111378 473478317
1837.7 473478317 472333819 471066952 471257806 471940905 471393347 470595360 469958842 469231784 468568921
1856.1 468568921 468080342 467547387 466741085 465611756 464551032 464437991 464710861 464176506 463274956
1874.4 463274956 462472081 461698383 461038560 460422546 459590793 458514035 457827419 457482904 456629008
1892.8 456629008 455643266 454900771 454021186 452985555 452054709 451242596 450432420 449746042 449226022
1911.1 449226022 448490173 447434157 446856648 446726650 446272433 445786029 445278466 444590837 443940490
1929.5 443940490 443239093 442503452 441876620 441168308 440217972 439565212 439345837 438871264 438082874 437311560
1949.9 437311560 436683714 436121821 435506344 434927285 434431434 433789998 432965010 432388097 432088852 431602985
1970.3 431602985 430951506 430401564 429907322 429346859 428775936 428294241 427811652 427242517 426632881 426187098
1990.7 426187098 425974578 425600290 425034523 424578160 424154371 423652381 423139006 422659487 422182262 421662301
2011.1 421662301 421099186 420599461 420204580 419712067 419019043 418163091 417317450 416881621 416774273 416539848
2031.5 416539848 416117072 415635139 415120363 414579481 414063245 413561165 413047075 412530512 412004858 411501378
2051.9 411501378 411012411 410456479 409848481 409288943 408747107 408206165 407692015 407143086 406558484 405967742
2072.3 405967742 405406415 404910296 404419929 403874159 403304636 402753651 402213514 401682705 401158959 400607616
2092.7 400607616 400051445 399547607 399071217 398559958 397994190 397432774 396930993 396445662 395943284 395450234
2113.1 395450234 394966364 394447893 393887818 393353343 392882794 392432034 391974002 391494721 390956461 390391618
2133.5 390391618 389860064 389369756 388885468 388390720 387933314 387498528 387004793 386469573 385967463 385481894
2153.9 385481894 384981364 384504229 384057939 383587301 383069217 382554740 382095516 381656259 381165266 380659401
2174.3 380659401 380206853 379756033 379252523 378750324 378298134 377865165 377433270 377022535 376593351 376075238
2194.6 376075238 375502318 374966383 374487758 374019027 373535842 373072356 372624695 372131646 371612251 371118546
2215 371118546 370612741 370080203 369572282 369100749 368604749 368075639 367592841 367163092 366696447 366170824
2235.4 366170824 365664154 365194798 364710689 364190966 363683194 363216460 362727404 362194955 361700743 361253411
2255.8 361253411 360778213 360293001 359854400 359434128 358959347 358467579 358038068 357602060 357081532 356568366
2276.2 356568366 356150299 355689168 355069667 354450583 353984147 353565454 353074193 352548093 352061301 351610214
2296.6 351610214 351154894 350705951 350213230 349627256 349038571 348594517 348321825 348035127 347513616 346862882
2317 346862882 346459329 346385360 346362919 346099466 345637739 345382750 345337838 344966114 344324201 343885690
2337.4 343885690 343820393 344215691 345300257 345984131 343681693 339403480 336599588 336567670 337697208
2355.8 337697208 338794351 339705139 340376347 340758204 340799868 340552747 340159833 339635640 338885099 337876111
2376.2 337876111 336668104 335349470 333990812 332703680 331645697 330883741 330304295 329788178 329327613
2394.5 329327613 328907043 328449279 327955544 327493221 327059299 326617628 326160192 325697780 325233400 324756145
2414.9 324756145 324265242 323796362 323346287 322864741 322384775 321967959 321536690 321015924 320514739 320116222
2435.3 320116222 319735050 319290012 318820626 318361402 317870557 317361087 316891760 316443831 315984696 315531254
2455.7 315531254 315099746 314678311 314210266 313680112 313177526 312747747 312319547 311859071 311400265 310944319
2476.1 310944319 310456932 309959292 309522539 309117585 308666438 308191478 307749212 307302117 306814492 306347013
2496.5 306347013 305928081 305511236 305055529 304585963 304142118 303687364 303205788 302770883 302396953 301986158
2516.9 301986158 301525295 301115543 300734997 300278276 299775153 299324006 298930258 298521459 298074603 297632188
2537.3 297632188 297205895 296759725 296302646 295892596 295510173 295088440 294669896 294293612 293875396 293405414
2557.7 293405414 292973578 292588294 292172372 291700900 291215748 290733486 290260643 289803356 289351255 288897544
2578.1 288897544 288452953 288026720 287596524 287138611 286657006 286162853 285681754 285241097 284813970 284381121
2598.5 284381121 283973455 283553362 283093035 282694817 282379210 282032102 281611323 281189531 280814976 280413926
2618.9 280413926 279935598 279454142 279031426 278627604 278197467 277771622 277376801 276991963 276622742 276283652
2639.3 276283652 275912255 275464624 275013715 274616897 274221480 273779660 273321658 272865772 272415698 272005856
2659.7 272005856 271634609 271243215 270770788 270252079 269788444 269342065 268822402 268273920 267720491 267100751
2680.1 267100751 266404808 265664309 264916450 264213800 263559580 262907147 262241662 261589199 260962754 260373592
2700.5 260373592 259838134 259324342 258799195 258277893 257744461 257142216 256504416 255922109 255400836 254892409
2720.9 254892409 254365265 253831297 253305495 252761811 252218902 251719266 251230299 250735134 250256270 249817073
2741.2 249817073 249444842 249120206 248810917 248476103 248085111 247683764 247306898 246908501 246460289 245967418
2761.6 245967418 245420381 244832873 244226605 243622065 243035331 242430329 241740420 240986004 240227729 239455670
2782 239455670 238670498 237912655 237202704 236448973 235555470 234627128 233779505 232922241 231959194 230971605
2802.4 230971605 230032742 229106531 228171512 227226198 226262525 225295246 224317849 223309025 222272664
2820.8 222272664 221177027 219963998 218628511 217179149 215567827 213742420 211713701 209515244
2837.1 209515244 207096338 204454362 201791286 199262396 196830496 194476411 192303509 190403417
2853.4 190403417 188749194 187273905 185945064 184767112 183788240 183031246 182452261 182069421 181911647
2871.8 181911647 181825802 181692004 181592256 181563064 181572497 181579471 181494951 181320667 181114972 180879638 180604547
2894.2 180604547 180219978 179692328 179118142 178539291 177920654 177275658 176681176 176194221 175779998 175358161
2914.6 175358161 174908131 174479499 174139127 174000382 174134344 174502492 174993202 175457090 175888151 176391184
2935 176391184 176980257 177627981 178349838 179118350 179826528 180420548 180989861 181660011 182385251 183045760
2955.4 183045760 183733597 184610769 185636774 186678603 187708065 188775957 189884648 191000238 192078382
2973.8 192078382 193050444 193936214 194743648 195362970 195802093 196166053 196487963 196805120 197097734 197240427
2994.2 197240427 197206184 197019994 196645498 196131825 195567846 194976404 194420099 193955749 193496376 192957461
3014.5 192957461 192411110 191941708 191559881 191331044 191328868 191466972 191664830 191930711 192184299 192294478
3034.9 192294478 192252174 192192316 192101464 191773742 191193327 190611675 190251812 190044418 189869940 189794108
3055.3 189794108 189812109 189842090 189898744 190036982 190227062 190307140 190186560 189984083 189812288 189672023
3075.7 189672023 189524963 189272895 188863948 188391522 187939689 187515631 187109143 186712340 186382353 186184019
3096.1 186184019 186050400 185887292 185672611 185418144 185167000 184922621 184615895 184268549 184005618 183772832
3116.5 183772832 183378741 182795361 182153359 181591079 181150138 180769473 180398092 180049434 179743141 179481596
3136.9 179481596 179175720 178721443 178208172 177722722 177265361 176904038 176611722 176212639 175666541 175110921
3157.3 175110921 174620450 174142346 173646882 173174486 172680020 172113389 171559364 171035156 170512229 170059845
3177.7 170059845 169638529 169128194 168570265 168046638 167551011 167075515 166567311 165954679 165331751 164791733
3198.1 164791733 164279088 163772702 163266927 162725598 162199020 161699444 161172420 160645097 160104975 159544170
3218.5 159544170 158998013 158419967 157820374 157308728 156909868 156556889 156176701 155667886 155064598 154500782
3238.9 154500782 153952748 153437436 153037697 152618557 152053311 151478201 151024923 150637329 150213927 149739549
3259.3 149739549 149238765 148740202 148298994 147968426 147687897 147279844 146748513 146239489 145767465 145289302
3279.7 145289302 144798130 144337848 143939853 143561170 143203288 142879128 142478645 141939774 141345590 140803903
3300.1 140803903 140417859 140146881 139776349 139221638 138578147 137941211 137352392 136776298 136217311 135737434
3320.5 135737434 135270253 134695143 134041235 133406490 132773802 132130176 131587282 131161392 130673349 130057216
3340.9 130057216 129421324 128766432 128117695 127585784 127045229 126354709 125640690 125001013 124403156 123795219
3361.3 123795219 123214178 122781172 122417592 121873632 121107697 120354973 119725354 119114719 118480928 117872499
3381.7 117872499 117346510 116872095 116426371 116054498 115651511 115090944 114561483 114265203 113991328 113475777
3402.1 113475777 112827495 112278134 111858405 111498319 111148089 110720716 110202335 109762885 109474719 109185062
3422.5 109185062 108849205 108580656 108377323 108147286 107899800 107675768 107388906 106962211 106548108 106239364
3442.9 106239364 105999164 105888538 105757549 105480708 105233863 105065860 104914859 104774922 104695670 104672454
3463.2 104672454 104651541 104611285 104434282 104158387 103979841 103894733 103835218 103843950 103866972 103754446 103600278
3485.7 103600278 103548557 103505366 103411525 103375338 103398450 103300951 103158288 103300110 103497714 103335626 103157125
3508.1 103157125 103242517 103338562 103311963 103231981 103126831 103046067 103144221 103345059 103489056 103641436 103712201
3530.6 103712201 103661694 103762209 104002610 104024231 103853613 103906766 104381457 104852073 104807727 104722098
3551 104722098 105004549 105126694 104991324 104991652 104920730 104484953 104608566 106027409 107071601 106808625
3571.3 106808625 106458403 106561795 106819153 107083410 107090019 106701531 106868371 108337581 109297834 108895347
3591.7 108895347 108754836 109283499 109724112 110127173 110405192 110022731 109649085 110324614 111344866
3610.1 111344866 111902229 112012595 111734822 112493366 114113227 114076480 112345740 111305304 113666989
3628.5 113666989 116575457 116485320 115851991 115753628 115748934 115719646 115014702 113590881 113453589 116545968
3648.8 116545968 119443983 118700333 117739052 118721709 119183362 118609756 117957346 116795614 115754515
3667.2 115754515 116746724 117830761 117394254 119184054 121341206 120687932 119433187 118032672 116555631
3685.6 116555631 117041320 119671941 120897129 120085672 119000949 118198678 118074805 118939444 119108535
3703.9 119108535 117700174 116402030 117009193 119200706 119706437 118192412 116880842 116481386 116498433
3722.3 116498433 116598062 116518699 115347721 113740131 113601469 115318134 117163911 116529658 113590382
3740.6 113590382 112473786 114966162 115443006 114381634 116370283 118142977 116859794 115395755
3756.9 115395755 115612559 115869515 115009256 114370890 114359245 114970170 115636267 115077794 113901362 113488220
3777.3 113488220 114087902 114312440 113904446 113822944 113735937 113320403 112651683 111923456 111629762 111085936
3797.7 111085936 110999204 112499893 112615101 112194598 113078900 112439036 110233024 109251380 110174954
3816.1 110174954 110305235 110596642 112103477 111735500 110453576 109605029 108963951 108581237 108009622
3834.4 108009622 108207084 109654397 110308684 110061809 109608613 108125880 105415933 103559017 106586479
3852.8 106586479 111316413 110637546 107871383 106326573 106280237 106481783 105808087 105993010 107202917
3871.2 107202917 107435279 106736340 105414063 104912363 105332360 105300866 105740242 105658621 104814403 105170280
3891.6 105170280 105238669 103732564 102538787 102717057 103681959 104893140 105364911 104580931 103585169
3909.9 103585169 102874301 102268279 102232583 102715030 102738760 102257378 102085330 102053113 101597250 101339944
3930.3 101339944 101639248 101692379 101222582 100671075 100383461 100459024 100426070 100154161 100076914 100058228
3950.7 100058228 99868521 99618621 99359639 99122465 99025860 98994479 98818332 98543748 98291136 98094456
3971.1 98094456 97992361 97978704 97917855 97727209 97515106 97336560 97117908 96855454 96636973 96493430
3991.5 96493430 96359968 96223660 96079074
3997.6 96079074
##END=$$ End of the data block
