##TITLE=LPD-48 tubo 2 $$ Begin of the data block
##JCAMP-DX=5.00 $$ ACD/SpecManager v 10.08
##SPECTROMETER/DATA SYSTEM=Alpha
##DATE=21 Jul 2015 09:23:44
##DATA TYPE=INFRARED SPECTRUM
##DATA CLASS=XYDATA
##ORIGIN=
##OWNER=
##NPOINTS=1765
##FIRSTX=399.76428223
##LASTX=3997.64306641
##MAXX=3997.64306641
##MINX=399.76428223
##MAXY=0.68322730
##MINY=0.16764073
##XFACTOR=1.0000000000
##YFACTOR=1.000000000000000e-9
##FIRSTY=0.68322730
##DELTAX=2.03961372
##XUNITS=1/CM
##YUNITS=ARBITRARY UNITS
##XYDATA=(X++(Y..Y))
399.8F83227301k068162k786041j033961P04527N53846j70648K36630J372576J199961
418.1F81236029j251996k336800j143038l41416p72297j635432j626492o56426k87235
436.5F71184897q51214j116812p17699m50194p05898j055181r87411m27067N7042k66195
456.9F64664268j115083j198948p14779m87446n82278p49171q36909j091242j254558
475.2F56633854j125574j235485j488269j507878j413763j457989j775324k189100
491.5F44440472k254665j937151j980841k635240l194988k959430k515853k959669
507.9F24002635l765344l856957l272116k897799l416181m298985m222929l256023
524.2E95016301k927661l576696l979624l606200k961814k698004l040851l181636
$$ y = [683227301, 681159139, 678373098, 677339137, 678043664, 678597510, 678426862, 678663492, 680036068, 681236029, 679984033, 677647233, 676504195, 676162779, 675390482, 673755050, 672128558, 671472132, 671184897, 670333683, 669216871, 668499172, 668048978, 667343080, 666287899, 665300488, 664873421, 664930463, 664664268, 663549185, 662350237, 661635458, 661148012, 660565734, 659816563, 658979654, 657888412, 656633854, 655508280, 654272795, 652784526, 651276648, 649862885, 648404896, 646629572, 644440472, 642185807, 640248656, 638267815, 635632575, 632437587, 629478157, 626962304, 624002635, 620237291, 616380334, 613108218, 610210419, 606794238, 602495253, 598272324, 595016301, 592088640, 588511944, 584532320, 580926120, 577964306, 575266302, 572225451, 569043815]
540.5E69043815k250552j100838j069010j611828j296819n0187R84133R55820N82873
558.9E64187407J178325K540528L156186K490878J883626K551675L542065L265202
575.2E84795892K106130J840234K884388L617764K936303J779080J783788K660334
591.5F04403913K566457J121878k1874M00841J423538J390218K97904j80542P61628
609.8F12163961J772642J156390m18604p15315N78761J415134P01427j41799L30448
628.2F16843045J359522J54972l869593o019413k221406L730595N467713K554417j027346
646.6F16972506k936959m508555p128358j0011017j1393249j1453689j1916995j2750864
662.9E44872820j1714458j1128545j0687053n434394j796842R33469N093395R104073
$$ y = [569043815, 566793263, 565692425, 564623415, 563011587, 561714768, 561664581, 562648714, 563604534, 564187407, 565365732, 567906260, 571062446, 573553324, 575436950, 577988625, 581530690, 584795892, 586902022, 588742256, 591626644, 595244408, 598180711, 599959791, 601743579, 604403913, 606970370, 608092248, 608070374, 608471215, 609894753, 611284971, 611582875, 611402333, 612163961, 613936603, 615092993, 614674389, 613959074, 614537835, 615952969, 616654396, 616512597, 616843045, 618202567, 618357539, 614487946, 608468533, 606247127, 609977722, 615445435, 617999852, 616972506, 614035547, 609526992, 602398634, 592387617, 580994368, 569540679, 557623684, 544872820, 533158362, 522029817, 511342764, 505908370, 504111528, 505044997, 510138392, 519242465]
679.2E19242465J1137367J1269569J1144221J1341155J0056674N671918r19699p432580
695.5E71511090j1873961j2602567r006024k222657N023837R991408J1508405J0501980
711.8E72831511R074569Q231044P056296M454911J540184N94139J696944K533376J456082
730.2F09469056l96252r08434j28508j36613j646877k869248j982749M32134K412975
748.5F04245484L130197L401637L783882L442168J668692l32773k74121K079010M403829
766.9F25548005M801929L931642L448128L488481K713204N28514j719594k709627l154457
785.3F36876225m641830p007003q553088q727550r148837j1420607j5070319j8119812
801.6E54187179j9107283j8229544j6626298j4865250j2781292j0502279q515059o800920
$$ y = [519242465, 530379832, 541649401, 552793622, 564134777, 574191451, 579863369, 578943670, 571511090, 559637129, 547034562, 538028538, 535805881, 540829718, 550821126, 562329531, 572831511, 581906080, 590137124, 597193420, 601648331, 603188515, 603782654, 605479598, 608012974, 609469056, 609072804, 608164370, 608035862, 607899249, 606252372, 603383124, 601400375, 601832509, 604245484, 607375681, 610777318, 614561200, 618003368, 619672060, 619339287, 619065166, 621144176, 625548005, 630349934, 634281576, 637729704, 641218185, 643931389, 644459903, 642740309, 640030682, 636876225, 632234395, 625227392, 616674304, 607946754, 598797917, 587377310, 572306991, 554187179, 535079896, 516850352, 500224054, 485358804, 472577512, 462075233, 453560174, 446759254]
817.9D46759254m625798j633673J349717L031820K939731J886725R28164K35289l52919
836.2D50518310l66419J014858L724992O424845P855981Q218229Q578628R315938R878606
854.6E05163968R828508R513795R425521R314835Q474529O766915M976571L743171
870.9E67207813K584756Q02934j226008k366245k218902j576483j199305r31561k63512
889.3E60813487P36594J398444J269042O92070K46108k50817j405299l047704m211068
907.6E56240857m238606l445029k579451k003669j637459j448155j720905k632260
923.9E36535323l791154m566252m817247n001486n439758n847216n776524n264580
940.3D96031106m643500l909439k717197q31753J527905L858060N832046P242263P830143
$$ y = [446759254, 442133456, 440499783, 441849500, 444881320, 447821051, 449707776, 450635940, 450871229, 450518310, 450151891, 451166749, 454891741, 461316586, 469172567, 477390796, 485969424, 495285362, 505163968, 514992476, 524506271, 533931792, 543246627, 551721156, 558488071, 563464642, 567207813, 569792569, 570595503, 569369495, 567003250, 564784348, 563207865, 562008560, 561076999, 560813487, 561550081, 562948525, 564217567, 564909637, 565155745, 564904928, 563499629, 560451925, 556240857, 552002251, 548557222, 545977771, 543974102, 542336643, 540888488, 539167583, 536535323, 532744169, 528177917, 523360670, 518359184, 512919426, 507072210, 501295686, 496031106, 491387606, 487478167, 484760970, 483929217, 485457122, 489315182, 495147228, 502389491, 510219634]
958.6E10219634P538139O582082N286455L966749K730906J415073j42037j757503l083825
977E32755673l957272m405379m565597m463076m029691l387452k775192k327382k074361
995.3E00770271k040655k183228k418667k893567l915996n494386p384360r517938
1011.6D64921474j1864990j2937665r212285n20974O125361N113840l29942m322499
1028D36972320n242973m600764l823429l201187k458215j503467n66125P9989L45946
1046.3D16002095K86221j71125j240730k952605m912705o598651p825136q671373r253234
1064.7C74662757r582520r620428r527921r586990r833783j0018736r926707r550065
1081B97015607r005546q334786p507741o531805n508244m547298l646434k740159j819298
$$ y = [510219634, 517757773, 524339855, 529626310, 533593059, 536323965, 537739038, 537597001, 535839498, 532755673, 528798401, 524393022, 519827425, 515364349, 511334658, 507947206, 505172014, 502844632, 500770271, 498729616, 496546388, 494127721, 491234154, 487318158, 481823772, 474439412, 464921474, 453056484, 440118819, 430906534, 430385560, 436510921, 441624761, 441294819, 436972320, 431729347, 427128583, 423305154, 420103967, 417645752, 416142285, 415576160, 415656149, 416002095, 416288316, 416117191, 414876461, 411923856, 407011151, 400412500, 392587364, 383915991, 374662757, 365080237, 355459809, 345931888, 336344898, 326511115, 316492379, 306565672, 297015607, 288010061, 279675275, 272167534, 265635729, 260127485, 255580187, 251933753, 249193594, 247374296]
1099.4B47374296j011178m49076j05217L15800J023084J807064K442509L010303L667533
1117.7B58075118M336625M670382M451722L892600L317595K854347K327383J631051
1134B85556823J069188Q98987J034320J327067J857192K869784M470110O431967Q394003
1152.4C13909441J0210216J1927367J3396441J4204562J4054656J3085634J1801243
1166.7D02589560J0565906R226472P448017N339056L492594K507568K717077M119814
1183D48006064N970835O937296O379723M964560L712655L057807K752096K123832P46549
1201.3D84651417j121670k934605m325331m980743m221200j458705K480179N460471
1217.7D73549813O038040M569173K265870j00731k427042m707813o587953p626295
$$ y = [247374296, 246363118, 245914042, 245808825, 246124625, 247147709, 248954773, 251397282, 254407585, 258075118, 262411743, 267082125, 271533847, 275426447, 278744042, 281598389, 283925772, 285556823, 286626011, 287524998, 288559318, 289886385, 291743577, 294613361, 299083471, 305515438, 313909441, 324119657, 336047024, 349443465, 363648027, 377702683, 390788317, 402589560, 413155466, 422381938, 429829955, 435169011, 438661605, 441169173, 443886250, 448006064, 453976899, 460914195, 467293918, 472258478, 475971133, 479028940, 481781036, 483904868, 484651417, 483529747, 480595142, 476269811, 471289068, 467067868, 465609163, 468089342, 473549813, 479587853, 484157026, 486422896, 486322165, 483895123, 479187310, 472599357, 464973062]
1234D64973062p884651p874191p978380q075922p774055o921828n790621m786104m061729
1252.3D03825581l707588m020810n174398o473780o148636k862990K565235P676720
1268.6C85679334J0447503J0495722Q773327O405323M016877K057224Q87275M17828
1285D29180413J37032l79205j043439j433760j425624j215339q62240j48893J115531
1303.3D23924476K750218M205435N002499N173326M984766M403829L111124J108408
1319.6D54664081m54902j90080J603365L343851M061550L977656L290862J377165k864659
1338D68808889r876817j7187119k0916074j9108951j2811661n651772j32620L389686
1354.3C86513561N332738O147444O534189O789118O449312N752117N301475M970819
$$ y = [464973062, 457088411, 449214220, 441235840, 433159918, 425385863, 418464035, 412673414, 407887310, 403825581, 400117993, 396097183, 390922785, 384449005, 378300369, 375437379, 378002614, 385679334, 396126837, 406622559, 415395886, 421801209, 425818086, 427875310, 428762585, 429180413, 429317445, 428938240, 427894801, 426461041, 425035417, 423820078, 422957838, 422808945, 423924476, 426674694, 430880129, 435882628, 441055954, 446040720, 450444549, 453555673, 454664081, 454209179, 454019099, 455622464, 458966315, 463027865, 467005521, 470296383, 471673548, 468808889, 458932072, 441744953, 420828879, 401719928, 388908267, 383256495, 383123875, 386513561, 391846299, 397993743, 404527932, 411317050, 417766362, 423518479, 428819954, 433790773]
1370.6D33790773N034924N299359N062253M605174M027903L667980M321724N221904
1386.9D71031994M623055L342241K815068K295762J196474J44184n49257j027644k082079
1405.3D81789798l954292o254285q996249j1460214j2758047j3721704j3260454o533653
1421.6D04850900L383845J1201978J3519257R818882K156079m782498j0492712j3975203
1437.9D15680528j2086124r526282p667303n963266m757434k647728R42409N073786
1454.3C79048586R566933J0902375P384717N716324N473018M057854K831370L905654
1470.6D28886831O641596Q012444P253498N810589L830373J689523J20581l89874o40661
1488.9D61214900j062036M2499K418071K931177k21461l368497n087554r838075k0098328
$$ y = [433790773, 438825697, 444125056, 449187309, 453792483, 457820386, 461488366, 465810090, 471031994, 475655049, 478997290, 481812358, 484108120, 485304594, 485448778, 484899521, 483871877, 481789798, 477835506, 471581221, 462584972, 451124758, 438366711, 424645007, 411384553, 404850900, 408234745, 419436723, 432955980, 442774862, 444930941, 440148443, 429655731, 415680528, 403594404, 394068122, 386400819, 380437553, 375680119, 373032391, 373974800, 379048586, 388615519, 399517894, 406902611, 412618935, 418091953, 422149807, 424981177, 428886831, 435528427, 443540871, 450794369, 456604958, 460435331, 462124854, 462245435, 461855561, 461214900, 460152864, 460195363, 462613434, 465544611, 465323150, 461954653, 456867099, 447029024, 426930696]
1507.3D26930696j9512952q063733N556255J9762755K7802497K5556922K0197988J3109534
1523.6E11339962P216394M777611L326833K809048K286195J395107J602709J997531
1539.9E36751390L73601q71658q57055m36962l4392J36912L36349P26819L25918k179801
1560.3E34271121k731383j982212j786530k330005l679872l810227k573847j245678
1576.6E14131367J03295J081228J289785P56026n5016q10682j636923k848863m724622
1595E07285595o969512q870720r937555r917408r156078q657039p869720m152477K540052
1613.4D44295138R825230J3533950R467333M950404K465010L38376q15571j219004
1629.7D82840866r04977k73645n98163j546353j343757n42134L29197R04440O37204
$$ y = [426930696, 407417744, 399354011, 404910266, 424673021, 452475518, 478032440, 498230428, 511339962, 518556356, 523333967, 526660800, 529469848, 531756043, 533151150, 534753859, 536751390, 537124991, 536253333, 535396278, 534959316, 534924924, 535061836, 535398185, 536125004, 536450922, 534271121, 531539738, 529557526, 527770996, 525440991, 521761119, 517950892, 515377045, 514131367, 514234662, 515315890, 516605675, 517361701, 517306685, 516496003, 514859080, 512010217, 507285595, 500316083, 491445363, 481507808, 471590400, 462434322, 453777283, 445907563, 441755086, 444295138, 454120368, 467654318, 477121651, 482072055, 484537065, 484875441, 484059870, 482840866, 481935889, 481662244, 481064081, 479517728, 478173971, 477631837, 477961034, 478865474, 479502678]
1648D79502678O35505J664102J485884R7185N52506J557678J972317J605690J381188
1666.4D90454733J647503J281082M81010K19196j00225k68519J84416N70625k43246
1684.7D94226575j347274j244783j022816q49575p77691r64374q97347q68798o20812
1703.1D85633105k54661p40409j682222k194494k274990k160906k113790j658499l17216
1721.5D72235918J252711K462000L230422L656745L602356L312170K120972J122832
1737.8D92996126J151324R94533O53356O57827P52985N53102N1439r8020J75982L78788
1758.2D98267442M59850M35084K48074L77208P24763P73788L30865l60250n03123k59042
1778.6E00494659k42114m87507o60836o36727l98755j96427m71115p86454m95255j9192
$$ y = [479502678, 480138183, 481802285, 483288169, 483385354, 483937860, 485495538, 487467855, 489073545, 490454733, 492102236, 493383318, 493864328, 494083524, 493983299, 493714780, 493899196, 494469821, 494226575, 492879301, 491634518, 490611702, 489762127, 488984436, 488020062, 487122715, 486253917, 485633105, 485378444, 484638035, 482955813, 480761319, 478486329, 476325423, 474211633, 472553134, 472235918, 473488629, 475950629, 479181051, 482837796, 486440152, 489752322, 491873294, 492996126, 494147450, 495141983, 495795339, 496453166, 497206151, 497759253, 497810692, 497712672, 497888654, 498267442, 498727292, 499162376, 499410450, 499787658, 500512421, 501286209, 501617074, 501256824, 500753701, 500494659, 500252545, 499765038, 499104202, 498467475, 498068720, 497872293, 497401178, 496614724, 496119469, 496100277]
1799D96100277J22726N6684J95324N25117P37995O23971L87520L71575M68284M49270
1819.4E00038743L88265L85940L59356L06428J73688k26438m21942k17497p7367j00255
1839.8E00608921o8009r0480l91423n95570n71936n51552n18590m48287m27425n25176
1860.2D96420473o45608o03169m34071n13703r59753j183868j036197q76427q65131
1878.5D89302546r62824j041472j044601j055479j251251j648873j884460j909256
1894.8D78504330k007842k144218k152055j964390j569570j088410p05004l84062M4316
1913.2D66533095N42670Q94010Q24779N66572M80146L92258K21669J9312j46478k05308
1933.6D70122725k19137k67297l22520l38138l45051l37571l44306l89397l61443k61694
$$ y = [496100277, 496223003, 496279687, 496475011, 497000128, 497738123, 498362094, 498749614, 499121189, 499589473, 500038743, 500427008, 500812948, 501172304, 501478732, 501652420, 501425982, 501004040, 500786543, 500709176, 500608921, 500540912, 500450432, 500059009, 499463439, 498891503, 498339951, 497821361, 497373074, 496945649, 496420473, 495774865, 495171696, 494737625, 494223922, 493264169, 492080301, 491044104, 490167677, 489302546, 488339722, 487298250, 486253649, 485198170, 483946919, 482298046, 480413586, 478504330, 476496488, 474352270, 472200215, 470235825, 468666255, 467577845, 466872841, 466488779, 466533095, 467075765, 467969775, 468794554, 469361126, 469841272, 470233530, 470455199, 470474511, 470328033, 470122725, 469903588, 469636291, 469313771, 468975633, 468630582, 468293011, 467948705, 467559308, 467197865, 466936171]
1954D66936171k46793l19302l64482l13014j71483r4503j94639k69592j49935o557
1974.4D64805871j8179j30534j68622q1986L5912Q3804N8651O8635J12891J08152O2496
1996.8D64937091M977m470N6475P5251j4216j23560j34439n3972j1026j17839k80559
2019.2D64333713l19421l50207l45081p4417J37568O1989l6508j38462k70575l02524
2039.6D62696075k44200k21580k91199l80516l93092l26097k96414l67552m16130l43204
2060D59416091k32428k16454l26395m22388l84182k93166k85506l71724m15683l50416
2080.4D56117749k86221l10928l82960m01735l27915k58058k83450l49343l38316k47598
2100.8D52931225k03579k60651l30061l19034k44528k31177l40938m29124l60936k40892
$$ y = [466936171, 466689378, 466370076, 466005594, 465692580, 465521097, 465426594, 465231955, 464962363, 464812428, 464805871, 464787692, 464657158, 464488536, 464406550, 464442462, 464526266, 464584917, 464653552, 464766443, 464874595, 464937091, 464942068, 464937598, 464994073, 465069324, 465055108, 464931548, 464797109, 464743137, 464732111, 464614272, 464333713, 464014292, 463664085, 463319004, 463244587, 463382155, 463444144, 463407636, 463269174, 462998599, 462696075, 462451875, 462230295, 461939096, 461558580, 461165488, 460839391, 460542977, 460175425, 459759295, 459416091, 459183663, 458967209, 458640814, 458218426, 457834244, 457541078, 457255572, 456883848, 456468165, 456117749, 455831528, 455520600, 455137640, 454735905, 454407990, 454149932, 453866482, 453517139, 453178823, 452931225, 452727646, 452466995, 452136934, 451817900, 451573372, 451342195, 451001257, 450572133, 450211197, 449970305]
2121.2D49970305k39432l47584l99262l20524k26736k33024l15875l54737k77013j92612
2141.6D47063506k52396l66360l51280k48999k14189l01510m01258l49254k03073j68055
2162D44207132k87384m04924l58969k15113j76370k60324l10123k44200j59442j88798
2182.4D41601485k93463l01153j81258j30683k44379l65227l39896k30014k09600l04252
2202.8D39001560l86566l65853k78741k55615l57419m29660l45588k46405k81185l80695
2223.2D35673833l89159k91318k38686l09497m04746l94374k89380k43366l06666l73334
2243.6D32433307l58730k89560k71111l42429m08560l66718k75045k63900l29822l56883
2264D29170549k91646k27153k65866l63648l91037l06904k35170l08037m46200n00053
$$ y = [449970305, 449730873, 449383289, 448984027, 448663503, 448436767, 448203743, 447887868, 447533131, 447256118, 447063506, 446811110, 446444750, 446093470, 445844471, 445630282, 445328772, 444927514, 444578260, 444375187, 444207132, 443919748, 443514824, 443155855, 442940742, 442764372, 442504048, 442193925, 441949725, 441790283, 441601485, 441308022, 441006869, 440825611, 440694928, 440450549, 440085322, 439745426, 439515412, 439305812, 439001560, 438614994, 438249141, 437970400, 437714785, 437357366, 436927706, 436582118, 436335713, 436054528, 435673833, 435284674, 434993356, 434754670, 434445173, 434040427, 433646053, 433356673, 433113307, 432806641, 432433307, 432074577, 431785017, 431513906, 431171477, 430762917, 430396199, 430121154, 429857254, 429527432, 429170549, 428878903, 428651750, 428385884, 428022236, 427631199, 427324295, 427089125, 426781088, 426334888, 425834835]
2284.4D25834835m68284m70966n66274o16730n11348l35246k18988j80274j46896o3180
2304.8D22256649L6507L3707r7424k16544k40922k54422l35425m48257n08010n37396
2325.2D19688463n97656o44832p00534p66814o52551l53545j29432m2259R3639K36153
2345.6D16130632J3262l27855l01123J3977J57416K0087j32650j55240j51456j83314
2366D15083736k23011k63094k61754k16514k10345k84314l57121l45856k98471l00526
2386.4D12322730l23624l15249k72035k23249k20508k62737k96801k88785k63363k74390
2406.8D09581989l29316l76641l80934l63707l73095m24713m54307m13001l56048l45379
2427.2D05764848l44902l07471k72155k65389k81602l28959l54528l19779k96801l33846
$$ y = [425834835, 425366551, 424895585, 424329311, 423712581, 423201233, 422865987, 422646999, 422466725, 422319829, 422256649, 422293156, 422326863, 422229439, 422012895, 421771973, 421517551, 421182126, 420733869, 420225859, 419688463, 419090807, 418445975, 417745441, 416978627, 416326076, 415972531, 415843099, 415800840, 415894479, 416130632, 416143894, 415816039, 415514916, 415528893, 415686309, 415706396, 415573746, 415418506, 415267050, 415083736, 414860725, 414597631, 414335877, 414119363, 413909018, 413624704, 413267583, 412921727, 412623256, 412322730, 411999106, 411683857, 411411822, 411188573, 410968065, 410705328, 410408527, 410119742, 409856379, 409581989, 409252673, 408876032, 408495098, 408131391, 407758296, 407333583, 406879276, 406466275, 406110227, 405764848, 405419946, 405112475, 404840320, 404574931, 404293329, 403964370, 403609842, 403290063, 402993262, 402659416]
2447.6D02659416l74257l63440l26425l27646l66122l96222m15712m23104m17501m26143
2467.9C98822844m51982m51505m31150m32700m25786l92526l61979l52622l67432l77179
2488.3C94777983l54141l38614l58104l78698l93451l91513l61502l40044l59416l96192
2508.7C91106308l96640l71605l68625l68058l48121l39240l34650l26097l29167l14623
2529.1C87609482k48552j86383k08885k58356k54244k42442k48879k49237k63720k84762
2549.5C85164022k70098k45422k74331l48448l83854l65615l75390m29988m62502m41581
2569.9C81566793m08948m47690n34564n52148n02497m77344n18203n79536n82933n31167
2590.3C76431763m97877n14687n21928m70519l99232l35365k86102k49714j97709j50710
$$ y = [402659416, 402285159, 401921719, 401595294, 401267648, 400901526, 400505304, 400089592, 399666488, 399248987, 398822844, 398370862, 397919357, 397488207, 397055507, 396629721, 396237195, 395875216, 395522594, 395155162, 394777983, 394423842, 394085228, 393727124, 393348426, 392954975, 392563462, 392201960, 391861916, 391502500, 391106308, 390709668, 390338063, 389969438, 389601380, 389253259, 388914019, 388579369, 388253272, 387924105, 387609482, 387360930, 387174547, 386965662, 386707306, 386453062, 386210620, 385961741, 385712504, 385448784, 385164022, 384893924, 384648502, 384374171, 384025723, 383641869, 383276254, 382900864, 382470876, 382008374, 381566793, 381157845, 380710155, 380175591, 379623443, 379120946, 378643602, 378125399, 377545863, 376962930, 376431763, 375933886, 375419199, 374897271, 374426752, 374027520, 373692155, 373406053, 373156339, 372958630, 372807920]
2610.7C72807920j67966k53796l40283l77715m02361m73649n47468n20319l94612k67625
2631.1C69062126k04444j89543j73509j72258k38448l34144l94702m11361m19408m48674
2651.5C66075635m68493m68999m64737m50790m64529n22613n77957o31362p00265p80702
2671.9C60545188q84890j008749j152516j313060j466513j586378j624435j577258
2688.2C49931389j523375j482308j404792j294464j194746j117944j042337r71227
2704.5C39900196r10849q67843q58039q51691q26657q20100q34703q22276p87407p57754
2724.9C31562877p21395o93679o83159o41495n78463n24789m58926l75718k94566k42799
2745.3C26347888k39462k80678l41267m19676n33909o67691q09789r41306j029521
$$ y = [372807920, 372639954, 372386158, 372045875, 371668160, 371265799, 370792150, 370244682, 369724363, 369329751, 369062126, 368857682, 368668139, 368494630, 368322372, 368083924, 367749780, 367355078, 366943717, 366524309, 366075635, 365607142, 365138143, 364673406, 364222616, 363758087, 363235474, 362657517, 362026155, 361325890, 360545188, 359660298, 358651549, 357499033, 356185973, 354719460, 353133082, 351508647, 349931389, 348408014, 346925706, 345520914, 344226450, 343031704, 341913760, 340871423, 339900196, 338989347, 338121504, 337263465, 336411774, 335585117, 334765017, 333930314, 333108038, 332320631, 331562877, 330841482, 330147803, 329464644, 328823149, 328244686, 327719897, 327260971, 326885253, 326590687, 326347888, 326108426, 325827748, 325486481, 325066805, 324532896, 323865205, 323055416, 322114110, 321084589]
2763.7C21084589j115293j240164j360654j448185j512736j575112j633763j666546
2780C09532136j703322j767099j806855j824051j896888j998544k046317k025187k027422
2798.4B92436451k127677k213210k227158k234101k245605k294064k377480k410412
2814.7B74306744k421796k490491k601862k763271l017098l385126l878504m492268
2831B49256328n181924n849153o363287o654069o670535o330430n713657n023539m380315
2849.3A97089419l776267l181294k637237k171010j787230j476333j148820p66307
2865.7A80144921m03360o0811K47076L71158L57881L87997M10884L53456K77504J89498
2886.1A82276204K3648j87009l49656n24446q06570j118943j353756j505673j571462
$$ y = [321084589, 319969296, 318729132, 317368478, 315920293, 314407557, 312832445, 311198682, 309532136, 307828814, 306061715, 304254860, 302430809, 300533921, 298535377, 296489060, 294463873, 292436451, 290308774, 288095564, 285868406, 283634305, 281388700, 279094636, 276717156, 274306744, 271884948, 269394457, 266792595, 264029324, 261012226, 257627100, 253748596, 249256328, 244074404, 238225251, 231861964, 225207895, 218537360, 212206930, 206493273, 201469734, 197089419, 193313152, 190131858, 187494621, 185323611, 183536381, 182060048, 180911228, 180144921, 179741561, 179680750, 179927826, 180298984, 180656865, 181044862, 181455746, 181809202, 182086706, 182276204, 182299852, 182112843, 181763187, 181238741, 180432171, 179313228, 177959472, 176453799, 174882337]
2904.4A74882337j550123j446589j241878j013398q49143o68958l96266p5251K85163
2922.8A67925894P03320J182690J648799J987770K253369K513855K722085K857670
2939.1A83795452K952695L038064L081292L047332L040969L102705L113940L116712
2955.4B08289161L251613L508806L816381M136294M474387M800215N005941N036547
2971.7B42319345M856974M468501L973037L364474K594053J863689J413911J234800
2988B66088784J220852J194000R18985L59177l97265j238793j994759k540052k790689
3006.4B60820240k684236k241522j615673j080424q44210r00060r53674n02363O44698
3024.7B50642776K052904L144383L627926L432244K702654J812994J050532L30418
$$ y = [174882337, 173332214, 171885625, 170643747, 169630349, 168781206, 168112248, 167715982, 167640731, 167925894, 168629214, 169811904, 171460703, 173448473, 175701842, 178215697, 180937782, 183795452, 186748147, 189786211, 192867503, 195914835, 198955804, 202058509, 205172449, 208289161, 211540774, 215049580, 218865961, 223002255, 227476642, 232276857, 237282798, 242319345, 247176319, 251644820, 255617857, 258982331, 261576384, 263440073, 264853984, 266088784, 267309636, 268503636, 269422621, 269781798, 269384533, 268145740, 266150981, 263610929, 260820240, 258136004, 255894482, 254278809, 253198385, 252354175, 251454115, 250500441, 249998078, 250642776, 252695680, 255840063, 259467989, 262900233, 265602887, 267415881, 268466413, 268796831]
3041.1B68796831m58955j076490j214653p93547j79Q86739J720756K378196K794355
3059.4B73033053L019213L016055K724588K191692J569450J035721O23047K83748l6419
3077.8B87460148l64691n57869n40048m31299k41042N8025M00097P90208J159013J283913
3098.2B89016455J093746P44164M78804L70204K15024n3644k07365k12341l13998n33521
3118.6B90597528p26133q18313o99520l65018j640K47389L81709M07934L52233K11955
3139B89588124l1859k08110k30491k22772k10047j98960l02017m72844n30451m76837
3159.4B86703736m20511m05461m08828m11332m51177n17607n36263m85182m39792m85599
3179.8B82141984n73963n96583n66900n49853n37932n38498n54472n56082n70416n76079
$$ y = [268796831, 268337876, 267261386, 266046733, 265253186, 265253007, 266139746, 267860502, 270238698, 273033053, 276052266, 279068321, 281792909, 283984601, 285554051, 286589772, 287212819, 287496567, 287460148, 287095457, 286537588, 285997540, 285566241, 285325199, 285383224, 285783321, 286573529, 287732542, 289016455, 290110201, 290854365, 291333169, 291703373, 291918397, 291864753, 291657388, 291445047, 291131049, 290597528, 289871395, 289053082, 288353562, 287988544, 287986904, 288234293, 288616002, 289023936, 289376169, 289588124, 289556265, 289348155, 289117664, 288894892, 288684845, 288485885, 288183868, 287711024, 287180573, 286703736, 286283225, 285877764, 285468936, 285057604, 284606427, 284088820, 283552557, 283067375, 282627583, 282141984, 281568021, 280971438, 280404538, 279854685, 279316753, 278778255, 278223783, 277667701, 277097285, 276521206]
3200.1B76521206n39363n34951n93871o51538o68616o50554o16074o17176o46860o25759
3220.5B70376444n80341n64724n32359m96149m86612m90964n92291p05600o59466n73605
3240.9B64694333n24133m82351n34654o40958o46889n63026n19633n55068n98997n98491
3261.3B59030133n63293n17458m47780m00394m81725n97983o12527n97835n91606n64069
3281.7B53655463n33819n18560n14150m74632m47809n21988o18637o53609o21885n16862
3302.1B48233512m25309n04792p01397q17553q04826p25374o87346p07149p03395o78807
3322.5B41477564o77586p36281q04603q06034p74189o92815n92098o55397q06973q44970
3342.9B34086618q33035p95990p21648p55251q89346r31933q61511q08909q03560p77394
$$ y = [276521206, 275981843, 275446892, 274853021, 274201483, 273532867, 272882313, 272266239, 271649063, 271002203, 270376444, 269796103, 269231379, 268699020, 268202871, 267716259, 267225295, 266633004, 265927404, 265267938, 264694333, 264170200, 263687849, 263153195, 262512237, 261865348, 261302322, 260782689, 260227621, 259628624, 259030133, 258466840, 257949382, 257501602, 257101208, 256619483, 256021500, 255408973, 254811138, 254219532, 253655463, 253121644, 252603084, 252088934, 251614302, 251166493, 250644505, 250025868, 249372259, 248750374, 248233512, 247808203, 247303411, 246602014, 245784461, 244979635, 244254261, 243566915, 242859766, 242156371, 241477564, 240799978, 240063697, 239259094, 238453060, 237678871, 236986056, 236393958, 235738561, 234931588, 234086618, 233253583, 232457593, 231735945, 230980694, 230091348, 229159415, 228297904, 227488995, 226685435, 225908041]
3363.3B25908041o92636o36890p24852q90851r41083q55327p68602p19502o95661o93426
3383.7B18289211p07656o93932n96687n77629p23868p37489n38468m63635o52939q38771
3404.1B11758137p69347n99101n44936n55947n75394n91188n75439n51521n23284m61594
3424.5B06010386m06488m13284m13552l51310l31729m36098n50106n18993m09469l20419
3444.9B01858938k48924k66150l32758l06472j98364j28791j43632j80036j61976o4641
3465.3A99827194n677j05739k31892j99765q6292m1321m1291n0590o0826j7628J3113
3487.7A98999286k2024j6675N9009J27494J16155Q7812J78039J87293L7268P9811K62558
3510.2B00096026L18751K65151K13549K30446L15681M56840M77239L57062L53664M09723
$$ y = [225908041, 225215405, 224578515, 223853663, 222962812, 222021729, 221166402, 220397800, 219678298, 218982637, 218289211, 217581555, 216887623, 216290936, 215713307, 214989439, 214251950, 213713482, 213249847, 212596908, 211758137, 210988790, 210389689, 209844753, 209288806, 208713412, 208122224, 207546785, 206995264, 206471980, 206010386, 205603898, 205190614, 204777062, 204425752, 204094023, 203657925, 203107819, 202588826, 202179357, 201858938, 201610014, 201343864, 201011106, 200704634, 200506270, 200377479, 200233847, 200053811, 199891835, 199827194, 199821517, 199715778, 199483886, 199284121, 199197829, 199156508, 199115217, 199064627, 199003801, 198986173, 198999286, 198977262, 198960587, 199019596, 199147090, 199263245, 199351057, 199529096, 199716389, 199753657, 199833468, 200096026, 200414777, 200679928, 200893477, 201123923, 201439604, 201896444, 202373683, 202730745, 203084409, 203494132]
3530.6B03494132M12866M82932N18650L96058L45140M72203N91740M73291K01136K11745
3551B07599893L84897L17589K27779L06889K93300J11997K93791Q37177O41942K1518
3571.3B11036772M2915L68848N18114O03959N91084M64872O76885J181468R42290M24325
3591.7B16851532P06465J104965R91628Q90702Q83803O63146O83680J152665J252383
3610.1B25180969J013383Q56295O13481R94056J355768N21317k59891M4018J586660
3628.5B31906056J771495J64002j17719K25350K80410L53054K11626p3910M01885J699954
3648.8B36822203J424506m14163n41016N36307L79384j15707j1102m9278O7383J064077
3669.2B39162594J145527J70082J052394J213551k23577m32894k92048k60338N81980
$$ y = [203494132, 203906998, 204389930, 204908580, 205304638, 205649778, 206121981, 206713721, 207187012, 207388148, 207599893, 207984790, 208302379, 208530158, 208837047, 209130347, 209242344, 209536135, 210373312, 211015254, 211036772, 211079687, 211448535, 211966649, 212570608, 213161692, 213626564, 214303449, 215484917, 216427207, 216851532, 217557997, 218662962, 219654590, 220545292, 221429095, 222092241, 222775921, 223928586, 225180969, 226194352, 227050647, 227664128, 228658184, 230013952, 230535269, 230275378, 230319396, 231906056, 233677551, 233841553, 233723834, 233949184, 234229594, 234582648, 234794274, 234720364, 235122249, 236822203, 238246709, 237832546, 237291530, 237827837, 238207221, 238091514, 238080412, 238031134, 238098517, 239162594, 240308121, 240478203, 241530597, 242744148, 242520571, 242087677, 241795629, 241535291, 242117271]
3687.6B42117271J379236M37677n65648n47051k94268Q806M34116J47596n36040m21822
3708B42159873L70801Q70391j2785q92192p27892k68340o9350o9618j13368n64501
3728.4B40683019p54148l5867P65890P34434l76717j488000p20963J246512M57496
3746.7B40511656o01992O56396N81294q42482r08032q0779l2276n41076l37854q613
3767.1B38396242K21595K16529l97891o53013k02328L03000m917m46216k64868j69366
3787.5B36998767k45840l32027l43398k2143j32367j25050O25744j13189n63562J86563
3807.9B35933498m02317j164094n57884N62623J32605p0720N37976m13284q79943n86614
3828.3B33091846m64782k04101k17036P3016O10426L7670n40361n13970p86469j260504
$$ y = [242117271, 243496507, 243934184, 243368536, 242821485, 242527217, 242536023, 242970139, 243117735, 242581695, 242159873, 242530674, 243401065, 243388280, 242496088, 241768196, 241499856, 241430506, 241360888, 241247520, 240683019, 239928871, 239893004, 240658894, 241393328, 241016611, 239528611, 238807648, 240054160, 240511656, 239909664, 240566060, 241147354, 240304872, 239396840, 239316061, 239283785, 238742709, 238404855, 238396242, 238617837, 238834366, 238436475, 237783462, 237581134, 237884134, 237879217, 237433001, 237168133, 236998767, 236752927, 236420900, 236077502, 236055359, 235922992, 235797942, 236423686, 236310497, 235746935, 235933498, 235531181, 234367087, 233809203, 234371826, 234504431, 234433711, 234971687, 234558403, 233678460, 233091846, 232627064, 232422963, 232205927, 232278943, 232889369, 232927039, 232386678, 231872708, 231086239, 229825735]
3848.7B29825735j001999J221270K200439n29274j639202r07287m9413J06782m65467
3867.1B28761584j13503M75645p5876m96790p91431m27216J17868j87635O1616r6351
3887.5B27227911n67436M6477n8100r00164p06881M7847L70190L35932j03772o80551
3907.9B25011453o91056m65602l94165j39520J12012j11639m10140k74390j39385l67061
3928.3B22130507l54394p0542j56269m02301l90098k17572l8951j20849k84388j72124
3948.7B19923019j17749k87637l70770k81498k19465k04458j94371k69964l19794k68996
3969.1B17388317k16171j83150j46896j42023j99884k51413k67639l11211l19108k51443
3989.5B15099379k23815k53499k45630k44275
$$ y = [229825735, 228823736, 230045006, 232245445, 231716171, 230076969, 229169682, 229120269, 229227051, 228761584, 228648081, 229123726, 229047850, 228551060, 227759629, 227332413, 227450281, 227262646, 227324262, 227227911, 226660475, 226706952, 226648852, 225748688, 225041807, 225089654, 225459844, 225795776, 225692004, 225011453, 224320397, 223854795, 223460630, 223321110, 223433122, 223321483, 222911343, 222636953, 222497568, 222130507, 221776113, 221705571, 221549302, 221147001, 220756903, 220539331, 220500380, 220379531, 220095143, 219923019, 219805270, 219517633, 219146863, 218865365, 218645900, 218441442, 218247071, 217977107, 217657313, 217388317, 217172146, 216988996, 216842100, 216700077, 216500193, 216248780, 215981141, 215669930, 215350822, 215099379, 214875564, 214622065, 214376435, 214132160]
3997.6B14132160
$$ y = [214132160]
##END=$$ End of the data block
