##TITLE=LPD-48 tubo 1 $$ Begin of the data block
##JCAMP-DX=5.00 $$ ACD/SpecManager v 10.08
##SPECTROMETER/DATA SYSTEM=Alpha
##DATE=21 Jul 2015 09:23:44
##DATA TYPE=INFRARED SPECTRUM
##DATA CLASS=XYDATA
##ORIGIN=
##OWNER=
##NPOINTS=1765
##FIRSTX=399.76428223
##LASTX=3997.64306641
##MAXX=3997.64306641
##MINX=399.76428223
##MAXY=0.69730896
##MINY=0.37186986
##XFACTOR=1.0000000000
##YFACTOR=1.000000000000000e-9
##FIRSTY=0.69730896
##DELTAX=2.03961372
##XUNITS=1/CM
##YUNITS=ARBITRARY UNITS
##XYDATA=(X++(Y..Y))
399.8F97308958j288414j009167j008272r03427j46151N40435M46379M34220M69983
$$ 697308958 696020544 695011377 694003105 693099678 692953527 693493962 693940341 694374561 694844544
418.1F94844544o11961j528740j517177r20832j12235k45095q07881o84500m02450
$$ 694844544 694232583 692703843 691186666 690265834 690153599 689908504 689100623 688416123 688013673
436.5F88013673m34399m66406l76821l21209m26948n62430m01616n1856J93656J32501
$$ 688013673 687579274 687112868 686736047 686414838 685987890 685425460 685023844 684971988 685165644 685298145
456.9F85298145l70801p07268n91875n36263p32958n48959o437k86698j083493j072884
$$ 685298145 684927344 684220076 683628201 683091938 682358980 681810021 681803584 681516886 680433393 679360509
477.3F79360509m27544j70708p71463j398802j054763n39840j034856j757502j525939
$$ 679360509 678932965 678762257 677990794 676591992 675537229 674997389 673962533 672205031 670679092
495.6F70679092r53793j190305k049565k026200j239837j584887k598167k424180j440108
$$ 670679092 669725299 668534994 666485429 664459229 663219392 661634505 659036338 656612158 655172050
514F55172050j440167k564609k770722j553059j106679k324462l048003k032042j287698
$$ 655172050 653731883 651167274 648396552 646843493 645736814 643412352 640364349 638332307 637044609
532.3F37044609k121270k777100j769244o52731j032948j615942q27730K42651n9307
$$ 637044609 634923339 632146239 630376995 629724264 628691316 627075374 626247644 626490295 626430988
550.7F26430988q45968k49863J055598J132429M98473Q53777J872003J997531J088202
$$ 626430988 625585020 625335157 626390755 627523184 628021657 628875434 630747437 632744968 633833170
569.1F33833170P50363J568973K026260J415610J084685J751423K246738J758575J135528
$$ 633833170 634583533 636152506 638178766 639594376 640679061 642430484 644677222 646435797 647571325
587.4F47571325J283944J659095J416207Q38935O66380Q57472Q18193M96924L04997
$$ 647571325 648855269 650514364 651930571 652769506 653435886 654293358 655111551 655608475 655913472
605.8F55913472M65810P18475P10130L75628J63674M60387Q52167Q69453P08878R62437
$$ 655913472 656379282 657097757 657807887 658183515 658347189 658807576 659659743 660529196 661238074 662200511
626.2F62200511J495838J399040J71423j484335j971900p09176J009762K127588K264082
$$ 662200511 663696349 665095389 665266812 663782477 661810577 661101401 662111163 664238751 666502833
644.5F66502833R87411j140475k823592l484308l900886m858255n959034o102920n279660
$$ 666502833 667490244 666349769 663526177 660041869 656140983 651282728 645323694 639220774 633941114
662.9F33941114m517198n092859m985154j679837K81930J148998K340973M045486N399287
$$ 633941114 629423916 624331057 619345903 617666066 617947996 619096994 621437967 625483453 630882740
681.2F30882740N506814M826188M298806L540218J314163k390623o127715q381903
$$ 630882740 636389554 641215742 645514548 649054766 650368929 647978306 641850591 633468688
697.5F33468688q095742n132198m85182M097223O778896P062674O202996N486667M665911
$$ 633468688 625372946 620240748 619755566 623852789 630631685 637694359 643897355 649384022 654049933
715.9F54049933K902687Q71539J92284Q10087J136065N45799J01269M70340O00755
$$ 654049933 656952620 657824159 658016443 658826530 659962595 660508394 660609663 661080003 661680758
734.3F61680758k85149j212239j112640o39319q00252r68874l993J444638J731455
$$ 661680758 661395609 660183370 659070730 658431411 657631159 656662285 656658292 658102930 659834385
752.6F59834385P69794m6492j02102j19985l47256J55747J734316L012002K858757
$$ 659834385 660604179 660557687 660455585 660335600 659988344 660144091 661878407 664890409 667749166
771F67749166K009213J528562J150369J26302j232922k043008k389789l125787m255056
$$ 667749166 669758379 671286941 672437310 672563612 671330690 669287682 666897893 663772106 659517050
789.3F59517050m912794m977107n399048o673873q225381r303629r599507r066999
$$ 659517050 654604256 649627149 644228101 637554228 629328847 620025218 610425711 601358712
805.6F01358712p835746o337106n110801m320502l521740k245188o97017N75125J373291
$$ 601358712 593522966 587185860 582075059 577754557 574232817 571987629 571290612 571865737 573239028
824E73239028J876653K105057J733363P23004k67744n82218l12388J87516R28402J954675
$$ 573239028 575115681 577220738 578954101 579677105 579409361 578827143 578514755 578702271 579630673 581585348
844.4E81585348K888918L339350L495812L774822M187882M493594M596651M513144
$$ 581585348 584474266 587813616 591309428 595084250 599272132 603765726 608362377 612875521
860.7F12875521M246473L794373L184616K477408J739859R41575N8412o45816r17375
$$ 612875521 617121994 620916367 624100983 626578391 628318250 629259825 629318237 628672421 627755046
879.1F27755046r25422q38518n68867j62780J66297L49283N26786P09474O63877K71618
$$ 627755046 626829624 625991106 625422239 625259459 625425756 625775039 626301825 627011299 627675176 627946794
899.5F27946794l46482r70125j519740k020239k267302k010941j471460j145899j124501
$$ 627946794 627600312 626630187 625110447 623090208 620822906 618811965 617340505 616194606 615070105
917.8F15070105j168490j246750j558781k067625k376318k350808k363145k613664
$$ 615070105 613901615 612654865 611096084 609028459 606652141 604301333 601938188 599324524
934.1E99324524k766549k540827k142966j888454j621902r11295J74403J128793J784980
$$ 599324524 596557975 594017148 591874182 589985728 588363826 587452531 587626934 588755727 590540707
952.5E90540707K448917L144741L345251K837062K183735J853585J503110P01726k69354
$$ 590540707 592989624 596134365 599479616 602316678 604500413 606353998 607857108 608558834 608289480
970.9F08289480r19223j341462j971364k714813k969324k618194k272844k255201k107203
$$ 608289480 607370257 606028795 604057431 601342618 598373294 595755100 593482256 591227055 589119852
989.2E89119852j525462j003802j010597j239836j197696j072406j412213k195955
$$ 589119852 587594390 586590588 585579991 584340155 583142459 582070053 580657840 578461885
1005.5E78461885k959430l604114m523814n781352o167710m022896o0499K377570J574099
$$ 578461885 575502455 571898341 567374527 561593175 555425465 551402569 551342070 553719640 555293739
1023.9E55293739o27339k074480k522230k411187j892865j241266q42095o69420l77774
$$ 555293739 554666400 552591920 550069690 547658503 545765638 544524372 543682277 543012857 542635083
1042.2E42635083O7890K94149J07646k83301o78778j225829k127349l119529l710568
$$ 542635083 542702973 542997122 543104768 542821467 542142689 540916860 538789511 535669982 531959414
1060.6E31959414l871321l996968m233480m318953m189252m176796m415035m634649
$$ 531959414 528088093 524091125 519857645 515538692 511349440 507172644 502757609 498122960
1076.9D98122960m592210m370987m167050l961414l603936l087550k611101k249807
$$ 498122960 493530750 489159763 484992713 481031299 477427363 474339813 471728712 469478905
1093.2D69478905j842379j318306p94441m14043j68979O1720L31015N65350P38203
$$ 469478905 467636526 466318220 465523779 465109736 464940757 465002477 465333492 465898842 466637045
1111.6D66637045R75222J356363J732677J903117J897782J847744J723289J447141
$$ 466637045 467612267 468968630 470701307 472604424 474502206 476349950 478073239 479520380
1127.9D79520380J125098Q83043P01010M98563K59101J24455K62648O38216J085163
$$ 479520380 480645478 481528521 482229531 482728094 482987195 483111650 483374298 484012514 485097677
1146.3D85097677J679599K604335L736377M806191N695969O473958P185877P602036
$$ 485097677 486777276 489381611 493117988 497924179 503620148 510094106 517279983 524882019
1162.6E24882019P454633O885767O283403N698144M819274L565312K388834J876951
$$ 524882019 532336652 539222419 545505822 551203966 556023240 559588552 561977386 563854337
1178.9E63854337K158522K895594L636241L962815L645658K868355K118170J738965
$$ 563854337 566012859 568908453 572544694 576507509 580153167 583021522 585139692 586878657
1195.2E86878657J563251J083076J32144r40025j813829k468646k822637k397537q29578
$$ 586878657 588441908 589524984 589657128 588717103 586903274 584434628 581611991 579214454 578384876
1213.6E78384876J262665K630889K752126K109706J174331j05262j683652l040553
$$ 578384876 579647541 582278430 585030556 587140262 588314593 588209331 586525679 583485126
1229.9E83485126l761827m054428m335343m514516m284739l835678l541053l278315
$$ 583485126 579723299 575668871 571333528 566819012 562534273 558698595 555157542 551879227
1246.2E51879227k688944j854241j249611j097382j137554j234949j503348j610577
$$ 551879227 549190283 547336042 546086431 544989049 543851495 542616546 541113198 539502621
1262.5E39502621q27849R55343K829850L763318L575146K868772K076447J152753K57850
$$ 539502621 538674772 539630115 542459965 546223283 549798429 552667201 554743648 555896401 556154251
1280.9E56154251j89721j72735j73747m93944q18372q05318o69956o92725o35386r6023
$$ 556154251 555964530 555791795 555618048 555124104 554305732 553500414 552830458 552137733 551502347 551406324
1301.3E51406324Q05676J636445K249599K732098L042042K902031K186120J148820
$$ 551406324 552212000 553848445 556098044 558830142 561872184 564774215 566960335 568109155
1317.6E68109155M8399o51181l55005P69615J938522K561032K475501J759409M72546
$$ 568109155 568157554 567506373 567151368 567920983 569859505 572420537 574896038 576655447 577127993
1336E77127993j751482n419433r318650j1057794r648979o083846k437234J84953J863063
$$ 577127993 575376511 569957078 560638428 549580634 539931655 533847809 531410575 531595528 533458591
1354.3E33458591K822756L178299L365576L540158L233731K758384K600908K462566
$$ 533458591 536281347 539459646 542825222 546365380 549599111 552357495 554958403 557420969
1370.6E57420969K651632K952158K606333K184391J960337J897812K478301L293932
$$ 557420969 560072601 563024759 565631092 567815483 569775820 571673632 574151933 577445865
1386.9E77445865K925276J948297J779139J608789P84994K14994j81497n80668j091778
$$ 577445865 580371141 582319438 584098577 585707366 586492360 586707354 586525857 585945189 584853411
1405.3E84853411k027929l107250m497886o004989o735861o761193o271005l612161
$$ 584853411 582825482 579718232 575220346 569215357 562479496 555718303 549447298 545835137
1421.6E45835137R72808N184412O735861N047500P57158l047347n330503o843269o496251
$$ 545835137 546807945 551992357 558728218 563775718 564532876 561485529 556155026 549311757 542815506
1440E42815506n273163m145264l241241k639592j772940j34886K151788N229532N924225
$$ 542815506 537542343 533397079 530155838 527516246 525743306 525608420 527760208 532989740 538913965
1458.3E38913965K940476K170265K996087K470255J479328K551198M945516N300760
$$ 538913965 541854441 544024706 547020793 549491048 550970376 553521574 558467090 563767850
1474.7E63767850L932834K841234J750529N24581k70784j4782M86433K5928L58J898229
$$ 563767850 567700684 570541918 572292447 572817028 572546244 572531462 573017895 573043823 573044181 574942410
1495E74942410L431082J350105j729608l192663m804313r341836j0725677n670250
$$ 574942410 578373492 579723597 577993989 574801326 569997013 560655177 549929500 544259250
1511.4E44259250K033353J0553062J5619755J4728307J2245060P990419M159153K646506
$$ 544259250 546292603 556845665 572465420 587193727 599438787 607429206 611588359 614234865
1527.7F14234865J470685J470744J754999O28114O32227K329111J258910r60649j364111
$$ 614234865 615705550 617176294 618931293 619559407 620191634 622520745 623779655 622819006 621454895
1546F21454895r25959k47657L7432O8784L89576J426816j69158k811194k510369j607239
$$ 621454895 620528936 620281279 620318711 620387495 620777071 622203887 622034729 619223535 616713166 615105927
1566.4F15105927j273811k007782k943814k070129l39389j96516l98577j9073N5611
$$ 615105927 613832116 611824334 608880520 606810391 606471002 606274486 605875909 605856836 605912447
1584.8F05912447l37601r59396j657605k371609l416002m893124o130994o486952o075680
$$ 605912447 605574846 604615450 602957845 600586236 597170234 592277110 586146116 579659164 573583484
1603.2E73583484n538822n378186n134285l397464J37269M816890P752716N151213
$$ 573583484 568044662 562666476 557532191 554134727 554271996 559088886 566841602 571992815
1619.5E71992815K599775J764477L06964p12991r69410p99716M45307J771628N30720
$$ 571992815 574592590 576357067 576664031 575951040 574981630 574181914 574627221 576398849 576929569
1637.8E76929569o20544j16348Q84891K367556K181947N77330K203048L716290L19421
$$ 576929569 576309025 576192677 577077568 579445124 581627071 582204401 584407449 588123739 588443160
1656.2E88443160l92318J021087K009333J573741Q33988J463115J565934K98142K76387
$$ 588443160 588050842 589071929 591081262 592655003 593488991 594952106 596518040 596816182 597092569
1674.5E97092569M01616l92973l79146Q18968J479209m99904j501024j107633p90060
$$ 597092569 597494185 597101212 596722066 597541034 599020243 598520339 597019315 595911682 595121622
1692.9E95121622J3948K26914N9724M31478m04656o22749n25832j199246j473844j284360
$$ 595121622 595135570 595362484 595422208 595853686 595449030 594826281 594300449 593101203 591627359 590342999
1713.3E90342999p60854k2471l45289p06137J71960J188516J780808K064586K047241
$$ 590342999 589582145 589559674 589214385 588508248 588680208 589868724 591649532 593714118 595761359
1731.7E95761359K669215J822293J83224M15266N31018J71602L51846N69165N51760
$$ 595761359 598430574 600252867 600436091 600851357 601382375 601553977 601905823 602474988 603026748
1750F03026748P9274l84212q4579J55807K20001O11722K89261J0431M07875Q16583
$$ 603026748 603106022 602721810 602637231 602793038 603013039 603624761 603914022 603924453 604332328 605148911
1770.4F05148911J018584N4419q97944n53965j7703j50800m15563n42224m99069P8678
$$ 605148911 606167495 606221914 605323970 604770005 604752302 604601502 604185939 603643715 603144646 603223324
1790.8F03223324L01242n29647p54833r1732K63393J1682q1539K50697N68212N23626
$$ 603223324 603524566 602994919 602240086 602148354 602411747 602423429 602341890 602592587 603160799 603684425
1811.2F03684425K36035K08080L76522K97487J56045L85523N72085K97368K40326L4689
$$ 603684425 603920460 604128540 604505062 604802549 604958594 605344117 605916202 606213570 606453896 606488585
1831.6F06488585l85165k72333j16945k40922n0425N21838J64867o90818o77884l74734
$$ 606488585 606103420 605831087 605714142 605473220 605422795 605944633 606109500 605418682 604740798 604366064
1852F04366064k93314l40939l30269k74658l39509m74095l59297k6524k97189r36985
$$ 604366064 604072750 603731811 603401542 603126884 602787375 602313280 601953983 601927459 601630270 600693285
1872.4F00693285r87708o96778n46277n81264o92845p49707p31707o79552r19521j300395
$$ 600693285 599705577 599008799 598462522 597881258 597188413 596438706 595706999 595027447 594107926 592807531
1892.8E92807531j291215j251459j398027j408637j214146r29594o48499m07576k17617
$$ 592807531 591516316 590264857 588866830 587458193 586244047 585314453 584665954 584258378 584040761
1911.1E84040761k5749K50041N89729N46574K99216L37183J60575j37091j32560m9115
$$ 584040761 584015012 584265053 584854782 585401356 585700572 586037755 586198330 586061239 585928679 585879564
1931.5E85879564j05083k66373l32415j93238J9908r5666m06682l69132j68621j46807
$$ 585879564 585774481 585508108 585175693 584982455 585002363 584906697 584500015 584130883 583962262 583815455
1951.9E83815455k09927j82092r0540j15335k53260k24292J5259P8678j23382j79112
$$ 583815455 583605528 583423436 583332896 583217561 582964301 582740009 582755268 582833946 582710564 582531452
1972.3E82531452j4841P0870j6749j08362m9889O6996Q8036N9366J59443K55882J07646
$$ 582531452 582516611 582587481 582570732 582462370 582412481 582479477 582567513 582626879 582786322 583042204 583149850
1994.8E83149850l5822Q702J03355J29819N9485N066N0247Q1778L457n4479j7643m5061
$$ 583149850 583114028 583122730 583226085 583355904 583415389 583420455 583470702 583552480 583555937 583501458 583483815 583438754
2019.2E83438754j96338l98576l73363P5876L75331J73390o2228o9260k2352o0499
$$ 583438754 583242416 582843840 582470477 582546353 582921684 583095074 583032846 582963586 582941234 582880735
2039.6E82880735j32978j61528j40488j61171k30909k25782j65761j55687j76012j65999
$$ 582880735 582747757 582586229 582445741 582284570 582053661 581827879 581662118 581506431 581330419 581164420
2060E81164420j41323j26421j74523k52724k32696j62900j73747k22743k03907j65522
$$ 581164420 581023097 580896676 580722153 580469429 580236733 580073833 579900086 579677343 579473436 579307914
2080.4E79307914j84953k17200j88350j32263j35064j84238j88589j34945j05858j18852
$$ 579307914 579122961 578905761 578717411 578585148 578450084 578265846 578077257 577942312 577836454 577717602
2100.8E77717602j28388j31607j31667j18792j18256j27136j37210j58727j67907j63674
$$ 577717602 577589214 577457607 577325940 577207148 577088892 576961756 576824546 576665819 576497912 576334238
2121.2E76334238j73211j92463j79053j36673j17719j28687j41024j34647j33157j56224
$$ 576334238 576161027 575968564 575789511 575652838 575535119 575406432 575265408 575130761 574997604 574841380
2141.6E74841380j53720j24634j11639j22190j47283j47223j25230j29580j50502j40846
$$ 574841380 574687660 574563026 574451387 574329197 574181914 574034691 573909461 573779881 573629379 573488533
2162E73488533j14977j49608j99317j38998m4227n5850j20997j34826q7261m3154p5161
$$ 573488533 573373556 573223948 573024631 572885633 572841406 572785556 572664559 572529733 572442472 572399318 572324157
2184.5E72324157j30952j04129n3525r7930j68026j38402p1347r0420j73092k00748
$$ 572324157 572193205 572089076 572035551 571937621 571769595 571631193 571559846 571469426 571296334 571095586
2204.8E71095586j59204j46270j91331k16484j80960j37388j50979k02477k03133j57892
$$ 571095586 570936382 570790112 570598781 570382297 570201337 570063949 569912970 569710493 569507360 569349468
2225.2E69349468j46151j85788k17854j74761j06991j27196k01404j96219j56104j84834
$$ 569349468 569203317 569017529 568799675 568624914 568517923 568390727 568189323 567993104 567837000 567652166
2245.6E67652166k27511k14160j74045j65761j91867j93059j28806r7752j59800k03967
$$ 567652166 567424655 567210495 567036450 566870689 566678822 566485763 566356957 566259205 566099405 565895438
2266E65895438j68145j18732j33634j71005j54615j35183j87337k84493l42250l28899
$$ 565895438 565727293 565608561 565474927 565303922 565149307 565014124 564826787 564542294 564200044 563871145
2286.4E63871145l25501l65436l64423k94625k23697k04801j95027j43766q5294j10507
$$ 563871145 563545644 563180208 562815785 562521160 562297463 562092662 561897635 561753869 561668575 561558068
2306.8E61558068j93536j79589r0003j76430m28975m96745l30984k38061l95477n72503
$$ 561558068 561364532 561184943 561094940 560918510 560489535 559992790 559661806 559423745 559028268 558455765
2327.2E58455765m59194k93493m40657n72324l76284q5295J59026O17325R76026l6716
$$ 558455765 557996571 557703078 557262421 556690097 556313813 556228518 556387544 557004869 557980895 557944179
2347.6E57944179j400710j404643m31418J58250K56181L16560M00603M69804M81248
$$ 557944179 556543469 555138826 554707408 554865658 555121839 555438399 555839002 556308806 556790054
2366E56790054M14371L37005L15607K79784J63853K9147o7652j48952k16365k42352
$$ 556790054 557204425 557541430 557857037 558136821 558300674 558329821 558262169 558113217 557896852 557654500
2386.4E57654500k04206j48415j25647j25527j23382j04427j04010j59562k05993j94073
$$ 557654500 557450294 557301879 557176232 557050705 556927323 556822896 556718886 556559324 556353331 556159258
2406.8E56159258j65224j61648k00093k36451k27154k21193k54809k73288k40445j94013
$$ 556159258 555994034 555832386 555632293 555395842 555168688 554947495 554692686 554419398 554178953 553984940
2427.2E53984940j67429j59145j45733j27554j46389j94728k25902k18988j88469j75000
$$ 553984940 553817511 553658366 553512633 553385079 553238690 553043962 552818060 552599072 552410603 552235603
2447.6E52235603j70052j65045j85370k02239k00152k02477k17021k44915k65479k62976
$$ 552235603 552065551 551900506 551715136 551512897 551312745 551110268 550893247 550648332 550382853 550119877
2467.9E50119877k51055k47776k67506k81572k60711k39432k23160j88172j76131k16842
$$ 550119877 549868822 549621046 549353540 549071968 548811257 548571825 548348665 548160493 547984362 547767520
2488.3E47767520k44498k34604k28048k18391k00331j87397j98424k29597k35796k08259
$$ 547767520 547523022 547288418 547060370 546841979 546641648 546454251 546255827 546026230 545790434 545582175
2508.7E45582175j85609k18570k59876k32637j90318j82330j91629j99437j98901j84357
$$ 545582175 545396566 545177996 544918120 544685483 544495165 544312835 544121206 543921769 543722868 543538511
2529.1E43538511j44005r6142q9050j11401j31905j50204j42216j24037j33098j46210
$$ 543538511 543394506 543298364 543209314 543097913 542966008 542815804 542673588 542549551 542416453 542270243
2549.5E42270243j44481j54555j84119k03252k10762k33471k72572k92480k87116k74002
$$ 542270243 542125762 541971207 541787088 541583836 541373074 541139603 540867031 540574551 540287435 540013433
2569.9E40013433k72573l07977l37064l10779k85685l29137l77118l61741l25322l12984
$$ 540013433 539740860 539432883 539095819 538785040 538499355 538170218 537793100 537431359 537106037 536793053
2590.3E36793053l25322l38733l31283k99930k59519k15411j56224r3460n8413q3506
$$ 536793053 536467731 536128998 535797715 535497785 535238266 535022855 534866631 534773171 534714758 534631252
2610.7E34631252j29521j30713j42276k15113k97368l36587l20494k90632k80440k08974
$$ 534631252 534501731 534371018 534228742 534013629 533716261 533379674 533059180 532768548 532488108 532279134
2631.1E32279134p7307m2618j10984j56819j56641j61648k07782k88665l25740k86221
$$ 532279134 532201827 532159209 532048225 531891406 531734765 531573117 531365335 531076670 530750930 530464709
2651.5E30464709k90573l70562l93093l24785k96355l61383m25279m51982m98950n86033
$$ 530464709 530174136 529803574 529410481 529085696 528789341 528427958 528002679 527550697 527051747 526465714
2671.9E26465714o76036p48157q37326r80139j127899j203120j209438j190125j149953
$$ 526465714 525789678 525041521 524204195 523224056 522096157 520893037 519683599 518493474 517343521
2690.3E17343521j072883r70126q90016q56340q09968p31587o75440o47366o42717
$$ 517343521 516270638 515300512 514410496 513554156 512744188 512012601 511337161 510689795 510047078
2708.6E10047078o37889n92649n78880o30319o42717n79596n10811m88937m98653m84109
$$ 510047078 509409189 508816540 508237660 507607341 506964624 506385028 505874217 505385280 504886627 504402518
2729E04402518m24146l78430l79205l39508k32697j61945j43886j29640j33991j62185
$$ 504402518 503978372 503599942 503220737 502881229 502648532 502486587 502342701 502213061 502079070 501916885
2749.4E01916885k36094l54349m21882m55975n76258p41989q25673q36611q73983r67502
$$ 501916885 501680791 501326442 500904560 500448585 499872327 499130338 498304665 497468054 496594071 495626569
2769.8D95626569j050055j082123j108974j173794j244783j242727j192242j211167
$$ 495626569 494576514 493494391 492385417 491211623 489966840 488724113 487531871 486320704
2786.1D86320704j293212j352787j374125j374841j402438j446307j441091j440048
$$ 486320704 485027492 483674705 482300580 480925739 479523301 478076994 476635903 475195855
2802.4D75195855j507819j558155j526117j517653j588196j641244j636654j627147
$$ 475195855 473688036 472129881 470603764 469086111 467497915 465856671 464220017 462592870
2818.8D62592870j699895j888543k087534k258896k517492k915442l339589l635913
$$ 462592870 460892975 459004432 456916898 454658002 452140510 449225068 445885479 442249566
2835.1D42249566l828108m031420m121661l907561l507078l142834k832174k429306
$$ 442249566 438421458 434390038 430268377 426360816 422853738 419710904 416878730 414449424
2851.4D14449424j918287j461327j138568r05513o91861m80026k87742q9347J61558
$$ 414449424 412531137 411069810 409931242 409025729 408333868 407853842 407566100 407476753 407638311
2869.7D07638311L81679L95685K91258L01928L79353L57330K41220J44482J04785J9133
$$ 407638311 408019990 408415675 408706933 409008861 409388214 409745544 409986764 410131246 410236031 410255164
2890.1D10255164j44661l10897m75049o49929p87616q54612q54551q27760q03739p28070
$$ 410255164 410110503 409799606 409324557 408674628 407887012 407032400 406177849 405350089 404546350 403818280
2910.5D03818280o35565o36160o26773m47452j47194J90944N49883Q82804J129985
$$ 403818280 403182715 402546555 401919782 401472330 401325136 401516080 402065963 402948767 404078752
2928.9D04078752J288593J428246J564294J673520J767397J855820J912743J884222
$$ 404078752 405367345 406795591 408359885 410033405 411800802 413656622 415569365 417453587
2945.2D17453587J818478J838625J932889J968086J971155K096772K333403K572656
$$ 417453587 419272065 421110690 423043579 425011665 426982820 429079592 431412995 433985651
2961.5D33985651K791285L033876L265471L400326L464967L450453L261894K923131
$$ 433985651 436776936 439810812 443076283 446476609 449941576 453392029 456653923 459577054
2977.8D59577054K474606J936018J460105J164288J028716J016796R79751P27386K89023
$$ 459577054 462051660 463987678 465447783 466612071 467640787 468657583 469637334 470364720 470653743
2996.2D70653743k51204q28684j309752j640111j789332j662254j307219r79871p99149
$$ 470653743 470402539 469573855 468264103 466623992 464834660 463172406 461865187 460885316 460086167
3014.5D60086167p05242o88196o43998l17991L97832J288920K047926K441168K343387
$$ 460086167 459380925 458692729 458048731 457730740 458128572 459417492 461465418 463906586 466249973
3032.9D66249973J862347J269400P85351L27229k52932p32482q15391m96417n365N30452
$$ 466249973 468112320 469381720 470167071 470494300 470241368 469508886 468693495 468197078 468191713 468722165
3053.3D68722165J125246J611292J899779K098203K186715K072186J693278J169861
$$ 468722165 469847411 471458703 473358482 475456685 477643400 479715586 481408864 482578725
3069.6D82578725P54743N02140L06427N8025k44766m17292l85344k77162j20699R3400
$$ 482578725 483333468 483835608 484142035 484200060 483955294 483538002 483152658 482875496 482754797 482848197
3090D82848197L37839O55353R40085R82165Q18044N95838M23908L42667K13832K950
$$ 482848197 483186036 483841389 484781474 485763639 486581683 487177521 487601429 487944096 488157928 488160878
3110.4D88160878r7960p4655j46627l68595n77450o34342n20081l08126n7429J78248
$$ 488160878 488062918 487988263 487841636 487473041 486895591 486261249 485741168 485433042 485375613 485553861
3130.8D85553861L22848L51042L31402K34156j2278k12193k17199j52260j05619j00762
$$ 485553861 485876709 486227751 486559153 486793309 486781031 486568838 486351639 486199379 486093760 485992998
3151.2D85992998k27541l89248m22299l96460l62456l35634l31074l33667l87996m38035
$$ 485992998 485765457 485376209 484953910 484557450 484194994 483859360 483528286 483194619 482806623 482368588
3171.6D82368588m14401m04835m34696m58271m77850m88818n14984n31167m86761m66853
$$ 482368588 481954187 481549352 481114656 480656385 480178535 479689717 479174733 478643566 478156805 477689952
3192D77689952n19663n67645n55396n27114n41389n64873n58436n32925n51731o15298
$$ 477689952 477170289 476602644 476047248 475520134 474978745 474413872 473855436 473322511 472770780 472155482
3212.4D72155482o32674o21080n98908n81175o18487o19919n48482m94211m72278m91410
$$ 472155482 471522808 470901728 470302820 469721645 469103158 468483239 467934757 467440546 466968268 466476858
3232.8D66476858n83321o75172p15613o81788n43624m43369n40555o86079o49720n14716
$$ 466476858 465893537 465218365 464502752 463820964 463277340 462833971 462293416 461607337 460957617 460442901
3253.2D60442901n01007n96672o11365n22495m68015m84079m51595l62873m16070n66721
$$ 460442901 459941894 459345222 458733857 458211362 457743347 457259268 456807673 456444800 456028730 455462009
3273.6D55462009o20723o05017n92977o01649o25402o21795n51612m77910n30421o72996
$$ 455462009 454841286 454236269 453643292 453041643 452416241 451794446 451242834 450764924 450234503 449561507
3294D49561507p65384q04960q00819o95407n92589o71417q81344j055449j096487j024217
$$ 449561507 448796123 447991163 447190344 446494937 445902348 445230931 444349587 443294138 442197651 441173434
3314.4D41173434r96023j050502j060397r98407j017213j183123j281172j239866j221686
$$ 441173434 440177411 439126909 438066512 437068105 436050892 434867769 433586597 432346731 431125045
3332.7D31125045j199782j151979j230121j361668j426220j475841j440018j340717
$$ 431125045 429925263 428773284 427543163 426181495 424755275 423279434 421839416 420498699
3349D20498699j416147j635432j710355j599551j498848j534790j582384j484513j410335
$$ 420498699 419082552 417447120 415736765 414137214 412638366 411103576 409521192 408036679 406626344
3367.4D06626344j549900j754492j750142j576632j444370j386195j366585j311601
$$ 406626344 405076444 403321952 401571810 399995178 398550808 397164613 395798028 394486427
3383.7C94486427j196950j093656j020134j036435j169622j178116r66936q69453j061410
$$ 394486427 393289477 392195821 391175687 390139252 388969630 387791514 386824578 385955125 384893715
3402.1C84893715j238852j154542r64672q55386q53777r31650r66579q14259o05464
$$ 384893715 383654863 382500321 381535649 380680263 379826486 378894836 377928257 377113998 376508534
3420.4C76508534n77211o37263n82457m64529m01497l53306l03090l36647m27067l64155
$$ 376508534 375931323 375294060 374711603 374247074 373845577 373492271 373189181 372852534 372425467 372061312
3440.8C72061312j75744j5706J34856J13457q34P2926K12312L05354L56615L42071
$$ 372061312 371885568 371869862 372004718 372118175 372117341 372190267 372402579 372707933 373064548 373406619
3461.2C73406619L52681M86880N98431M30584K17527L06368N04523N73486N92292O05285
$$ 373406619 373759300 374246180 374844611 375275195 375492722 375799090 376303613 376877099 377469391 378074676
3481.6C78074676N38349N22703N97358O11215O00934O48916P31439P25865O97285Q97914
$$ 378074676 378613025 379135728 379733086 380344301 380945235 381594151 382325590 383051455 383748740 384646654
3502C84646654R65059O47753O53685R80496R96679Q12560P70182Q46892R51708J148849
$$ 384646654 385611713 386259466 386913151 387893647 388890326 389702886 390473068 391319960 392271668 393420517
3522.4C93420517J198620J047999J055240J028806Q96871J029522J195579J034171
$$ 393420517 394619137 395667136 396722376 397751182 398648053 399677575 400873154 401907325
3538.7D01907325Q88049J064748J400620J373261Q25852P26163J084924R20177O67125
$$ 401907325 402795374 403860122 405260742 406634003 407459855 408186018 409270942 410191119 410858244
3557.1D10858244Q64654R45509O64741J108855K289116J763284K84762K58535R21994
$$ 410858244 411722898 412668407 413333148 414442003 416731119 418494403 418779165 419037700 419959694
3575.4D19959694J204759J291096J147986Q26031J387953K683729K023220N35429J013279
$$ 419959694 421164453 422455549 423603535 424429566 425817519 428501248 430524468 431059897 432073176
3593.8D32073176J869053J628279J474858J463085R10103R63182K048134K229214J608849
$$ 432073176 433942229 435570508 437045366 438508451 439418554 440381736 442429870 444659084 446267933
3612.1D46267933J234144O95884J553833K465517P34329r69738l03477L185988L676265
$$ 446267933 447502077 448197961 449751794 452217311 452951640 451981902 451678425 454864413 458540678
3630.5D58540678J13815n15878K02149K86013M09335P3016n26101N40465L462613K990991
$$ 458540678 458654493 458138615 458340764 458626777 459036112 459109128 458583027 459123492 462586105 465577096
3650.9D65577096j066953j460403Q24660M21285o52909m10646o07670n00649J598984
$$ 465577096 464510143 463049740 463874400 464295685 463642776 463232130 462624460 462123811 463722795
3669.2D63722795J792968l40492J628250K119183r76562j419872j119316j050114R48816
$$ 463722795 465515763 465175271 466803521 468922704 467946142 466526270 465406954 464356840 465305656
3687.6D65305656L085673J237124j101106j203507p30843n3554J001000M42356j116604
$$ 465305656 468391329 469628453 468527347 467323840 466592997 466539443 467540443 467982799 466866195
3706D66866195r13411R88990K438545M88401j708508j288027q9049L79890L12835K09570
$$ 466866195 465952784 466941774 469380319 469868720 468160212 466872185 466783136 467163026 467475861 467685431
3726.4D67685431o79046j082062M06205K062649J897037o22571l194391j591385K788425
$$ 467685431 467006385 465924323 466330528 468393177 470290214 469667643 466473252 464881867 467670292
3744.7D67670292R19640j570374J452267J507938j783937j994491j3917K18063r62824
$$ 467670292 468589932 467019558 468471825 469979763 468195826 466201335 466187418 466405481 465442657
3763.1D65442657n69939R3281N44876O38932o46651j255691l38733Q13514L18974n76943
$$ 465442657 464872718 464965999 465510875 466149807 465503156 464247465 463908732 464722246 465041220 464464277
3783.5D64464277k07752j14590l81172n17487n18680J84626l1084m3720J713574J90943
$$ 464464277 464256525 464141935 463760763 463243276 462724596 462909222 462878138 462834418 464547992 464738935
3803.9D64738935q90732P46727n71668k343297j056254J473993O58334K66492J551986
$$ 464738935 463848203 464594930 464023262 461679965 460623711 462097704 462756038 463022530 464574516
3822.2D64574516o49482j624346q65638o22064j49429k53528L90202J726865N96613
$$ 464574516 463925034 462300688 461435050 460812986 460663557 460410029 460800231 462527096 463123709
3840.6D63123709p12454p39664j452238k510100j821280L136605N204738q62241l299862
$$ 463123709 462411255 461671591 460219353 457709253 455887973 459024578 464229316 463367075 460067213
3858.9D60067213j694084K26528O16520o59376N5313J266688L8117p57902j338214
$$ 460067213 458373129 458599657 459216177 458556801 458612114 459878802 459916919 459159017 457820803
3877.3D57820803n19395O41048k08050M12196J49250j091689K97517K86191j569330
$$ 457820803 457301408 457942456 457734406 458146602 458295852 457204163 457501680 457787871 456218541
3895.6D56218541j168013N23031J195907J146824J96576j222730j311034p30157n34296
$$ 456218541 455050528 455573559 456769466 457916290 458112866 456890136 455579102 454848945 454314649
3914D54314649N0962O40303J07139n38647j92970L3617m60565k69830M31657R3043
$$ 454314649 454365611 455005914 455113053 454574406 454381436 454415053 453954488 453684658 454116315 454209358
3934.4D54209358o64562p17015k61634L05533J49489l32445j14650J1623k50280l02225
$$ 454209358 453544796 452827781 452566147 452871680 453021169 452688724 452574074 452585697 452335417 452033192
3954.8D52033192k13653k38478j85341n0336j27137k08616j73718j39355n5284k9236
$$ 452033192 451819539 451581061 451395720 451345384 451218247 451009631 450835913 450696558 450641274 450612038
3975.2D50612038k02894l57300k54333r3490j67876k67148j72615j56165k10136j33961
$$ 450612038 450409144 450051844 449797511 449704021 449536145 449268997 449096382 448940217 448730081 448596120
3995.6D48596120j10835
$$ 448596120 448485285
3997.6D48485285
$$ 448485285
##END=$$ End of the data block
