##TITLE=LMEOME-D I - Pastilha com KBr $$ Begin of the data block
##JCAMP-DX=5.00 $$ ACD/SpecManager v 10.08
##SPECTROMETER/DATA SYSTEM=Alpha
##DATE=09 Oct 2013 13:38:30
##DATA TYPE=INFRARED SPECTRUM
##DATA CLASS=XYDATA
##ORIGIN=
##OWNER=
##NPOINTS=1765
##FIRSTX=399.75695801
##LASTX=3997.56933594
##MAXX=3997.56933594
##MINX=399.75695801
##MAXY=0.87125510
##MINY=0.58433706
##XFACTOR=1.0000000000
##YFACTOR=1.000000000000000e-9
##FIRSTY=0.83141017
##DELTAX=2.03957629
##XUNITS=1/CM
##YUNITS=ARBITRARY UNITS
##XYDATA=(X++(Y..Y))
399.8H31410170n606056k394855K940715K698064k040864l535270Q87215N146801K668322
$$ 831410170 825804114 823409259 826349974 829048038 827007174 823471904 824359119 829505920 832174242
418.1H32174242m016221l339231J935840J923024l494084o359875k724230K039611
$$ 832174242 828158021 824818790 826754630 828677654 825183570 818823695 816099465 818139076
434.4H18139076J104355l146112l156364J098275K682507j249015m685402k482951
$$ 818139076 819243431 816097319 812940955 814039230 816721737 815472722 810787320 808304369
450.7H08304369J607657J412928k820015n113482j838625J349092l62099l785789l291785
$$ 808304369 809912026 811324954 808504939 803391457 801552832 802901924 802539825 798754036 795462251
469.1G95462251O00517J904129j335501l866852j936912J086056j47581m096985l753781
$$ 795462251 796062768 797966897 796631396 792764544 790827632 791913688 791766107 787669122 783915341
487.5G83915341K523065P770061O195128J408458L12686K933263L343046q07762m069328
$$ 783915341 786438406 794208467 800403595 801812053 802124739 805058002 808401048 807593286 803523958
505.8H03523958k488494K68400k11716k030552j307070J848340L787518J348555l637731
$$ 803523958 801035464 801303864 801092148 799061596 797754526 799602866 803390384 804738939 801101208
524.2H01101208p408321j0218859j2896895j0237575J86801R946406J1727869O954015
$$ 801101208 793692887 783474028 770577133 760339558 760526359 770472765 782200634 789154649
540.5G89154649J256585P7963M742801R780288Q484125K871156N79714K995253M273713
$$ 789154649 790411234 790489197 795231998 805012286 813496411 816367567 816947281 819942534 824216247
558.8H24216247J037716k597808j513482K148986K093733k164543m559696j961231
$$ 824216247 825253963 822656155 821142673 823291659 825385392 823220849 818661153 816699922
575.2H16699922J230061n3227l821492m314840o69658K202690J067757j180887k22445
$$ 816699922 817929983 817876756 814055264 809740424 809070766 811273456 812341213 811160326 810937881
593.5H10937881K671242K472162j480639m346966l402949j976490m147529q304000
$$ 810937881 813609123 816081285 814600646 810253680 806850731 804874241 800726712 792422712
609.8G92422712q687496l553570K024114L352941K115488L388881P910848J0083854
$$ 792422712 783735216 780181646 782205760 785558701 787674189 791063070 798973918 809057772
626.1H09057772O343961J888812K809524O265104N488455P59244j058102K960802O961107
$$ 809057772 815401733 817290545 820100069 826365173 831853628 832612872 831554770 834515572 841476679
644.5H41476679M848838l95656j602471J597643L073394j22606l320694j430095K851904
$$ 841476679 846325517 845929861 844327390 845925033 848998427 848875821 845555127 844125032 846976936
662.9H46976936L516972o9320l046871R31502L956675K563119j174032k023578J128077
$$ 846976936 850493908 850424588 847377717 848309219 852265894 854829013 853654981 851631403 852759480
681.2H52759480L246129J055121k063632j356780J976132K452910j091063l656804
$$ 852759480 856005609 857060730 854997098 853640318 855616450 858069360 856978297 853321493
697.5H53321493j647055K101957K782703K20597j057864J233816L184081J384615j293897
$$ 853321493 851674438 853776395 856559098 856779695 855721831 856955647 860139728 861524343 860230446
715.9H60230446p62224K049744K494454o20842k466321r3400L051638K540529j080036
$$ 860230446 859468222 861517966 864012420 863391578 860925257 860831857 863883495 866424024 865343988
734.2H65343988l209531j271487J672209J128375j892030k456844P8321J476466j89244
$$ 865343988 862134457 860862970 862535179 863663554 861771524 859314680 859393001 860869467 860680223
752.6H60680223j924575p96318J626849J585603j192033l018499j725197K87414l59476
$$ 860680223 858755648 857959330 859586179 861171782 859979749 856961250 855236053 855523467 855163991
771H55163991l188610m800677m239023m146814o197095q242249p152379m111946l168940
$$ 855163991 851975381 847174704 842935681 838788867 832591772 824349523 817197144 813085198 809916258
789.3H09916258m624546n829692n641758n283296o351888p191480n214631k263486
$$ 809916258 805291712 799462020 793820262 788536966 782185078 774993598 769778967 767515481
805.6G67515481r74894q74996j282990j395822n21064K04921r0003o43849L40640K842963
$$ 767515481 766540587 765665591 764382601 762986779 762465715 762670636 762580633 761936784 762277424 765120387
826G65120387J770377o189346j3668299j2449264m948557M905164J5784860K2876799
$$ 765120387 766890764 760701418 747033119 734583855 729635298 734540462 750325322 773202121
842.3G73202121K3567856K0274937J4954328R347201N697369M428566L847360K432645
$$ 773202121 796769977 817044914 831999242 841346443 847043812 851472378 855319738 857752383
858.7H57752383N76734k02775M36127J048208M49657n94735m95970N43594P64668k93493
$$ 857752383 858329117 858126342 858562469 859610677 860060334 859465599 858969629 859513223 860277891 859984398
879.1H59984398j198053r22680L636N21779M68671Q00490J766324K325535J760960
$$ 859984398 858786345 857863665 857867301 858389080 858857751 859658241 861424565 863750100 865511060
897.4H65511060N80966p5102J52469M59731J4424j003146j534581j196742r41873j346469
$$ 865511060 866092026 866016924 866169393 866629124 866643548 865640402 864105821 862909079 861967206 860620737
917.8H60620737j700342j197815k43783j9908p89463j573026j387716m50849Q5831
$$ 860620737 858920395 857722580 857478797 857458889 856669426 855096400 853708684 853257835 853343666
936.2H53343666k80798p87616o40750j73151k44021r17912j374781j017630m73380
$$ 853343666 853062868 852275252 851634502 851461351 851217330 850299418 848924637 847907007 847433627
954.5H47433627q87037k055525k605498j914144r19580j039505k331913l424585l161311
$$ 847433627 846546590 844491065 841885567 839971423 839051843 838012338 835680425 832255840 829094529
972.9H29094529j705170o42597r30429j521825j730979k260745l432035m482746m846394
$$ 829094529 827389359 826746762 825816333 824294508 822563529 820302784 816870749 812388003 807541609
991.2H07541609n068839o045937q087695j0889828j3062477j3094545j1818230r521484
$$ 807541609 802472770 796426833 788339138 777449310 764386833 751292288 739474058 729952574
1007.5G29952574n760312l447354m495382o412268o542146n041659l569484k826214
$$ 729952574 724192262 720744908 716249526 709837258 703295112 698253453 694683969 691857755
1023.9F91857755k100110o22928J355350L119290M135907M361808M308879M304528
$$ 691857755 689757645 689134717 690490067 693609357 697745264 702107072 706415951 710720479
1040.2G10720479L942371K672851Q39293n83172j229465j692057k516686l480494m039109
$$ 710720479 714662850 717335701 718174994 717591822 716362357 714670300 712153614 708673120 704634011
1058.5G04634011m160106m396975n009175n476475n202889m396856l765404l536820
$$ 704634011 700473905 696076930 691067755 685591280 680388391 675991535 672226131 668689311
1074.8F68689311l285766k730370k180099k135754k556324k775550k428770j955569
$$ 668689311 665403545 662673175 660493076 658357322 655800998 653025448 650596678 648641109
1091.2F48641109j800179j732647j313448o54459m22001p00772m34280R70841K640843
$$ 648641109 646840930 645108283 643794835 643140376 642718375 642017603 641583323 642554164 645195007
1109.5F45195007L848434M689157N292713N696953N765497N299449M477323L950119
$$ 645195007 649043441 653732598 659025311 664722264 670487761 675787210 680264533 684214652
1125.8F84214652M214346N087018N699635N376935M549980L888368L369928K737403
$$ 684214652 688428998 693516016 699215651 704592586 709142566 713030934 716400862 719138265
1142.2G19138265K140700J847089J680791J145303j31487k248407m977703p711291
$$ 719138265 721278965 723126054 724806845 725952148 725820661 723572254 718594551 710883260
1158.5G10883260r594321j0006667r008884p592797r155035j6637862k5287449k5345743
$$ 710883260 701288939 691282272 682273388 674680591 665525556 648887694 623600245 598254502
1174.8E98254502j3917446L214895K0508826L3589423L7539065L2811165K4824619
$$ 598254502 584337056 587551951 608060777 641650200 679189265 712000430 736825049
1189.1G36825049J7288268J1403977P414699M871964L415645K768337K255857J322329
$$ 736825049 754113317 765517294 772931993 777803957 781219602 783987939 786243796 787566125
1205.4G87566125N9665j009941j294792n81980P36833J944065K333104J771927P35939
$$ 787566125 787625790 786615849 785321057 784739077 785475910 787419975 789753079 791525006 792260945
1223.7G92260945m40419j629054k641678l491819m498780n958438p896066j0211408
$$ 792260945 791820526 790191472 787549794 784057975 779559195 773600757 765704691 755493283
1240.1G55493283j2924313j5873790j8028975j7815888j4806211j0517001o808340
$$ 755493283 742568970 726695180 708666205 690850317 676044106 665527105 658718765
1254.3F58718765l812611j42575N020976J0557414J3927996J2690246O362855k542495
$$ 658718765 654906154 654763579 659784555 670341969 684269965 696960211 703323066 700780571
1270.6G00780571r999276j1972785n132198R380281K2535920K5140703J8419623J1142194
$$ 700780571 690781295 678808510 673676312 683056593 705592513 730733216 749152839 760295033
1287G60295033R115756J0236561R397805N856216K719820J557171O80566r12607j472116
$$ 760295033 769410789 779647350 789045155 794901371 797621191 799178362 799858928 798946321 797474205
1305.3G97474205p63475j086653k467692k482533r7215L968715Q452774J1021256R660482
$$ 797474205 796710730 795624077 793156385 790673852 790576637 794545352 802998126 814019382 823679864
1323.7H23679864N659283J804888j296759l834665m559636k595007L47137J864970
$$ 823679864 829339147 831144035 829847276 826012611 821452975 818857968 819205105 821070075
1340H21070075J804113J718641K191305K568304K202154J212299M21047J95503J65522
$$ 821070075 822874188 824592829 826784134 829352438 831554592 832766891 833187938 833383441 833548963
1358.3H33548963l89874j740158k867281k905130k986551l784120m759431n684912
$$ 833548963 833159089 831418931 828551650 825646520 822659969 818875849 814116418 808431506
1374.7H08431506n813837n058169l914953j814186J723528M682541L984332J178980
$$ 808431506 802617669 797559500 793644547 791830361 793553889 798236430 802220762 803399742
1391H03399742n87523j666904k861321m420221n651235n706609n512595n232393m674137
$$ 803399742 802812219 801145315 798283994 793863773 788212538 782505929 776993334 771760941 767086804
1409.3G67086804l707826j969099m19498j023829l983676m952967l609836l817559
$$ 767086804 763378978 761409879 760990381 759966552 755982876 751029909 747420073 743602514
1425.7G43602514n637824o188691k242505L881096O963373N873978M478991N508125
$$ 743602514 737964690 731775999 729533494 733414590 740377963 746251941 750730932 756239057
1442G56239057O844997O437123L581881l52919k086878j170396p7248j417160j793981
$$ 756239057 763084054 769521177 773103058 772750139 770663261 769492865 769415617 767998457 766204476
1460.3G66204476J315117N351067O735205N548537M953981M101813J192092k109766
$$ 766204476 767519593 772870660 779605865 785154402 790108383 794210196 795402288 793292522
1476.6G93292522m309237n338907m707455k354444L33488K160073K993643L619313
$$ 793292522 788983285 783644378 778936923 776582479 776915967 779076040 782069683 785688996
1493G85688996L995657K102554k765953o662965q455456j3511061k6347041l0742646
$$ 785688996 789684653 791787207 789021254 782358289 773902833 760391772 734044731 703302085
1509.3G03302085k5729298j9496083j0404706m8280J3183951K9298902L3606469K4931491
$$ 703302085 677572787 658076704 647671998 647623718 660807669 690106571 723713040 748644531
1525.6G48644531J5622616Q562624O213725N823612M619658M824459O336689M867912
$$ 748644531 764267147 772829771 779043496 784867108 789486766 794311225 800647914 805515826
1541.9H05515826K442658J570880J752555K461792K704143K362132J811385L2902m565239
$$ 805515826 807958484 809529364 811281919 813743711 816447854 818809986 820621371 820654273 816089034
1560.3H16089034o427050p557451r791494j0399937p706285k827465j360715m965126
$$ 816089034 809661984 802104533 792313039 781913102 774206817 771379352 770018637 765053511
1576.6G65053511q193910j0230363j4568090j5297413o026864M970729K145589j4662385
$$ 765053511 756859601 746629238 732061148 716763735 710736871 715707600 717853189 703190804
1592.9G03190804l0922711l4055949k1989703l189981J0350108J4488876J6577661
$$ 703190804 672268093 638212144 616222441 613032460 623382568 637871444 654449105
1607.2F54449105K1270752K3512244K0642341J7338454J3580323P186412L248036J954854
$$ 654449105 675719857 699232101 719874442 737212896 750793219 757979631 761227667 763182521
1623.5G63182521K034724L597438M939020N012571M800976L621220J130164K01583
$$ 763182521 765217245 768814683 773753703 778766274 783567250 787188470 788318634 788520217
1639.8G88520217K56896j06156j578987l690481l181219j533866j622855r50158P70986
$$ 788520217 788777113 788670957 787091970 783401489 780220270 778686404 777063549 776113391 776884377
1658.2G76884377O93142k286911n171060l635228R88126N262792O727755P329404P318676
$$ 776884377 777577519 775290608 770119548 766484320 767472446 772735238 779462993 786792397 794111073
1676.5G94111073O691158O971896P461309O399929L653646K877891L051043K951502
$$ 794111073 800802231 807774127 815235436 821635365 825289011 828166902 831217945 834169447
1692.8H34169447L555298L915191L558099K477408J161813J521647J977742J599372
$$ 834169447 837724745 841639936 845198035 847675443 848837256 850358903 852336645 853936017
1709.2H53936017J411199J655221K136827J676976k36213j159251p83920j03474N59509
$$ 853936017 855347216 857002437 859139264 860816240 860580027 859420776 858636856 858533382 859092891
1727.5H59092891Q59022Q43048N21899k16365N7578M76956J19150K83659J162290J608491
$$ 859092891 859951913 860794961 861316860 861100495 861158073 861635029 861754179 862037838 863200128 864808619
1747.9H64808619Q20339l88325j90198Q10027R50992M12464o7889k9207O64771R68814
$$ 864808619 865628958 865240633 865050435 865860462 866811454 867223918 867156029 867126822 867791593 868760407
1768.3H68760407N57184k08735p14898m15385j24693k92063k45273K37227M49776M50254
$$ 868760407 869317591 869108856 868393958 867978573 867853880 867561817 867316544 867553771 868003547 868453801
1788.7H68453801N42998K76268m5002J07646Q2433k89738l18229J18375L46720J35422
$$ 868453801 868996799 869273067 869228065 869335711 869418144 869128406 868810177 868928552 869275272 869410694
1809.1H69410694r5308N6386L70502K11776k24829q1539N78999P48694K79725k71976
$$ 869410694 869315386 869371772 869742274 869954050 869729221 869647682 870226681 870975375 871255100 870983124
1829.5H70983124o18100k87772J06872j56105l28004K98082P20978p5817q87334p72596
$$ 870983124 870365024 870077252 870184124 870028019 869700015 869998097 870719075 870643258 869755924 868983328
1849.9H68983328j81436K12490J7405m27723m55260K682M09901M10497o9082o13570
$$ 868983328 868801892 869014382 869031787 868604064 868148804 868151486 868561387 868971884 868902802 868289232
1870.3H68289232m63783r7573k49386m81606k59101R5367N5731k66612m49240l81112
$$ 868289232 867825449 867727876 867478490 866996884 866737783 866833150 866888881 866622269 866173029 865791917
1890.7H65791917j72973k36511o84083q14795l78907k2352j26242l32654k27868P1466
$$ 865791917 865618944 865382433 864698350 863883555 863504648 863482296 863356054 863023400 862795532 862866998
1911.1H62866998K01165P2420k00272l22818k6942J13964j91509k06650K45750N94020
$$ 862866998 863068163 863140583 862940311 862617493 862590551 862704515 862513006 862306356 862552106 863146126
1931.5H63146126M13001q1897k28167J98901N19097Q5115m98950m52995o56K09749
$$ 863146126 863559127 863477230 863249063 863447964 863967061 864052176 863553226 863100231 863099575 863309324
1951.9H63309324j09613n46277m83453k3723J44422j09672l22580k19942K4021k1100
$$ 863309324 863199711 862653434 862169981 862146258 862290680 862181008 861858428 861638486 861662507 861641407
1972.3H61641407l95954n69403l02255m4107k11060n50390n06341o3420J90735j45852
$$ 861641407 861245453 860676050 860373795 860329688 860118628 859568238 859061897 858998477 859189212 859043360
1992.6H59043360n74112m22538O6042K25544p3194l07858n0962M05848M45604O1512
$$ 859043360 858469248 858046710 858112752 858338296 858265102 857957244 857906282 858312130 858757734 858819246
2013H58819246j58190J5914J78874m650l53396m26232j08600J48356l2008l70741l35037
$$ 858819246 858661056 858676970 858855844 858851194 858497798 858071566 857962966 858111322 858079314 857708573 857373536
2035.5H57373536M2259K19524l7372l21507j68920K20418K77937o7413l00646j05262
$$ 857373536 857415795 857635319 857597947 857276440 857107520 857327938 857605875 857538462 857237816 857132554
2055.9H57132554K11477K06769m7386r5188J98304M45724L00944N662J3948K93552
$$ 857132554 857344031 857550800 857503414 857408226 857606530 858052254 858353198 858358860 858372808 858666360
2076.3H58666360M02213J17659k25127j81138J53422K58625m8042l17335j48535J81735
$$ 858666360 859068573 859186232 858961105 858779967 858933389 859192014 859143972 858826637 858678102 858859837
2096.7H58859837J65999j70529l20792n0247K36631R7334k65062l25203l4213J55211
$$ 858859837 859025836 858855307 858534515 858484268 858720899 858818233 858553171 858227968 858193755 858348966
2117.1H58348966n0962l47078k62857J15693K58565k8610k90513j12713K62261L27706
$$ 858348966 858298004 857950926 857688069 857803762 858062327 858033717 857743204 857630491 857892752 858220458
2137.5H58220458L0518j60814Q7083M38153L96252Q7142J4365K89857M98772L23176
$$ 858220458 858250976 858090162 858177245 858615398 859011650 859098792 859113157 859403014 859901786 860224962
2157.9H60224962O080O556K99454M14193J46568j25110O198L39508L67523K6643j80543
$$ 860224962 860231042 860237598 860537052 860951245 861097813 860972703 860978901 861318409 861685932 861712575 861532032
2180.3H61532032L7849L06905J86622j67012k45631N0783K77460Q4579k65003k74479
$$ 861532032 861569881 861876786 862063408 861896396 861650765 861701548 861979008 862063587 861798584 861524105
2200.7H61524105O9916K72215L1113k81870j98781J20639J78159j00196k96533j35422
$$ 861524105 861594021 861866236 861897349 861615479 861416698 861537337 861715496 861615300 861318767 861183345
2221.1H61183345J44005J42038j54316k92957j9014K51651J00493k36928k70248M4108
$$ 861183345 861327350 861469388 861315072 861022115 861003101 861254752 861355245 861118317 860848069 860892177
2241.5H60892177K39908n9l28780k68459L5882R3758j69694l52204j94848P0036N1975
$$ 860892177 861132085 861132026 860803246 860534787 860570669 860664427 860494733 860142529 859947681 860017717 860069692
2263.9H60069692k42770l70264j14083J59681N6624k36809k48492O2645K33173j3709
$$ 860069692 859826922 859456658 859342575 859502256 859558880 859322071 859073579 859136224 859369397 859355688
2284.3H59355688l30567k99990l9161M8638k03848m65095l21508K6346J01685j20163
$$ 859355688 859025121 858725131 858685970 858734608 858530760 858065665 857744157 857770503 857872188 857752025
2304.7H57752025k50220o3837J32144j7703l19779l77118k00451p4863j65105l42608
$$ 857752025 857501805 857437968 857570112 857552409 857232630 856855512 856655061 856580198 856415093 856072485
2325.1H56072485l31461j18613l6359k35438l81411k05159Q1718N7996k44499j96933
$$ 856072485 855741024 855622411 855586052 855350614 854969203 854764044 854845762 854903758 854659259 854462326
2345.5H54462326K27809L18229K9683k95699m03464k49862k0743j14262l76999k19584
$$ 854462326 854690135 855008364 855038047 854742348 854338884 854089022 854068279 853954017 853577018 853357434
2365.9H53357434J67668K17796k7657j24216J09672L34263K23100p5221j91688q345
$$ 853357434 853525102 853742898 853715241 853591025 853700697 854034960 854258060 854182839 853991151 853982806
2386.3H53982806J89364O8665k61367l73304j50859L9339j25110m05192l49045n3227
$$ 853982806 854172170 854240835 853979468 853606164 853455305 853494644 853369534 852964342 852615297 852562070
2406.7H52562070O56k96712n09024k97785J5021k6465l16858m43697k60115m4048j16050
$$ 852562070 852562726 852266014 851756990 851459205 851474226 851447761 851130903 850687206 850427091 850383043 850266993
2429.1H50266993l89159m47094j95801n8473k59935n00679m54367j91986n2750j72556
$$ 850266993 849877834 849430740 849234939 849176466 848916531 848415852 847961485 847769499 847716749 847544193
2449.5H47544193l03030j62184J08659J00375j80901l03387j05083O5744r6679l75211
$$ 847544193 847241163 847078979 847187638 847288013 847107112 846803725 846698642 846764386 846667707 846292496
2469.9H46292496m04001j98543o4015k12610m74572m73201k26557j40548l42906m90904
$$ 846292496 845888495 845689952 845625937 845413327 844938755 844465554 844238997 844098449 843755543 843264639
2490.3H43264639l24189m5300j3828k54512l91126k25484n1141j62661m15385m63545
$$ 843264639 842940450 842895150 842881322 842626810 842235684 842010200 841959059 841796398 841381013 840917468
2510.7H40917468k62439j20580k57075m54962m00246j88589j56998l88503o09220n41806
$$ 840917468 840655029 840534449 840277374 839822412 839422166 839233577 839076579 838688076 838078856 837537050
2531.1H37537050l21448l10301n49436p14481n64992l54410m32312o44028o25670l67999
$$ 837537050 837215602 836905301 836355865 835641384 835076392 834721982 834289670 833645642 833019972 832651973
2551.5H32651973j90735k93791n00620m96447k61903j21474k82109m75585l94702j92225
$$ 832651973 832461238 832167447 831666827 831170380 830908477 830787003 830504894 830029309 829634607 829442382
2571.9H29442382j68026l45111m86612m05133k61485l71993o55532p23123m48287j09970
$$ 829442382 829274356 828929245 828442633 828037500 827776015 827404022 826748490 826025367 825577080 825467110
2592.3H25467110m0591j51336q3208J78277K68400L1888k30729j95384L4034N3585
$$ 825467110 825426519 825275183 825191975 825370252 825638652 825670540 825439811 825244427 825278461 825332046
2612.7H25332046j94073l47793j92523K7060m8160l31581m20332k32279r8944k30193
$$ 825332046 825137973 824790180 824597657 824624717 824576557 824244976 823824644 823592365 823493421 823263228
2633.1H23263228m35591m02331j69993j07050l50236o18995n65827k85744k20657m38213
$$ 823263228 822827637 822425306 822255313 822148263 821798027 821179032 820613205 820327461 820106804 819668591
2653.5H19668591n64635l83079j00612p8261l65198n54025l76940j35183j75655m05371
$$ 819668591 819103956 818720877 818620265 818542004 818176806 817622781 817245841 817110658 816935003 816529632
2673.9H16529632m76063k87890j70231l78132o45161n83767k98918k09808m37796o47187
$$ 816529632 816053569 815765679 815595448 815217316 814572155 813988388 813689470 813479662 813041866 812394679
2694.3H12394679n34654k65360k34246n17130p32064n91159l64423m26829o40571o54638
$$ 812394679 811860025 811594665 811360419 810843289 810111225 809520066 809155643 808728814 808088243 807433605
2714.6H07433605m26173k59817m23729o93142p00117n29527m90368o49333p61687n72503
$$ 807433605 807007432 806747615 806323886 805630744 804930627 804401100 803910732 803261399 802499712 801927209
2735H01927209k15590r6679l37064n75245m58598k24530l25323o59048p53105n12957
$$ 801927209 801711619 801614940 801277876 800702631 800244033 800019503 799694180 799035132 798282027 797769070
2755.4G97769070k74539l15249n32747n32448k30968p5221l13103o06358o17385m75049
$$ 797769070 797494531 797179282 796646535 796114087 795883119 795807898 795494795 794888437 794271052 793796003
2775.8G93796003m77553o82234q39949o66141l16442k53975n40554o92368m33981j73450
$$ 793796003 793318450 792636216 791796267 791130126 790813684 790559709 790019155 789326787 788892806 788719356
2796.2G88719356l58880p83979r14336o53386m00901m88638p85411q43108n89132n03123
$$ 788719356 788360476 787576497 786662161 786008775 785607874 785119236 784333825 783490717 782901585 782398462
2816.6G82398462q19266j177966j221061j126110j360238k002657k640008k854526
$$ 782398462 781579196 780401230 779180169 778054059 776693821 774691164 772051156 769196630
2832.9G69196630k530396j753808p25567L96550J471937J961171J492024N65648j4484
$$ 769196630 766666234 764912426 764186859 764583409 766055346 768016517 769508541 770074189 770059705
2851.3G70059705k5451R6857K2292k7775K24471N68926N93960K58625J3351J76668
$$ 770059705 770034254 770131111 770153403 770125628 770350099 770919025 771512985 771771610 771784961 771961629
2871.7G71961629L60430J65760k16007m02987k84493j96219m74452r22502j120507
$$ 771961629 772322059 772487819 772271812 771868825 771584332 771388113 770913661 769991159 768870652
2890.1G68870652j008988r37700j173258j470685j391649j024008q82745j056313j125336
$$ 768870652 767861664 766923964 765750706 764280021 762888372 761864364 760981619 759925306 758799970
2908.4G58799970q85010o61671q50141j252591j285911p97272j83582R3698J8180j01209
$$ 758799970 757914960 757253289 756403148 755150557 753864646 753067374 752883792 752977490 752995670 752894461
2928.8G52894461k04027l78131n60821n18798r0123M70460O47604K29478m00126p12871
$$ 752894461 752690434 752312303 751751482 751232684 751142561 751613021 752260625 752490103 752089977 751377106
2949.2G51377106p73669j181185j977622k458215k227664j541317p96675n9247P89523
$$ 751377106 750603437 749422252 747444630 744986415 742758751 741217434 740420759 740361512 741151035
2967.6G41151035J602471K082586K072275J759112J606643J587689J212775N00381
$$ 741151035 742753506 744836092 746908367 748667479 750274122 751861811 753074586 753574967
2983.9G53574967l1292m9651K59161L35336K0862j73629p2062K2173n1737k50876j97947
$$ 753574967 753543675 753494024 753753185 754088521 754109383 753935754 753863692 753885865 753834128 753583252 753385305
3006.3G53385305K70844O08444L87132p5459k57194j13547k2769j40667k35498k01762
$$ 753385305 753656149 754264593 754651725 754576266 754319072 754205525 754182756 754042089 753806591 753604829
3026.7G53604829j32203j67548l02494l21865j56760Q8274K22147J11401j7345J20401
$$ 753604829 753472626 753305078 753002584 752680719 752523959 752612233 752834380 752945781 752928436 753048837
3047.1G53048837K64645k6524m10497k26200L31044O32763N38528L85225M95970O69003
$$ 753048837 753313482 753286958 752876461 752650261 752981305 753614068 754152596 754537821 755033791 755702794
3067.5G55702794N85258M28438N64635J090705J568377J421213Q36849M74513M77314
$$ 755702794 756288052 756716490 757281125 758371830 759940207 761361420 762198269 762672782 763150096
3085.8G63150096N26845K65897l19004o73652m92632j40131l0458q3327J18673M87387
$$ 763150096 763676941 763942838 763623834 762950182 762457550 762317419 762286961 762203634 762322307 762809694
3106.2G62809694M28736j40548m89890k28405K1338k39849p74622j049578p76649l73184
$$ 762809694 763238430 763097882 762607992 762379587 762400925 762161076 761386454 760336876 759560227 759187043
3126.6G59187043l69251o53327p68423n47170k98977m21405q03292r45091p90238p37191
$$ 759187043 758817792 758164465 757396042 756848872 756549895 756128490 755325198 754380107 753589869 752852678
3147G52852678q73625r87828j006901r34064q45194q94606r50635p95543o10054p09951
$$ 752852678 751979053 750991225 749984324 749050260 748205066 747310460 746359825 745564282 744954228 744244277
3167.4G44244277r95218j117170r90808q91388j100123j416921j442373j238823j155317
$$ 744244277 743249059 742131889 741141081 740249693 739149570 737732649 736290276 735051453 733896136
3185.8G33896136j310348j499057j470447j296281j274407j478434j641810j560748
$$ 733896136 732585788 731086731 729616284 728320003 727045596 725567162 723925352 722364604
3202.1G22364604j432895j476884j628518j670003j503527j340747j362026j440287
$$ 722364604 720931709 719454825 717826307 716156304 714652777 713312030 711950004 710509717
3218.4G10509717j375377j167476j021624j047372j120389j038492q28087q93235j212359
$$ 710509717 709134340 707966864 706945240 705897868 704777479 703738987 702910900 702017665 700805306
3236.8G00805306j254141r85324p86841q34048j028359j155317j017928p36117o84619
$$ 700805306 699551165 698565841 697779000 696944952 695916593 694761276 693743348 693007231 692322612
3255.1F92322612q68917q78930o05881m00960l97385l18229o2167M2676p9035j58608
$$ 692322612 691453695 690574765 689968884 689567924 689170539 688852310 688790143 688832819 688753784 688595176
3275.5F88595176j09792P4923K69651K89739K07424K01583L75092N41210M01020J21951
$$ 688595176 688485384 688560307 688829958 689119697 689327121 689528704 689903796 690445006 690846026 690967977
3295.9F90967977O3658L06904O69301Q28981O39737L16918J67489K34246K75791J70230
$$ 690967977 691031635 691338539 692007840 692836821 693476558 693793476 693960965 694195211 694471002 694641232
3316.3F94641232J45495K44320K36273N9962k26200m24623m29869m65929n86212o59466
$$ 694641232 694786727 695031047 695267320 695327282 695101082 694676459 694246590 693780661 693194449 692534983
3336.7F92534983p82311j006186j232028j451671j497686j344859j448691j857579
$$ 692534983 691752672 690746486 689514458 688062787 686565101 685220242 683771551 681913972
3353F81913972k049387j881957j714348j804352k003789j996756j860440k019167k440273
$$ 681913972 679864585 677982628 676268280 674463928 672460139 670463383 668602943 666583776 664143503
3371.4F64143503k575219k273977j938462j807809j830399j868129j788735j494885
$$ 664143503 661568284 659294307 657355845 655548036 653717637 651849508 650060773 648565888
3387.7F48565888j105606j142025j596153j660883j177788q93831j229108j614332
$$ 648565888 647460282 646318257 644722104 643061221 641883433 640989602 639760494 638146162
3404F38146162j433432j022875q66771r04322r44733q24213n55873m58300n39482m41373
$$ 638146162 636712730 635689855 634823084 633918762 632974029 632149816 631593943 631135643 630596161 630154788
3424.4F30154788j07288J47164J15931J38700L76463M06682J81914J38223L93748P11918
$$ 630154788 630047500 630194664 630310595 630449295 630825758 631232440 631414354 631552577 631946325 632658243
3444.8F32658243Q82805Q39889P97689Q89420J023650J206994J374841J300931J166582
$$ 632658243 633541048 634380937 635178626 636068046 637091696 638298690 639673531 640974462 642141044
3463.2F42141044J371384J645624J418293R44555R62853J379788J681090J656472J337409
$$ 642141044 643512428 645158052 646576345 647520900 648483753 649863541 651544631 653201103 654538512
3481.5F54538512J155734J340807J467228J391828J449883J626730J710295J650155
$$ 654538512 655694246 657035053 658502281 659894109 661343992 662970722 664681017 666331172
3497.8F66331172J608014J642823J489520J319230J437306J631737J735389J699090
$$ 666331172 667939186 669582009 671071529 672390759 673828065 675459802 677195191 678894281
3514.2F78894281J599908J613736J756490J956463J895546J605154J505196J575589
$$ 678894281 680494189 682107925 683864415 685820878 687716424 689321578 690826774 692402363
3530.5F92402363J735508J998306K027809J775801J832128K233922K331436J892865
$$ 692402363 694137871 696136177 698163986 699939787 701771915 704005837 706337273 708230138
3546.8G08230138J579344J743913J908600J914442J978993K103925K219140K358914
$$ 708230138 709809482 711553395 713461995 715376437 717355430 719459355 721678495 724037409
3563.1G24037409K486586K325595J862526J754761K120673K377749K344608K392232
$$ 724037409 726523995 728849590 730712116 732466877 734587550 736965299 739309907 741702139
3579.4G41702139K626062K898991L005385K629340K118707K187431K546429K598882
$$ 741702139 744328201 747227192 750232577 752861917 754980624 757168055 759714484 762313366
3595.7G62313366K438188K333760K260148K304852K497912K637982K544403K390623
$$ 762313366 764751554 767085314 769345462 771650314 774148226 776786208 779330611 781721234
3612.1G81721234K203465J985252J985848J801669J417756J580060K126455K274990
$$ 781721234 783924699 785909951 787895799 789697468 791115224 792695284 794821739 797096729
3628.4G97096729J437545P32601Q33869J003623J047611J131773J284659J618802K055884
$$ 797096729 798534274 799266875 800100744 801104367 802151978 803283751 804568410 806187212 808243096
3646.7H08243096J839876N18143l11613L2425M17709K88904J59025K31862N67079J092017
$$ 808243096 810082972 810601115 810289502 810321927 810739636 811028540 811187565 811419427 811986506 813078523
3667.1H13078523J260459Q38578N71608K83122n49316p49886k75195K65718R29892
$$ 813078523 814338982 815177560 815749168 816032290 815482974 814733088 814457893 814723611 815653503
3685.5H15653503J475453R48966l33548o91175k36094K64704N43416M16576L1889J48892
$$ 815653503 817128956 818077922 817744374 817053199 816817105 817081809 817625225 818041801 818073690 818222582
3705.9H18222582P86484J009583J99497o71804n30124o55K45809J95563L4630n5372
$$ 818222582 819009066 820018649 820218146 819546342 819016218 819015563 819261372 819456935 819491565 819436193
3726.3H19436193Q6486N57124J013458O96361k34425o38604k62201L51608N10991J28448
$$ 819436193 819522679 820079803 821093261 821789622 821555197 820916593 820654392 821006000 821516991 821645439
3746.7H21645439J12474n2274p98761q82209l73542j71662l00705j82271J55926K49922
$$ 821645439 821757913 821705639 820906878 820024669 819651127 819479465 819178760 818996489 819152415 819402337
3767.1H19402337M17m29928n64158j70708K75970K34604j91629l15309j94788j66535
$$ 819402337 819402754 818972826 818408668 818237960 818513930 818748534 818556905 818241596 818046808 817880273
3787.5H17880273j17540o378K17438M70459M62651K77937l219l03030k77340l61503
$$ 817880273 817762733 817756355 817973793 818444252 818906903 819184840 819181621 818878591 818601251 818239748
3807.8H18239748n48958k12848L60548O20246M60207J35005n11587q80599m77612q8215
$$ 818239748 817690790 817477942 817838490 818458736 818918943 819053948 818542361 817661762 817184150 817095935
3828.2H17095935Q7500L31223N36025M67538m7028o49512p81059n80787k39194L00586
$$ 817095935 817183435 817514658 818050683 818518221 818471193 817821681 817040622 816459835 816220641 816521227
3848.6H16521227Q49426O97255n61416j142859n91278N2034L25621K02477K3186J4484
$$ 816521227 817370653 818067908 817506492 816363633 815772355 815824389 816150010 816352487 816375673 816390157
3869H16390157j33217m11749m70757k81215O6281K00987J28984Q047l08276l04341
$$ 816390157 816256940 815845191 815374434 815093219 815159500 815360487 815489471 815497518 815189242 814884901
3889.4H14884901j46389l26335j75536L65555N16057J89185k53081o67572p50363m24981
$$ 814884901 814738512 814412177 814236641 814602196 815118253 815307438 815054357 814386785 813636422 813211441
3909.8H13211441m0114J58966J93178L1412j58489j13129J9252M77q7321n2750l7849
$$ 813211441 813171327 813330293 813523471 813554883 813396394 813283265 813302517 813302994 813215673 813162923 813125074
3932.3H13125074k25782l52860j82509O6638J15335J19m8340n0008j29819j70767j52886
$$ 813125074 812899292 812546432 812363923 812430561 812545896 812546015 812497675 812447667 812317848 812147081 811994195
3954.7H11994195j34408n7936M053n5373p6115J5497J5736q7679r0777l1531p6771
$$ 811994195 811859787 811801851 811805904 811750531 811674416 811689913 811705649 811617970 811527193 811495662 811418891
3977.1H11418891j02997j848L8267j18554k32339j27971q0168j31250q8811l2186
$$ 811418891 811315894 811314046 811352313 811233759 811001420 810873449 810793281 810662031 810573220 810541034
3997.5H10541034
$$ 810541034
##END=$$ End of the data block
