##TITLE=LIG1 $$ Begin of the data block
##JCAMP-DX=5.00 $$ ACD/SpecManager v 10.08
##SPECTROMETER/DATA SYSTEM=Alpha
##DATE=10 Apr 2015 14:18:26
##DATA TYPE=INFRARED SPECTRUM
##DATA CLASS=XYDATA
##ORIGIN=
##OWNER=
##NPOINTS=1667
##FIRSTX=599.64648438
##LASTX=3997.64306641
##MAXX=3997.64306641
##MINX=599.64648438
##MAXY=1.11873806
##MINY=0.55533218
##XFACTOR=1.0000000000
##YFACTOR=0.000000010000000
##FIRSTY=1.04899919
##DELTAX=2.03961372
##XUNITS=1/CM
##YUNITS=ARBITRARY UNITS
##XYDATA=(X++(Y..Y))
599.6A04899919j57356m578J26004J87374J61635O1906r0444k88606m90618m88174
620A03917062k26295j049K7609k885m6634j14286p6557Q2505K00284K61283L58355
642.5A04379392M61864M92096M35662L30842K01559O3133l3545r1994j40739j40464
662.9A05957806j2064J78301q535l50714l06534k26427k12717k08687k23577k63858
683.3A04322994k51115j70493j42514k13325l01874l53742l67462l93105m52125m84586
703.7A01192653m71711m61853n03343o36226q17305q72820o55538j74910L39425N98842
724.1I7537214N44887L32725J41138j9407k63405o75034j333821k409125m036998o025076
744.5H3793098p637775p936073o609696m266166j810170J83386J607841K637732L394729
$$ y = [104899919, 104742563, 104737985, 104863989, 105051363, 105212998, 105274904, 105184460, 104895854, 104405236, 103917062, 103690767, 103689718, 103717327, 103714442, 103667808, 103553522, 103476965, 103559470, 103759754, 104021037, 104379392, 104841256, 105333352, 105769014, 106099856, 106301415, 106364548, 106331003, 106239009, 106098270, 105957806, 105945742, 106124043, 106115508, 105764794, 105458260, 105231833, 105019116, 104810429, 104586852, 104322994, 104071879, 103901386, 103758872, 103545547, 103243673, 102889931, 102522469, 102129364, 101677239, 101192653, 100720942, 100259089, 99755746, 99119520, 98302215, 97429395, 96773857, 96598947, 96938372, 97537214, 98082101, 98414826, 98555964, 98536557, 98273152, 97598118, 96264297, 93855172, 89818174, 83793098, 76155323, 68219250, 61609554, 57343388, 55533218, 55716604, 57324445, 59962177, 63356906]
762.8F3356906L926206M235714M322196M188418L831065L280604K629196J965237J380592
781.2I3116134R11409N41633L09498K26742K74235M35954O36160P58529P38674N98681
801.6I8547649M10539K42698J27179M7594n036k3836m0150o5303q3101r7191j28740
824I8932302k00093k96855l97604n04786o10334o84422p11233p10284o60843n02306
844.4I3653542k94477j89161k07716k29735j83820j15019j26189k77311m88305n81068
864.8I0960741m42618j30344K30861N75847Q86589J121825J185304J019656P20293
883.2I6128154M46296K54654J14221R42p6074j20711j44804j38777r6530l7628l082
905.6I6326661k0969q9198j74612k50822l20882l89439m63015n69897p38937r35120
$$ y = [63356906, 67283112, 71518826, 75841022, 80029440, 83860505, 87141109, 89770305, 91735542, 93116134, 94027543, 94569176, 94878674, 95105416, 95379651, 95815605, 96451765, 97210294, 97948968, 98547649, 98958188, 99200886, 99328065, 99375659, 99370623, 99346787, 99306637, 99241334, 99158233, 99061042, 98932302, 98732209, 98435354, 98037750, 97532964, 96922630, 96238208, 95526975, 94816691, 94155848, 93653542, 93359065, 93169904, 92962188, 92732453, 92548633, 92433614, 92307425, 92030114, 91541809, 90960741, 90518123, 90387779, 90618640, 91194487, 92081076, 93202901, 94388205, 95407861, 96128154, 96574450, 96829104, 96943325, 96944267, 96868193, 96747482, 96602678, 96463901, 96367371, 96329743, 96326661, 96305692, 96216494, 96041882, 95791060, 95470178, 95080739, 94617724, 94047827, 93308890, 92373770]
926I2373770j064223j054310q97891o38342l29518L7175M73148Q91221J191163J314229
946.4I2296422J213192R06063N25456K16913J3918j15794j81877j89555j62959j23221
966.8I4398558p6914k6995K2996O9970J14095J53094J49292P5585o3813l26973p94852
989.2I3694043j401675j809281j502287m94391L18819L26455n3638k52915j74456M2921
1009.6H8693595K56866L82823M08894L58838K74342K13528J90883J13190j75852p27606
1030H9989501j332664j569569j188410m64195Q2368K27755J01644k4217Q5175M45938
1050.4H6353326Q30573R79954Q39096N29456J87159j05143l18098m56017n41425n91052
1070.8H7707829o10131o22654o51466o87677p27230p72900p91651p19660n32276k66522
$$ y = [92373770, 91309547, 90255237, 89357346, 88719004, 88389486, 88426661, 88899809, 89791030, 90982193, 92296422, 93509614, 94415677, 94941133, 95158046, 95171964, 95056170, 94874293, 94684738, 94521779, 94398558, 94321644, 94294649, 94317645, 94387615, 94501710, 94654804, 94804096, 94879681, 94815868, 94488895, 93694043, 92292368, 90483087, 88980800, 88486409, 88805228, 89131683, 89078045, 88825130, 88650674, 88693595, 88950461, 89333284, 89742178, 90101016, 90375358, 90588886, 90779769, 90892959, 90717107, 89989501, 88656837, 87087268, 85898858, 85434663, 85517031, 85744786, 85846430, 85822213, 85907388, 86353326, 87183899, 88163853, 89002949, 89532405, 89719564, 89614421, 89296323, 88840306, 88298881, 87707829, 87097698, 86475044, 85823578, 85135901, 84408671, 83635771, 82844120, 82124460, 81592184, 81325662]
1091.2H1325662N406J49602K0897l61281p51049q82101q01056q16989r35513p62206
1111.6G6191372j31101O42199J168996J325762J212847R99338P97128O32274M88526
1129.9H3327341L43639K11835R1767o6364l05867o87355j230126j678604j572353p47395
1150.3G7686518L86256J220531J486510J299548R04530N23400K72078J34706N5844
1168.7H3969921J3822j3047n8055j26839j94889k25634j75321k7930J84244L89730
1189.1H3736002N10908N20265M28086K68489J02640K68J5330J48177L29787M67443
1209.5H6527395M90731L52234P8750k14965m23598n18381n36269n32276n44363n87601
1229.9H4091657o53159o95062o84518o75153p21032q08453r34351j135039j441091
$$ y = [81325662, 81331068, 81480670, 81501567, 81140286, 80389237, 79507136, 78706080, 77889091, 76953578, 76191372, 76060271, 76702470, 77871466, 79197228, 80410075, 81409413, 82206541, 82838815, 83327341, 83670980, 83882815, 83974582, 83908218, 83602351, 82914996, 81684870, 80006266, 78433913, 77686518, 78072774, 79293305, 80779815, 82079363, 82983893, 83507293, 83779371, 83914077, 83969921, 83983743, 83970696, 83912641, 83785802, 83590913, 83365279, 83189958, 83162028, 83346272, 83736002, 84246910, 84767175, 85195261, 85463750, 85566390, 85566658, 85581988, 85730165, 86059952, 86527395, 87018126, 87370360, 87449110, 87234145, 86810547, 86292166, 85755897, 85223621, 84679258, 84091657, 83438498, 82743436, 82058918, 81383765, 80662733, 79854280, 78919929, 77784890, 76343799]
1248.2G6343799j844299k217537k256793j634407l56531J116478K196056K635008K569711
1266.6G6551485K146560J403612M58562l19045n16594q3393O54441J400000J994443
1285H3690071K256954K048760J430411O10220k40135r66168j317036j047986k15817
1303.3H6249274P57515J444400J720619J731837J656389J510876J312727J081962P61890
1321.7I8227489L87484M7743k25818m40335n84287o87438p96175q93611r04351q66378
1342.1I3264323r19842j021934j093083j170612j286584j412857j492792j515376j477534
1360.4H1873709j241702p57468l03721N9438L29393N20784P59285Q11774O52915M51988
1380.8H3156395J59669j87057m24534n47034o97553q28684p89159n81437l36355j67960
$$ y = [76343799, 74499500, 72281963, 70025170, 68390763, 68034232, 69150710, 71346766, 73981774, 76551485, 78698045, 80101657, 80560219, 80241174, 79724580, 79641187, 80295628, 81695628, 83690071, 85947025, 87995785, 89426196, 90036416, 89796281, 88830113, 87513077, 86465091, 86249274, 87006789, 88451189, 90171808, 91903645, 93560034, 95070910, 96383637, 97465599, 98227489, 98614973, 98662716, 98436898, 97996563, 97412276, 96724838, 95928663, 95035052, 94130701, 93264323, 92344481, 91322547, 90229464, 89058852, 87772268, 86359411, 84866619, 83351243, 81873709, 80632007, 79874539, 79570818, 79630256, 79959649, 80480433, 81239718, 82051492, 82704407, 83156395, 83316064, 83129007, 82704473, 82157439, 81459886, 80631202, 79842043, 79260606, 78924251, 78756291]
1401.2G8756291o1322J75345L97969M99725O33270O90746N72502N77564P58945M11362
1421.6H3412397k25484p77078j339305j817447j899212j519263o33556N33510Q15612
1440G6550174N65368K35921j24031m10706p98536j351916j776135j651776k54113J182318
1460.4G2166568J987922K850276K403164M62538j122915j882303j386261l34907L42274
1478.7G5486356N44590j12957j674801l140879k901578j89495K640200M885346O875270
1497.1H2412052O165695L719426J928114J183546J548982J551443J074421Q25018O71876
1515.4A01080573O66189O18720O56152O74533N09990M72748L32999J18602J31869J37746
1535.8A05400121j51205k81525J11473L31569K62523M5347j34051k02465l04520n11313
$$ y = [78756291, 78694969, 78870314, 79268283, 79768008, 80401278, 81092024, 81664526, 82242090, 83001035, 83412397, 83186913, 82409835, 81070530, 79253083, 77353871, 75834608, 75201052, 75734562, 76550174, 77115542, 77351463, 77227432, 76816726, 76018190, 74666274, 72890139, 71238363, 70984250, 72166568, 74154490, 77004766, 79407930, 79870468, 78747553, 76865250, 75478989, 75144082, 75486356, 76030946, 75917989, 74243188, 71102309, 68200731, 68011236, 70651436, 75536782, 82412052, 88577747, 92297173, 94225287, 95408833, 96957815, 98509258, 99583679, 100408697, 101080573, 101746762, 102365482, 103021634, 103696167, 104206157, 104678905, 105011904, 105130506, 105262375, 105400121, 105248916, 104967391, 105078864, 105410433, 105672956, 105718303, 105584252, 105381787, 105077267, 104565954]
1556.2A04565954o67918l34155m41778j453137k803254l969378l482747q89432P74085
1574.6I1298240M51196j285196k520764l107416l319973l316796l027451k345466j124859
1593G1701515Q28469K987563M209405M008049K671635J046920J07426K39950R75871
1611.3H8776803J524907K131421K919137K427119J718557J658362J362145R13537O71172
1629.7A04103160L54051L0911R5857M20487L69858J44828q4019j65665Q6486J09637
1650.1A05465591r4533K46215N14471K62320L6991O390J09207J8752j35231j1075J30964
1672.5A06550062J06311J31440N8531j43957k69138K6869L40164K24161J18864j9622
1692.9A07123685k00355j95551l4130J82998K15555J23083J74702J68013J7595j59347
$$ y = [104565954, 103898036, 103563881, 103122103, 101668966, 98865712, 94896334, 91413587, 90524155, 91298240, 91749436, 90464240, 87943476, 84836060, 81516087, 78199291, 75171840, 72826374, 71701515, 72529984, 75517547, 79726952, 83735001, 86406636, 87453556, 87560982, 87800932, 88776803, 90301710, 92433131, 95352268, 97779387, 99497944, 101156306, 102518451, 103431988, 104103160, 104457211, 104488122, 104583979, 105004466, 105374324, 105519152, 105435133, 105269468, 105355954, 105465591, 105371058, 105617273, 106131744, 106394064, 106431055, 106437445, 106546652, 106565404, 106430173, 106419098, 106550062, 106656373, 106787813, 106846344, 106702387, 106433249, 106460118, 106800282, 107024443, 107143307, 107123685, 106923330, 106727779, 106693649, 106876647, 107092202, 107215285, 107389987, 107558000, 107575595, 107416248]
1713.3A07416248k57873m0996L27933K94482J29915N5551l3653j40953j96278q9180
1733.7A07465196J77979J43564J0562J8692K6405m3476j07169j4055J86753J62745
1754.1A08027196J2422l4380m6611k0588L3057n7721j83332k10822r0336J04534J10757
1776.5A07644176J669l8158J645L3116L3832o1477j62387l3807J38902R3627o425O640
1801A07651353J04248R5439p558n8233j0419M8137L8731K4962L0351j7381q0764n6911
1825.5A07761955k1839N865J12355J23787L4189k146k9206j19793j37723Q393R1564
1847.9A07827401O6579K4473j2922k7764j9801k527m899n6291j36399j01614P8308
1870.3A07634544J35422N0879j4139k9742k8718l7658n9903r1064j00362m1139n066
$$ y = [107416248, 107158375, 107117379, 107445312, 107739794, 107869709, 107925260, 107891607, 107750654, 107554376, 107465196, 107643175, 107786739, 107797301, 107815993, 107842398, 107798922, 107691753, 107677698, 107864451, 108027196, 108039618, 108005238, 107958627, 107938039, 107971096, 107913375, 107730043, 107519221, 107428885, 107533419, 107644176, 107645845, 107607687, 107609332, 107642448, 107676280, 107614803, 107452416, 107418609, 107557511, 107651138, 107644713, 107651353, 107755601, 107851040, 107843482, 107785249, 107774830, 107822967, 107861698, 107886660, 107917011, 107899630, 107818866, 107761955, 107740116, 107745981, 107858336, 107982123, 108016312, 108014166, 107984960, 107865167, 107727444, 107735837, 107827401, 107893980, 107918453, 107905531, 107877767, 107857966, 107855439, 107850540, 107794249, 107657850, 107556236, 107634544, 107769966, 107820845, 107806706, 107776964, 107748246, 107710588, 107650685, 107559621, 107459259, 107418120, 107413054]
1892.8A07413054k0016O32J8394O092L206O617k444P081M7207M8530j1254l6335P677
1919.3A07488441J7000K6142O0320L6085K730J0025K1076J8025O068k7383m1330K0993
1943.8A07638192P4351O2144L8659K0039N711J4019K5415J9205J0180q714j5736K5666
1968.3A07909131N3012L2449J3769O938L671K397m530r954j0181k1744l3307q82M1866
1994.8A07982635L5275J7619K2983K5475J3840J0050K0897K2495L159j5652j836K6381
2019.2A08163321K6488J1552J728K86N401N710K145j692j1218j8835q285P605O462
2045.8A08190668k218K4O449J669o282q702r370j1826j0490N805J5629O449l755j4639
2074.3A08159411j4937M05J026j3376j8847j5175r632q428j1909j2172r334p033q082
$$ y = [107413054, 107393038, 107393670, 107412064, 107418156, 107421362, 107427979, 107425535, 107432616, 107479823, 107528353, 107517099, 107480764, 107488441, 107505441, 107531583, 107591903, 107627988, 107630718, 107640743, 107661819, 107679844, 107685912, 107658529, 107617199, 107638192, 107712543, 107774687, 107813346, 107833385, 107839096, 107853115, 107878530, 107897735, 107907915, 107899201, 107883465, 107909131, 107962143, 107994592, 108008361, 108015299, 108018970, 108021367, 108016837, 108006883, 107996702, 107974958, 107941651, 107940769, 107982635, 108017910, 108035529, 108058512, 108083987, 108097827, 108107877, 108128774, 108151269, 108154428, 108138776, 108136940, 108163321, 108189809, 108201361, 108203089, 108203375, 108208776, 108214486, 108216631, 108214939, 108203721, 108184886, 108176601, 108184206, 108190668, 108188450, 108188474, 108194923, 108196592, 108190310, 108181608, 108172238, 108160412, 108149922, 108155727, 108171356, 108177805, 108174050, 108159411, 108144474, 108144879, 108145905, 108132529, 108113682, 108098507, 108088875, 108080447, 108068538, 108056366, 108047032, 108039999, 108031917]
2100.8A08031917j0741j1623r322l588j800r490j9395j7011q333o819m303K170M577
2127.3A07936239k002j4687k0206q929P415N972m434j0407j9181j8167p976j609M947
2153.9A07846975N25p129K86N567l349j4771j2922j657j275q655o473p75n221j7846
2182.4A07773280k3508j6200j3721j7798j5641j2564r787n889j0658k1398k1326r311
2206.9A07595479M42L57l886n770j0621j4437j1193r537j3435j9157k3794k5868k9541
2233.4A07429039m1365m6849l7694l0685l4416m3511n0878n7531o2442o3240o3777
2255.8A06896651p1728r4879j19758j21188j04690q9776o4933k6894L58J8155M1080
2278.3A06262398N7065N4860N1308N2393L9899J4984j1515m2045p7808j15061j45602
$$ y = [108031917, 108021176, 108009553, 108000231, 107996643, 107994843, 107985353, 107965958, 107948947, 107940614, 107933795, 107929492, 107931662, 107936239, 107934237, 107919550, 107899344, 107890415, 107897830, 107903802, 107899368, 107888961, 107869780, 107851613, 107843637, 107842028, 107846975, 107847500, 107840371, 107840657, 107846224, 107842875, 107828104, 107815182, 107813525, 107812250, 107803595, 107797122, 107796347, 107791126, 107773280, 107749772, 107733572, 107719851, 107702053, 107686412, 107673848, 107664061, 107658172, 107647514, 107626116, 107604790, 107595479, 107595921, 107596278, 107592392, 107586622, 107576001, 107561564, 107550371, 107540834, 107527399, 107508242, 107484448, 107458580, 107429039, 107387674, 107340825, 107303131, 107272446, 107238030, 107194519, 107143641, 107086110, 107023668, 106960428, 106896651, 106824923, 106730044, 106610286, 106489098, 106384408, 106294632, 106229699, 106202805, 106203163, 106221318, 106262398, 106319463, 106374323, 106425631, 106478024, 106517923, 106532907, 106521392, 106479347, 106401539, 106286478, 106140876]
2300.7A06140876j60623j57869j44374j29712j06620o7592j2755O5612J50240J86741
2321.1A05763924J72031J65606J84190K04384J70744Q1169N1594O8164L5715k8098
2341.5A06869423j39939l40856m02379j80494J22857K85959K59161J53947L576j30260
2361.9A06500995j76489k11644k76983l09205l08907k79522k24328j93870j76120j19591
2382.3A04224336m6110J1754N2559P2647P6425P3528P8511Q8561Q8441Q0347O9380
2404.7A04870379O3074N7947M8042M2736L7849K5821J6165O771n019p653q273j4246
2429.2A05133593j3578o652o115j2291j8787k1362j5450q261r489j1265j4425k2030
2453.7A04973888j8048j0955j5056k5046l5358l8492m0901m8542n1057m5372m4393
$$ y = [106140876, 105980253, 105822384, 105678010, 105548298, 105441678, 105374086, 105361331, 105426943, 105577183, 105763924, 105935955, 106101561, 106285751, 106490135, 106660879, 106742048, 106793642, 106861806, 106897521, 106869423, 106729484, 106388628, 105986249, 105805755, 105928612, 106214571, 106473732, 106627679, 106631255, 106500995, 106324506, 106112862, 105835879, 105526674, 105217767, 104938245, 104713917, 104520047, 104343927, 104224336, 104178226, 104189980, 104242539, 104315186, 104391611, 104465139, 104543650, 104632211, 104720652, 104800999, 104870379, 104933453, 104991400, 105039442, 105082178, 105120027, 105145848, 105162013, 105168784, 105163765, 105156112, 105147839, 105133593, 105120015, 105113363, 105107248, 105094957, 105076170, 105054808, 105039358, 105031097, 105021608, 105010343, 104995918, 104973888, 104955840, 104944885, 104929829, 104904783, 104869425, 104830933, 104790032, 104741490, 104690433, 104645061, 104600668]
2476.1A04600668m9281m6468m6599n3263m6360l4535l5977m3059m5430m3142l9196
2498.5A04117358l7957m1437m5323m4715l7551k7550k2900k8836m0365m3916l6765
2521A03710043k9933l2294m0364m3082m4632n5158o4707o7663p2313p9846q1933p2741
2545.5A03025377o7544p0203p1489p7570q0907p1764o2597o4456o8200o3026o2323
2567.9A02265298p5066q2719q3077q4329q3303q7011q6117p2109o3754o3645o2991
2590.3A01421177n4025l8517k9623k6965l1925l9994l4941k2304j8084k6357l7646
2612.8A01060796l4189j7870j0896j4388j8800j9526j1146o938j3876j7524j2636m339
2637.2A00878668Q595K3079K6881L0268M4429N3728N4323N7853O2716O4802O2561N1903
$$ y = [104600668, 104551387, 104504919, 104458320, 104405057, 104358697, 104324162, 104288185, 104245126, 104199696, 104156554, 104117358, 104079401, 104037964, 103992641, 103947926, 103910375, 103882825, 103859925, 103831089, 103790724, 103746808, 103710043, 103680110, 103647816, 103607452, 103564370, 103519738, 103464580, 103399873, 103332210, 103259897, 103180051, 103098118, 103025377, 102957833, 102887630, 102816141, 102738571, 102657664, 102585900, 102523303, 102458847, 102390647, 102327621, 102265298, 102190232, 102107513, 102024436, 101940107, 101856804, 101769793, 101683676, 101611567, 101547813, 101484168, 101421177, 101367152, 101328635, 101299012, 101272047, 101240122, 101200128, 101165187, 101142883, 101124799, 101098442, 101060796, 101026607, 101008737, 100997841, 100983453, 100964653, 100945127, 100933981, 100927043, 100913167, 100895643, 100883007, 100878668, 100887263, 100910342, 100937223, 100967491, 101011920, 101065648, 101119971, 101177824, 101240540, 101305342, 101367903, 101419806]
2661.7A01419806L4237J8108P355j0442l6156n7888p8416j01066j16694j16289j09827
2684.1A00852728j17016j29402j25587j14369j07634j04559r6786q6116q8466r3627
2704.5I9789166r2542q5145p5155p9167q9813q5854o6674m1699k4844j7946J4412N4908
2729I9199647M5341P969j5229q690J9789L5929M2230N4252O7133Q1474Q7463O9255
2753.5I9686563L3081n192m0102o0630n9849o2311q2671j00357j09392j09160p9042
2775.9I9010938n3233p4481j04559j18798j46174j64730j27786q9675j11240j48648
2796.3I7871614j46497j18834j17105j44708j75422k01017j84339j33169j17016j31065
2816.7I6402442j39755j39874j39415j46288j55079j72055k00659k20615k30890k39682
$$ y = [101419806, 101454043, 101472151, 101479506, 101469064, 101432908, 101375020, 101296604, 101195538, 101078844, 100962555, 100852728, 100735712, 100606310, 100480723, 100366354, 100258720, 100154161, 100057375, 99971259, 99882793, 99789166, 99696624, 99611479, 99536324, 99457157, 99367344, 99281490, 99214816, 99173117, 99148273, 99130327, 99144739, 99199647, 99244988, 99252957, 99237728, 99229038, 99248827, 99284756, 99326986, 99381238, 99448371, 99529845, 99617308, 99686563, 99719644, 99714452, 99674350, 99613720, 99553871, 99491560, 99408889, 99308532, 99199140, 99089980, 99010938, 98957705, 98883224, 98778665, 98659867, 98513693, 98348963, 98221177, 98131502, 98020262, 97871614, 97725117, 97606283, 97489178, 97344470, 97169048, 96968031, 96783692, 96650523, 96533507, 96402442, 96262687, 96122813, 95983398, 95837110, 95682031, 95509976, 95309317, 95088702, 94857812, 94618130]
2837.1I4618130k09385j50633j44577j82689j91575j51300q8245k6965L3653R3776
2857.5I3600190J48648J97196K05415J67102J32704Q3655p2j6129N0140O1577J997
2879.9I4632423l8290l2681r972L415J7965K3133J1456K6655O7109O6131K1511P33
2904.4I4789588M316k4212q8059j24151q3572k306N0676N6570K0033k7412o6858q8096
2928.9I4416517m5776L165r823k7895k1142l6603n2619K104J12259J86521J81747J90931
2953.4I4899386K33674K26248J88499J69277J75405J76626J55348J21707N3024m256
2973.8I6394938l505l5178r1738o8396l4797q5920j69212k35462k58750k37655k62756
2996.2I4911569l39985m23413n29033o06877o08813n56702m61930l04091r9712P5680
$$ y = [94618130, 94408745, 94258112, 94113535, 93930846, 93739271, 93587971, 93499726, 93472761, 93506414, 93600190, 93748838, 93946034, 94151449, 94318551, 94451255, 94534910, 94534838, 94518709, 94568849, 94630426, 94632423, 94594133, 94561452, 94551480, 94554895, 94572860, 94595993, 94607449, 94634104, 94701213, 94767344, 94788855, 94789588, 94793904, 94769692, 94681633, 94557482, 94473910, 94471604, 94522280, 94578850, 94598883, 94571471, 94504613, 94416517, 94370741, 94373906, 94364083, 94336188, 94315046, 94278443, 94225824, 94227928, 94340187, 94526708, 94708455, 94899386, 95133060, 95359308, 95547807, 95717084, 95892489, 96069115, 96224463, 96346170, 96399194, 96394938, 96391433, 96356255, 96264517, 96196121, 96161324, 96075404, 95906192, 95670730, 95411980, 95174325, 94911569, 94571584, 94148171, 93619138, 93012261, 92403448, 91846746, 91384816, 91080725, 90981013, 91056693]
3016.6I1056693J79964K26718K24149J88256J32882K7681j18781k66844l80766m40240
3037I0829712m59415m11772k97809j85656j07778n6761j7202J4967K8676J9967n299
3059.4H9351630l2109m1884k1708L5006J14918J85942K22540K24841K03651J83648
3079.8I0426475J95724K19011K21908K17694K23839K24638K12491K02620J75655J41686
3100.2I2461741J35511J23847R3937Q4972R8902R7024P1001N0569M5157N4228O7800
3122.6I3384689N6172K1767p09J0490L3432J7953k4813k0701M1652Q3280O6113L1757
3147.1I3701082q606l3457J0461O9064P2759N0211L8559M8410O2639N7006L9625L4541
3171.6I4142294M5031M4704L6788M5913N7680O0176N9039N3912N6827O0380N1260M7999
$$ y = [91056693, 91236657, 91463375, 91687524, 91875780, 92008662, 92036343, 91917562, 91650718, 91269952, 90829712, 90370297, 89958525, 89660716, 89475060, 89367282, 89310521, 89293319, 89308286, 89336962, 89356929, 89351630, 89319521, 89277637, 89255929, 89290935, 89405853, 89591795, 89814335, 90039176, 90242827, 90426475, 90622199, 90841210, 91063118, 91280812, 91504651, 91729289, 91941780, 92144400, 92320055, 92461741, 92597252, 92721099, 92815036, 92900008, 92998910, 93095934, 93166935, 93217504, 93262661, 93316889, 93384689, 93440861, 93462628, 93461919, 93472409, 93505841, 93523794, 93498981, 93478280, 93519932, 93603212, 93669325, 93701082, 93692476, 93659019, 93669480, 93738544, 93811303, 93861514, 93900073, 93948483, 94011122, 94068128, 94107753, 94142294, 94187325, 94232029, 94268817, 94314730, 94372410, 94432586, 94491625, 94545537, 94602364, 94662744, 94714004, 94762003]
3196.1I4762003M8995L9393K9391L5203N0723O3658P2956O5214N1903N4008O0958P6681
3220.5I5411086R1910Q9151Q0568P1621N6231N4896J02788J50805J40548J12081R1666
3243I6453351P2646Q4543J24222J23674Q3154P3999R5654R6446P4262N5372M1008J7459
3267.5I7395790j3930j3745J2547K0647R912k1791n1087m3005l0810m0340n1218m6248
3291.9I7126722j4633K3508L7569K7037Q082o02J3697O1000J11008J30373J31619J32388
3316.4I7787768J36119J36685J37675J47825J72466K04438K12306J91128J73551J65630
3336.8I9465591J74778K01512K09474J95969J61850J16801J14084J53195J69337J41692
3357.2A01104283J09852J03175J06204Q0633N1141P1597J10888J16325J04332R6357
$$ y = [94762003, 94810998, 94850391, 94879782, 94914985, 94965708, 95029366, 95102322, 95167536, 95219439, 95273447, 95334405, 95411086, 95502996, 95592147, 95672715, 95744336, 95800567, 95855463, 95958251, 96109056, 96249604, 96361685, 96453351, 96525997, 96610540, 96734762, 96858436, 96941590, 97015589, 97111243, 97207689, 97281951, 97337323, 97378331, 97395790, 97381860, 97368115, 97380662, 97401309, 97411221, 97389430, 97338343, 97295338, 97264528, 97224188, 97172970, 97126722, 97112089, 97135597, 97173166, 97200203, 97208285, 97207683, 97221380, 97282380, 97393388, 97523761, 97655380, 97787768, 97923887, 98060572, 98198247, 98346072, 98518538, 98722976, 98935282, 99126410, 99299961, 99465591, 99640369, 99841881, 100051355, 100247324, 100409174, 100525975, 100640059, 100793254, 100962591, 101104283, 101214135, 101317310, 101423514, 101504147, 101555288, 101626885, 101737773, 101854098, 101958430, 102054787]
3377.6A02054787P7283O1560O2668N7375L3069m947o306N0473Q6021N5147J4424M4060
3402.1A02585614J06668R2995N0593N7614O1440N1570M6527K7049L1519P2920P7117
3424.5A03261626L0207O950K9087M4620L7527M6623Q5354R9552N7852J3113K5225P4315
3449A03812051R2721P4434N5850M4179K7704K6858M5407L9947K9742O1357R4307Q2862
3473.4A04487419O1059M4096K4163M5729P9882O6281O7544R6917Q1825M4060L4201
3495.9A05133176M1556K6083J2982P7307J28877R7883P9751P2539O2490Q1539P4458
3518.3A05888641K0480m268N0271J10531J26934J38938J12605M5729L7110Q1718M3976
3540.8A06652665o0904n7566J01519K03716J36793Q8775J08361Q2016L4547L553n4455
$$ y = [102054787, 102132070, 102193630, 102256298, 102313673, 102346742, 102341795, 102335489, 102385962, 102471983, 102527130, 102541554, 102585614, 102692282, 102785277, 102835870, 102893484, 102954924, 103006494, 103053021, 103080070, 103111589, 103184509, 103261626, 103291833, 103298783, 103327870, 103372490, 103410017, 103456640, 103541994, 103641546, 103699398, 103712511, 103737736, 103812051, 103904772, 103979206, 104035056, 104079235, 104106939, 104133797, 104179204, 104219151, 104248893, 104310250, 104404557, 104487419, 104548478, 104592574, 104616737, 104662466, 104742348, 104808629, 104876173, 104973090, 105054915, 105098975, 105133176, 105174732, 105200815, 105213797, 105291104, 105419981, 105517864, 105597615, 105670154, 105732644, 105814183, 105888641, 105909121, 105904853, 105955124, 106065655, 106192589, 106331527, 106444132, 106489861, 106526971, 106608689, 106652665, 106591761, 106534195, 106635714, 106839430, 106976223, 107064998, 107173359, 107255375, 107289922, 107293475, 107239020]
3563.2A07239020j05631K6202K50649K55466J27983M8947M2307M5872J7095o9094j32727
3585.6A07746089K7620K32709J45805K1803M6074P0262O1202Q9169N1701n4777o8175
3608.1A08369482o354J3709L2758L3093K8431J36316J90807O8163q9216q1813J51098
3630.5A08846474K13945J37829J00351O5648K7502k3067j42872k77448j69754K46119
3650.9A09024727L92533K28035J12724J40048J72579J51300O0821o8665j16038K26
3671.3A10098290L0637L2628K36988L18432K27499J03271n2250k12729j18994K11787
3691.7A10875559K68245J40786N8949n412k4832N0736M1580j11318k12359n5134J68669
3714.1A11195469J59454L1030n3656m8601N758P1859Q0860n5886k66039k78652j705
$$ y = [107239020, 107133389, 107159591, 107410240, 107665706, 107793689, 107842636, 107884943, 107930815, 107947910, 107878816, 107746089, 107773709, 108006418, 108152223, 108174026, 108220100, 108290362, 108351564, 108440733, 108492434, 108437657, 108369482, 108363128, 108376837, 108409595, 108442688, 108471119, 108607435, 108798242, 108866405, 108777189, 108695376, 108846474, 109060419, 109198248, 109298599, 109364247, 109391749, 109368682, 109225810, 108948362, 108778608, 109024727, 109417260, 109645295, 109758019, 109898067, 110070646, 110221946, 110282767, 110214102, 110098064, 110098290, 110128927, 110161555, 110398543, 110716975, 110944474, 111047745, 110995495, 110782766, 110663772, 110875559, 111143804, 111284590, 111343539, 111338127, 111313295, 111364031, 111405611, 111294293, 111081934, 111026800, 111195469, 111354923, 111385953, 111332297, 111283696, 111289454, 111361313, 111442173, 111386287, 111120248, 110841596, 110839891]
3736.5A10839891J81795J14023o8533j60623k6083j478j4007J70624K06435N8651M029
3759A11304724Q5330P0203l5632n8401n912P9381J15693L2281p9631p8428L4416O3026
3783.5A11527050L7825M9257L4463L34n9044j32740j33347j17898n6696R5367J05560
3805.9A11350131Q0323J02401L1042j01197j58810j15013j06037K2113J62816J02020
3826.3A11369789L5298j0753o6281j01733j44052r3580P3183J56343J55377J06776
3846.7A11480367k2363k05422k72798L9780K47061J36876j6785r0837m0448l695l9423
3869.1A11212313O736P9178Q5354K8324q8370p2634P105J2887P1394L7777l7086L8994
3893.6A11381972O0105p3302j76119j28651K0242J81138K10273J14406L3223k8610
$$ y = [110839891, 111021686, 111135709, 111067176, 110906553, 110880470, 110878992, 110864985, 111035609, 111242044, 111300695, 111304724, 111390054, 111460257, 111424625, 111366224, 111360312, 111439693, 111555386, 111587667, 111508036, 111429608, 111464024, 111527050, 111564875, 111614132, 111648595, 111648929, 111589885, 111457145, 111323798, 111205900, 111149204, 111244571, 111350131, 111430454, 111532855, 111563897, 111462700, 111303890, 111188877, 111082840, 111104953, 111267769, 111369789, 111405087, 111394334, 111328053, 111226320, 111082268, 110988688, 111061871, 111218214, 111373591, 111480367, 111458004, 111252582, 110979784, 111019564, 111266625, 111403501, 111386716, 111295879, 111255431, 111251736, 111212313, 111219049, 111298227, 111383581, 111411905, 111323535, 111250901, 111258006, 111270893, 111342287, 111380064, 111342978, 111381972, 111442077, 111368775, 111192656, 111064005, 111084247, 111265385, 111475658, 111590064, 111623287, 111594677]
3914A11594677r9421p1287L4130M5252j622K0791L4296k9659k8992O8712R3770K2138
3938.5A11682785m2773l8337J8596K9779R894L6836O1798L5035l230l231J4735K1469
3962.9A11823356J7631O664J19j3864m0197l0244J6308L5358J7905j43J2207K5928
3987.4A11871028K778k3580k5499n877K1219
3997.6A11840069
$$ y = [111594677, 111495256, 111423969, 111458099, 111503351, 111501729, 111522520, 111556816, 111527157, 111498165, 111566877, 111660647, 111682785, 111640012, 111601675, 111620271, 111650050, 111659944, 111696780, 111758578, 111793613, 111790383, 111787152, 111801887, 111823356, 111840987, 111847651, 111847770, 111833906, 111793709, 111763465, 111779773, 111815131, 111833036, 111832893, 111845100, 111871028, 111873806, 111850226, 111824727, 111818850, 111840069]
##END=$$ End of the data block
