##TITLE=LHMEO - AI - Pastilha com KBr $$ Begin of the data block
##JCAMP-DX=5.00 $$ ACD/SpecManager v 10.08
##SPECTROMETER/DATA SYSTEM=Alpha
##DATE=09 Oct 2013 13:38:30
##DATA TYPE=INFRARED SPECTRUM
##DATA CLASS=XYDATA
##ORIGIN=
##OWNER=
##NPOINTS=1765
##FIRSTX=399.75695801
##LASTX=3997.56933594
##MAXX=3997.56933594
##MINX=399.75695801
##MAXY=0.83531713
##MINY=0.28469506
##XFACTOR=1.0000000000
##YFACTOR=1.000000000000000e-9
##FIRSTY=0.82622725
##DELTAX=2.03957629
##XUNITS=1/CM
##YUNITS=ARBITRARY UNITS
##XYDATA=(X++(Y..Y))
399.8 826227248 825373590 823967099 825299740 827843130 828854144 829745293 832564175 835317135 834720671
418.1 834720671 831429064 830222011 830770373 829511702 827313483 827380419 828982234 829410136 829195082
436.5 829195082 830513358 832463145 832573235 830917060 830045223 830535710 830320597 829109609 828966141
454.8 828966141 830128968 830055356 827903569 825852156 824648976 822755098 819948912 817954004 817168236
473.2 817168236 816110730 813963950 811569810 809547961 806968272 803484976 800401330 798354745
489.5 798354745 796899438 794613302 791843235 793774366 801011443 805588603 803757310 799308598
505.8 799308598 794986904 790870368 787262201 785074413 783894837 781805575 777672291 772330225
522.1 772330225 766238332 757847011 745983183 730539382 711816847 697171271 697478354 706174970
538.4 706174970 706612706 699498892 692657530 683912396 675886810 683828592 713680089 750454605
554.8 750454605 778774440 796832025 807375252 812255025 814747334 817632616 819824278 819582045
571.1 819582045 818782926 819937170 821709156 821314156 819731057 820038795 821738720 821682990 820031703
589.4 820031703 819859147 821402133 821474791 819435894 818630338 820395231 821528494 819975019 818586588
607.8 818586588 819750905 820795178 818776131 816162527 816936195 818991840 817637742 814857066 816194713
626.1 816194713 820507288 821830153 819440186 817437232 815550327 810500145 806292832 809630692
642.5 809630692 817030191 820186794 818316162 817469060 820129991 821241200 817530036 812715232 810429871
660.8 810429871 808256805 803974867 799378335 797893524 797696888 793934584 786360919 776965976 763152421
679.2 763152421 736679733 688064933 620865285 570653021 570403039 606178105 647999108 682949781
695.5 682949781 708420575 725729465 740559340 757574499 773747087 783632398 787745595 788759112
711.8 788759112 781733871 759442508 734595597 736253977 765577972 791671455 801265419 804217696
728.1 804217696 806291580 804671049 799298763 795110166 793452144 789203107 778191030 760233164
744.4 760233164 734958351 705205142 677943170 654172778 637409508 635448217 643261909 657625973
760.8 657625973 685691833 724214375 758279979 779582322 792666674 801986396 805516481 803016603
777.1 803016603 798993766 795466244 788947403 777364373 763664126 750277936 735441804 717974603
793.4 717974603 700695753 686677337 675485313 665852010 659144640 656837523 656915247 656042695
809.7 656042695 653772235 651305974 647901893 641258061 630945146 618217826 602383316 580695212
826 580695212 548977911 501305640 444004446 413420558 445954144 528806090 616874218 680792749
842.3 680792749 717695415 738715768 754408777 767617106 777967513 786214054 793661296 800313234
858.7 800313234 804330826 805226564 805561125 806715012 806493104 803000271 797562599 791690588 784778655
877 784778655 777305126 773399472 777701616 789479375 802582622 812579453 819777966 824752390
893.3 824752390 826673090 826553226 826995313 828225017 828067064 825999260 823767960 821546316 817270339
911.7 817270339 811718524 809148371 810928583 813847363 814955533 814818323 815073848 815219820 814152658
930 814152658 812654316 811862350 810502410 805557489 797717392 794640064 800265014 806903720 807698607
948.4 807698607 803186536 793604016 779950857 770013154 772678435 784221232 790641129 785685360
964.7 785685360 773368180 761510968 756279290 756184161 760570943 770741642 780436873 783616900
981 783616900 781792641 779366016 778391063 777162969 774694264 771457255 765510440 754466832 741456985
999.4 741456985 731591702 722153842 708092034 690888345 673421443 655019283 633713245 609225273
1015.7 609225273 582588732 554693639 525992393 495806634 464549780 438616306 426730186
1030 426730186 431774080 452338845 485858440 526332140 566484690 602445185 633014381 657275677
1046.3 657275677 674611092 685782313 692759097 697061718 698984325 698803544 697454572 695310950
1062.6 695310950 691394091 684336364 673907816 663264394 659570217 665814042 674901247 678828597
1078.9 678828597 676743150 672242820 668877363 666889489 663745463 658214211 651719987 646532416
1095.2 646532416 643411756 641108692 637272477 629284561 615494728 599546731 591460228 600598633
1111.6 600598633 628418028 663094401 689159632 704098105 713486671 720177889 724561870 727309704
1127.9 727309704 729596555 731717467 732865632 732529104 731077790 728640676 724754989 719379425
1144.2 719379425 712914407 705148518 695605874 684884131 674315751 663470745 649134457 632788777
1160.5 632788777 623500705 622321844 619076610 609612703 597920060 585215509 568627536 549777806
1176.8 549777806 538437605 541412294 552520454 559066772 553310037 538176298 529110253 543744147
1193.1 543744147 579836071 616107583 638820589 649823189 654669285 656899333 658064365 658174634
1209.5 658174634 656904638 654454112 650957763 645918846 638836265 629904330 619182944 605758607
1225.8 605758607 588730335 568124056 544166446 516271055 483319789 444646001 401244253
1240.1 401244253 356769532 317642689 291569948 284695059 298164099 326853901 362146437
1254.3 362146437 395766079 423703790 448209018 474484682 506232440 543937802 583418190
1268.6 583418190 617260218 640885949 655192077 662378728 661868632 651214957 629446507 600365818
1284.9 600365818 576722801 572480857 582177341 586232007 579657614 576817632 590404689 616426289
1301.2 616426289 642919719 664342046 679106236 683791518 680002272 680626512 696331263 720652461
1317.6 720652461 740863323 752416074 757294476 758941114 760296464 762268484 764091671 765296400
1333.9 765296400 766118109 766435444 765839517 764563918 763263881 761956215 760183036 757907212 755529583
1352.2 755529583 752672493 747872174 740239739 730514169 720412016 711641490 705577672 704202712
1368.5 704202712 708389640 715337396 721540093 725764036 728760004 731062829 732736230 734392822
1384.9 734392822 736493647 738525212 740005910 741205275 742434978 743613243 743970513 743087828 741934955
1403.2 741934955 741035283 739437819 736490846 733175874 730921626 729972422 729361176 728738129 729258835
1421.6 729258835 730622530 730809152 728893101 725085258 719259501 709997535 691440284 661388695
1437.9 661388695 635037422 624612749 623181403 616426289 607425511 608807981 621827722 638482273
1454.2 638482273 650817215 652712703 645455539 635915339 629187763 628257990 633885264 647976100
1470.5 647976100 668014944 680728793 681348026 676190555 668826103 659525871 648666203 637747407
1486.8 637747407 627589166 616646528 603469849 584548175 552157164 502779484 441701084
1501.1 441701084 380116850 328843027 305106074 312018216 328458667 352052063 393171132
1515.4 393171132 454189330 522088587 588369668 640662253 676050246 702085972 719550788
1529.7 719550788 730584979 737759352 741865098 744390190 745882094 745726526 745333135 745456100 745914102
1548 745914102 746316075 746759832 747374177 747854948 746522725 741900802 736879528 731276453 723885775
1566.4 723885775 713591993 696480572 669848144 631046653 597862303 611901939 658002973
1580.7 658002973 694772601 707451940 705716968 698389828 688963234 680211067 672131538 661352694
1597 661352694 647460639 636137545 633585811 639100790 646458089 649215341 642769575 626089573
1613.3 626089573 600235224 567737520 532744944 499255717 487792283 517617404 571313262
1627.6 571313262 620964229 653181136 673159063 687191784 695190370 699547827 703158319 705983400
1643.9 705983400 707111478 706575990 706132531 706613839 707238793 707944751 709498644 711780548 713863015
1662.2 713863015 714963913 715510249 715934873 715934873 715952098 716893017 718555510 720340371 722344756 724914372
1682.6 724914372 727667928 729213595 729597867 729436696 729151309 728342652 726502955 723964691 720792353
1701 720792353 717985392 715374768 712197840 709040999 705953598 702127814 696538389 687991917 677745640
1719.3 677745640 667693317 657078326 646522701 637898147 631632924 627580285 625182211 624548614
1735.7 624548614 625532210 627328217 629661381 633268476 639124930 647688150 659604609 674619913
1752 674619913 690687895 707286298 723290265 737028122 749040961 758317947 764605045 769350350
1768.3 769350350 773720205 777884424 780656993 782089889 783429921 784958720 785900772 786040664 786163986
1786.7 786163986 786873400 787534058 787316084 786794841 786879659 787142575 786749005 785932064 785471797 785237491
1807 785237491 784398258 783031046 782263339 782535553 782954097 782922745 783012748 783551514 783775628 783303797
1827.4 783303797 783028424 783601642 784378409 784498692 784291208 784646869 785367072 785346270 784534395 784119606
1847.8 784119606 784192085 783907473 783052802 782393813 782260656 781907678 780865550 779903531 779664576 779434383
1868.2 779434383 778375566 777099192 776394606 775802016 774404347 772273004 770383716 769123435 767966747
1886.6 767966747 766447604 764554262 761988401 758502841 756208062 758116901 763504565 768682003
1902.9 768682003 771523714 772643089 773278654 773503542 772939503 772246540 772364736 772980213 772969067
1921.3 772969067 772164702 771520615 771552980 771614909 771153390 770488739 770027936 769644678 769261777 769229650
1941.7 769229650 769698381 769968212 769192040 767619371 766215503 765425444 765117168 765284240 766086936
1960 766086936 767223477 767856121 767608106 767223716 767463923 767878532 767728508 767346203 767372489 767442286
1980.4 767442286 766854823 765895367 765389681 765283704 764716446 763598859 762919188 763035417 763213992
1998.8 763213992 763067186 763186514 763933063 764609218 764559150 764318645 764730036 765449584 765558302 765165210
2019.2 765165210 765072048 765263557 765004694 764233887 763690114 763547063 763050973 761863947 760666430
2037.5 760666430 759925365 759100556 757673800 756155550 755270183 754858196 754527569 754626036 755614638
2055.9 755614638 757000923 757839143 758091271 758529782 759319246 759765625 759652257 759724915 760442495 761205196
2076.3 761205196 761412740 761447787 761877775 762375832 762319267 761974573 762050450 762391448 762276471 761768639
2096.7 761768639 761590421 761811376 761757314 761228323 760819316 760874331 760920525 760532916 760108769 760130644
2117.1 760130644 760255575 759941578 759449542 759380698 759609103 759537160 759189487 759142578 759440005 759486794
2137.5 759486794 759097755 758820832 758974493 759074628 758730948 758351386 758345187 758372664 757968009 757414579
2157.9 757414579 757290006 757467270 757317722 756801724 756505609 756540418 756368816 755843878 755512178 755620718
2178.2 755620718 755660236 755285859 754919231 754947364 754997671 754620135 754127741 754026473 754085958 753763199
2198.6 753763199 753184021 752933800 753024101 752909780 752481401 752205551 752223492 752099395 751632154 751227558
2219 751227558 751188695 751172245 750803888 750338972 750177085 750125408 749742866 749128580 748723269 748506546
2239.4 748506546 748079062 747466683 747135162 747175694 747108996 746661782 746181846 745964170 745695531 745068789
2259.8 745068789 744418919 744159877 744056225 743590415 742824316 742310286 742215872 742244482 742313266 742628813
2280.2 742628813 743098319 743252933 742954671 742628455 742574871 742520630 742122531 741599262 741366863 741262734
2300.6 741262734 740823925 740088642 739458978 739045858 738656819 738254845 738060772 738071382 737856865 737195253
2321 737195253 736461222 735946834 735392809 734634221 734044135 733932912 734034121 734026372 734042585 734283686
2341.4 734283686 734447181 734181523 733901262 733976305 734208822 734253466 734020889 733753979 733643174 733584702
2361.8 733584702 733356237 733097136 733086288 733124137 732875943 732471347 732281685 732252479 732022941 731614172
2382.2 731614172 731368065 731315553 731077492 730489969 729930162 729669750 729412317 728877068 728294969 728001833
2402.6 728001833 727878630 727586627 727181077 726955473 726857007 726562142 726062179 725728393 725644588 725438237
2423 725438237 724931896 724435568 724227428 724076748 723668337 723181903 722927272 722745657 722287536 721630812
2443.4 721630812 721117973 720775366 720341802 719775081 719313323 718986869 718493938 717709899 716956317 716541052
2463.8 716541052 716312826 715979993 715599716 715395749 715289295 714998186 714587569 714389384 714405656 714325249
2484.2 714325249 714028776 713735938 713565946 713292539 712801516 712319434 712008536 711687148 711121976 710435271
2504.6 710435271 709852338 709305644 708602786 707752585 706937671 706164956 705197215 703981221 702822268
2522.9 702822268 701917291 701072991 700099945 699161589 698456824 697799504 696946800 696055353 695415556 695009649
2543.3 695009649 694598079 694123387 693751872 693496644 693149447 692644894 692159176 691784561 691366494 690798700
2563.7 690798700 690251172 689860702 689465880 688941658 688496888 688344896 688355625 688360572 688493729 688928187
2584.1 688928187 689551115 690040886 690240741 690351963 690553606 690723240 690762699 690846562 691133916 691443086
2604.5 691443086 691524267 691482961 691547573 691608667 691425681 691124856 691048443 691261530 691508830 691593111 691616058
2626.9 691616058 691709161 691731513 691497386 691142201 690956891 690981150 691059530 691137135 691256344 691348851 691228867
2649.4 691228867 690902650 690581560 690318406 689975083 689507842 689050972 688721180 688415647 687956631 687432349
2669.8 687432349 687053084 686758399 686382413 685992002 685705781 685430944 685052097 684672534 684448779 684320211
2690.2 684320211 684068322 683625281 683162034 682794809 682406187 681879818 681318939 680857599 680407703 679824889
2710.6 679824889 679172993 678609848 678106666 677504122 676835299 676304698 675921559 675430417 674725473 674032509
2731 674032509 673494637 672947228 672243059 671513021 670919299 670361757 669711232 669034243 668417394 667821467
2751.4 667821467 667148829 666418374 665766895 665204942 664585948 663871765 663193464 662618339 662038386 661355615
2771.8 661355615 660636604 659907401 659056902 658064425 657053888 656135619 655283570 654378355 653386056
2790.1 653386056 652421355 651556492 650663972 649588585 648387849 647218645 646061301 644844592 643631637
2808.5 643631637 642416954 641062200 639548123 637942910 636162817 633901656 630697250 626114249
2824.8 626114249 619850695 611747742 602032840 591699779 582850933 578809738 582123816 591163218
2841.1 591163218 600875378 607458770 610373259 610856175 610425591 610035062 609854102 609730721 609471142
2859.5 609471142 608778238 607359886 605184078 602555990 600030482 598064363 596652746 595668733 595442653
2877.8 595442653 596531391 598917425 601728618 603927910 604949117 604598463 602963448 600366831
2894.1 600366831 597092986 593278825 589072704 584747016 580643475 577247262 575292647 575426221
2910.4 575426221 577631652 581063628 584452033 586772501 587624550 587054253 585230231 582405686 578974366
2928.8 578974366 575393319 572172821 569852948 569032431 570259154 573125958 575809956 576384366 574144483
2947.2 574144483 569438994 563060880 556347609 551532507 550580859 553313613 558039069 563630462
2963.5 563630462 569796622 576191068 582137465 586978316 590439260 592666328 594047427 594981074
2979.8 594981074 595704436 596256137 596547067 596532285 596386373 596378386 596601069 597011507 597639143 598769724
3000.2 598769724 600734055 603320718 605919898 608071923 609601498 610825777 612321675 614022911
3016.5 614022911 615112066 614820540 612965822 610416472 608718038 608237803 608206272 608644426 610125244
3034.9 610125244 612303078 614120960 614911556 614626586 613495231 611728430 609264910 606274486 603931785
3053.2 603931785 603280604 603561521 603920043 605503082 609158576 613355339 616328359 618070781 619492352
3071.6 619492352 621036887 622539163 623868585 625182807 626668870 628227115 629500687 630235851
3087.9 630235851 630415440 630421519 631009877 632360101 633788347 634794056 635520458 636331737 637377918
3106.2 637377918 638461113 639296949 639950335 640626490 641199052 641471744 641380847 640991330 640601337 640432179
3126.6 640432179 640408576 640369415 640276134 640214622 640200675 640099823 639767647 639214218 638564408 637999892
3147 637999892 637802124 638088286 638580143 638886034 638857961 638553679 638087332 637596965 637176991 636852622
3167.4 636852622 636591196 636310160 635941267 635498047 635072827 634683192 634208262 633611321 632998765 632419646
3187.8 632419646 631855547 631399810 631205857 631252885 631330132 631256461 631009161 630627573 630158722 629630268
3208.2 629630268 629077315 628586531 628149867 627717376 627282798 626806974 626289129 625766695 625245035 624730408
3228.6 624730408 624236643 623745263 623207211 622671306 622230887 621848166 621486485 621130824 620728433 620262623
3249 620262623 619723201 619118571 618491828 617861509 617227137 616600275 616001606 615460575 615056396 614769340
3269.4 614769340 614377260 613794804 613160729 612523139 611865461 611254573 610718668 610196292 609699845 609327734
3289.8 609327734 609008193 608524382 607849717 607126057 606473982 605971277 605610073 605175674 604448199 603530586
3310.2 603530586 602628410 601787746 600989699 600246847 599547446 598830581 598046303 597132266 596081078
3328.6 596081078 594975054 593906879 592973769 592141926 591172576 589983225 588728011 587477088 586271346
3346.9 586271346 585155368 583956659 582525432 581011713 579567313 578143895 576657534 575182498
3363.2 575182498 573871553 572622120 571163118 569468677 567784131 566279888 564927340 563651145
3379.5 563651145 562374830 561079264 559869170 558914602 558265150 557604492 556631207 555578053 554817677
3397.9 554817677 554277003 553540647 552561820 551760495 551255047 550793946 550257921 549686074 549161851 548766732
3418.3 548766732 548458636 548173249 547945797 547780216 547619641 547471225 547458470 547579110 547608018 547475636
3438.7 547475636 547387123 547503650 547777176 548057199 548298120 548587441 548969984 549411416 549891233 550428271
3459.1 550428271 550941467 551394761 551954448 552624822 553166509 553519964 553893983 554403782 555014193 555629551
3479.5 555629551 556142986 556633711 557207465 557796717 558364332 558984995 559657156 560278773 560853124 561513484
3499.9 561513484 562220871 562780499 563245296 563815951 564512491 565274894 566008568 566655755 567308664 568033099
3520.3 568033099 568813622 569540977 570149720 570767760 571487963 572294950 573176920 574016035 574725211 575545430
3540.7 575545430 576610923 577613056 578273714 578802168 579428375 580065846 580714226 581452310 582295001
3559 582295001 583237588 584206462 585076749 585826993 586607456 587424099 588210702 589073062 590083003 591209352
3579.4 591209352 592443228 593750298 594903827 595686138 596417785 597381830 598393679 599437475 600619376
3597.8 600619376 601750791 602705121 603673518 604701579 605622530 606472909 607387662 608366191 609346867
3616.1 609346867 610159636 610807180 611514807 612353802 613195837 613698781 614007592 614524782 614991665 615295649
3636.5 615295649 615608215 615948796 616337478 616879761 617445409 617730141 617800534 618019879 618319750 618522286
3656.9 618522286 618753076 618905962 618867457 618972719 619285285 619319320 619124174 619090199 618738592 618177354
3677.3 618177354 618055224 618203878 618474245 618908465 619334161 619302750 618883967 618637085 618699133 618921340
3697.7 618921340 619102061 619031310 618847787 618907928 619174957 619215608 618784845 618423641 618410885 618470430
3718.1 618470430 618435502 618279994 618066847 617861271 617782295 617858529 617987156 618025720 617821932 617545485
3738.5 617545485 617461145 617283821 616732776 616498947 616518497 616095006 615676522 615670025 615711570 615569174
3758.9 615569174 615359724 615244210 615195990 615162432 614986539 614637792 614406168 614424288 614534914 614430785
3779.3 614430785 614094973 613813341 613646030 613524377 613388002 613239288 613123834 613007188 612973869 612892449
3799.7 612892449 612437487 611966133 611557901 611020088 610816479 611005068 611040175 610692143 610535026 610517979
3820.1 610517979 610185683 609916449 609782279 609696329 609681070 609606087 609552503 609445930 609059513 608631134
3840.5 608631134 608362794 608180642 608060360 608052790 608034134 607381463 606340587 606049180 606099069 605979145
3860.9 605979145 605677068 605358839 605241120 605143607 604993165 604948640 604882896 604817748 604710162 604549825
3881.3 604549825 604459047 604159176 603801787 603679597 603437424 603114843 603065372 603117347 602963388 602597237
3901.7 602597237 602166295 601847470 601765096 601767421 601722419 601630688 601406276 601036489 600713193 600550950
3922.1 600550950 600442588 600290418 600110292 599885285 599619031 599416375 599264205 599089444 598918974 598761261
3942.5 598761261 598636806 598513782 598325968 598159015 598020494 597795904 597549796 597372591 597203314 597014606
3962.9 597014606 596824527 596571267 596203268 595830917 595583320 595477343 595468104 595428467 595269382 595071673
3983.2 595071673 594856322 594547749 594206750 593927860 593698859 593469203 593235433
3997.5 593235433
##END=$$ End of the data block
