##TITLE=$$ Begin of the data block
##JCAMP-DX=5.00 $$ ACD/SpecManager v 10.08
##SPECTROMETER/DATA SYSTEM=16PC
##DATE=Wed Jul 24 12:49:57 2013
##DATA TYPE=INFRARED SPECTRUM
##DATA CLASS=XYDATA
##ORIGIN=
##OWNER=
##NPOINTS=3601
##FIRSTX=400.00000000
##LASTX=4000.00000000
##MAXX=4000.00000000
##MINX=400.00000000
##MAXY=37.63121414
##MINY=8.47675705
##XFACTOR=1.0000000000
##YFACTOR=0.000000100000000
##FIRSTY=21.37603951
##DELTAX=1.00000000
##XUNITS=1/CM
##YUNITS=TRANSMITTANCE
##XYDATA=(X++(Y..Y))
400B13760395N0357342L5623302J9170552O557083O57043P80144L775902O219215O261673
409C43162651M158249J455765l59574p93724l79600k5254k82936j046714j772118j937637
419C42179108j384964l51639P26700J455726J618386J183433K47727j034737k519073
428C42120667m113427n774688p422409q811608r468670q807792o436367k494469K208843
437B91000080O423416Q982239R345970P841358N447846L258667J944694J527481J551133
446C37322884J488876J098785N13802O0844k5253K20642N29518N95742K85034k84615
456C41806259q28934j076355r21058m61922P9384M96101O98319P24678O71196N97458
466C41785126M81529K55394j07536n21279p95860p34024k66190M67072J142349J391792
$$ y = [213760395, 264117737, 299741039, 318911591, 325468674, 326125717, 326905861, 330681763, 336900978, 343162651, 347320900, 348776665, 348417091, 347623367, 347243767, 347218513, 346935577, 345888863, 344116745, 342179108, 340794144, 340442505, 341169205, 342624931, 344243317, 345426750, 345674477, 344639740, 342120667, 338007240, 332232552, 324810143, 315998535, 306529865, 297722073, 291285706, 288791237, 291000080, 297423496, 306405735, 315751705, 323593063, 329040909, 332299576, 334244270, 335771751, 337322884, 338811760, 339910545, 340424347, 340485191, 340459938, 340680580, 341210098, 341805840, 342090874, 341806259, 340977325, 339900970, 338979912, 338517990, 338597374, 339093475, 339791794, 340516472, 341187668, 341785126, 342266655, 342522049, 342414513, 341893234, 341097374, 340363350, 340097160, 340564232, 341706581, 343098373]
476C43098373R81942n6763j416702k618981l191223k840881j562042L57742K430496
485C35181961M125176N039444N019531M181938K834053J334953k8991j096878j806336
494C54784851k134819k070503j639595r58176k43225K55432L78876J55487k08283m53414
504C47866631m38080k32811p2823j88560o28662j202164j594391j592293j277160j042710
514C39596977j401291k663459m671784o757278p975235p529068n176201j399975K753353
523C04776039O106053P838230P790413O441841M598770K981338J932755J382027J030616
532C44878082O11801N5504n19600r36622j096306j022263q06122n21430j86844J94206
542C40650406N65033P92694P29561L26195k90184q43888j048965p80869j74026M28924
$$ y = [343098373, 344080315, 344023552, 342606850, 339987869, 336796646, 333955765, 332393723, 332751465, 335181961, 339307137, 344346581, 349366112, 353548050, 356382103, 357717056, 357688065, 356591187, 354784851, 352650032, 350579529, 348939934, 347981758, 347738533, 347993965, 348372841, 348528328, 348320045, 347866631, 347428551, 347195740, 347122917, 346934357, 346305695, 345103531, 343509140, 341916847, 340639687, 339596977, 338195686, 335532227, 330860443, 324103165, 316127930, 308598862, 303422661, 302022686, 304776039, 310882092, 318720322, 326510735, 332952576, 337551346, 340532684, 342465439, 343847466, 344878082, 345489883, 345545387, 345025787, 344089165, 342992859, 341970596, 341164474, 340643044, 340456200, 340650406, 341215439, 342008133, 342737694, 343063889, 342773705, 341929817, 340880852, 340099983, 339925957, 340354881]
552C40354881O55365L11241n05638j464920k202263k543449k607384k713203l137169
561C26147461l868218m528503m538174l446312j241283J557713M101028N601234N702115
570C25487061M616775K974014J474381N64117K94152M05883N49317M84886J63536l18298
580C36695824q22945j254158j580734j814614j977768k078399k102661k013131j761245
589C21290169j316681p06062l3436N44777Q93306R78241Q95729Q18367Q82836J091270
599C25338516J298104J295127R45740K80342n05409j145248j434060j323661r42917
608C23806534n42488l92990o69747j360359k228832k872658k875996k014122m08516
617C10440826J472817L003826L699074L461094K621650J741944J283607J350746J660424
$$ y = [340354881, 341010246, 341321487, 340815849, 339350929, 337148666, 334605217, 331997833, 329284630, 326147461, 322279243, 317750740, 313212566, 309766254, 308524971, 310082684, 314183712, 319784946, 325487061, 330103836, 333077850, 334552231, 335116348, 335410500, 335816383, 336365700, 336850586, 337014122, 336695824, 335872879, 334618721, 333037987, 331223373, 329245605, 327167206, 325064545, 323051414, 321290169, 319973488, 319267426, 319233990, 319778767, 320672073, 321650314, 322546043, 323364410, 324247246, 325338516, 326636620, 327931747, 328877487, 329157829, 328652420, 327507172, 326073112, 324749451, 323806534, 323264046, 322871056, 322201309, 320840950, 318612118, 315739460, 312863464, 310849342, 310440826, 311913643, 314917469, 318616543, 322077637, 324699287, 326441231, 327724838, 329075584, 330736008]
626C30736008J752357J298676L12385q64792j774864k102356j822052j157646m11377
635C25966339K11754O71158J032638J350632J588402J632690J386147Q65440K32620
644C34937820k69165m40139k37427J92261N82046O84281L99971j77384q27446j341743
654C33503075j643563j808319j970520k182274k336731k226410j717586r18713k10304
663C18488655p9670q39500k401943m263058n726128o241684n663585m275742k588825
672B86408520j049214J60313J123657K031574K990075L926410M635792M913807M671249
681C09812183L965302K945499J765995N23682p65018k150746l720951n547543p609748
690B99218655r710560j1439991j2245999j1628036r382916n776481j520558K466793
$$ y = [330736008, 332488365, 333787041, 334099426, 333234634, 331459770, 329357414, 327535362, 326377716, 325966339, 326178093, 326849251, 327881889, 329232521, 330820923, 332453613, 333839760, 334705200, 334937820, 334668655, 334228516, 333991089, 334183350, 334765396, 335449677, 335849648, 335672264, 334844818, 333503075, 331859512, 330051193, 328080673, 325898399, 323561668, 321335258, 319617672, 318698959, 318488655, 318408985, 317569485, 315167542, 310904484, 305178356, 298936672, 293273087, 288997345, 286408520, 285359306, 285519619, 286643276, 288674850, 291664925, 295591335, 300227127, 305140934, 309812183, 313777485, 316722984, 318488979, 319012661, 318247643, 316096897, 312375946, 306828403, 299218655, 289508095, 278068104, 265822105, 254194069, 244811153, 239034672, 237514114, 239980907]
698B39980907N419064P014446P456150P298985P125320P250080P603760P836056P557049
707C04541817O571369M984398L142452J463814K61192l59192m89235l30639q5468J18504
717C19819012K44617L14865L61901L95546M01268L62052K83280J98288J48659J51596
727C22681084J80130J70860O1493j65939m64058p38640q97522r03568p97272o77204
737C18449364o49090p75223j054459j441593j890049k386627k949753l591098m258156
746B99453316m796868m964714m498920l221378j133404J540985M390907O925087Q714504
755C02409515R516240R332561Q385315P018623N574913M292755L266449K470894J827698
764C54094963J272698P89871M01115J29585l4027j35040k25830l26386m01573l80325
$$ y = [239980907, 245399971, 252414417, 259870567, 267169552, 274294872, 281544952, 289148712, 296984768, 304541817, 311113186, 316097584, 319240036, 320703850, 320965042, 320605850, 320116615, 319785976, 319700508, 319819012, 320063629, 320378494, 320740395, 321135941, 321537209, 321899261, 322182541, 322380829, 322529488, 322681084, 322861214, 323032074, 323093567, 322927628, 322463570, 321724930, 320827408, 319923840, 319126568, 318449364, 317800274, 317025051, 315970592, 314528999, 312638950, 310252323, 307302570, 303711472, 299453316, 294656448, 289691734, 285192814, 281971436, 280838032, 282379017, 286769924, 293695011, 302409515, 311925755, 321258316, 329643631, 336662254, 342237167, 346529922, 349796371, 352267265, 354094963, 355367661, 356157532, 356558647, 356688232, 356654205, 356519165, 356293335, 355966949, 355565376, 355185051]
774C55185051k05689J12420M77676P42416P80335N56755J54419k68173n59807o55174
784C56320229o02341n20706n23186o51321q67348j105385j339951j618003k022210
793C47069778k587165l224144l717194l802910l303566k233162q21762N57709J519127
802C29456711J787147J268921O6834j549835l194123m432182m888287m375457l006707
811C11133022j215286L68576J160584Q90369k49023j661034k604542k528896j317558
820C03976212O78558K823830M488105N294113N211030M481124L450356K406311J496925
829C34306564P39479Q3428n25208j106376j636544k053794k269021k184333j730385
838C23623810r12361J51939J237106K070580K436256K272492J709213J013756M64210
$$ y = [355185051, 354979362, 355091782, 355569458, 356311874, 357092209, 357648964, 357803383, 357535210, 356975403, 356320229, 355717888, 355197182, 354673996, 354022675, 353155327, 352049942, 350709991, 349091988, 347069778, 344482613, 341258469, 337541275, 333738365, 330434799, 328201637, 327379875, 327937584, 329456711, 331243858, 332512779, 332579613, 331029778, 327835655, 323403473, 318515186, 314139729, 311133022, 309917736, 310286312, 311446896, 312337265, 312088242, 310427208, 307822666, 305293770, 303976212, 304654770, 307478600, 311966705, 317260818, 322471848, 326952972, 330403328, 332809639, 334306564, 335046043, 335129471, 334604263, 333497887, 331861343, 329807549, 327538528, 325354195, 323623810, 322711449, 322863388, 324100494, 326171074, 328607330, 330879822, 332589035, 333602791, 334067001]
847C34067001K16675K39372L54958L60031J40839k97432r07402j719589k890397m601974
857C24962082o839581r189281j0824795j0771656q362732l656292K432900Q406810
865B86157455J2755700J4553814J3781108J1227456Q056983N283432L420716K440910
873C57677574J991005J690025J331406R13658N39322K90222J63956R3536P782j21879
883C64576607k75383m12827n04188n42717n37186m99115m33769l40271k14272n0506
893C60766373J54609L97187O59217R04503J086083J161613J112862R55162P33375N03464
903C68434448L08495J60560L4790j16157l34206o18629r05266j074448r98344o08978
913C64282265M6692Q03375J438446J770210J744309J452026J072235P69386O10466
$$ y = [334067001, 334283676, 334523048, 334878006, 335238037, 335378876, 335081444, 334174042, 332454453, 329564056, 324962082, 318122501, 308933220, 298108425, 287336769, 278974037, 275317745, 277750645, 286157455, 298913155, 313466969, 327248077, 338475533, 346532516, 351815948, 355236664, 357677574, 359668579, 361358604, 362690010, 363603668, 364142990, 364433212, 364597168, 364690704, 364698486, 364576607, 364301224, 363888397, 363384209, 362841492, 362304306, 361805191, 361371422, 361031151, 360816879, 360766373, 360920982, 361318169, 361977386, 362881889, 363967972, 365129585, 366242447, 367197609, 367930984, 368434448, 368742943, 368903503, 368938293, 368822136, 368487930, 367869301, 366964035, 365889587, 364891243, 364282265, 364328957, 365132332, 366570778, 368340988, 370085297, 371537323, 372609558, 373378944, 373989410]
922C73989410N51110M93049L68462J91345M2076J15P7133J98669K50092J50680r1857
933C76220284l85514o10161o86721o17104m71115l37563k72827k76451l05748l09448
943C71947632k59628j64986o0921J0300K0180l7079j44806k74010l97377n01251n89905
954C69548149o79893p87201r16138j056213j193962j325875j466141j634559j830445
963C58657722k009735k081718j940041j512375q07876O7367R38111J622734J999817
972C54934006K049103J847763J525306J202164R41734P36122N32418K77023m2725l85742
982C63617172o76040q40187q43773p03965m79774k45247o5155J9760m616j26991l16696
993C59334488n32227p38067r22356j100845j297341j507301j673279j709442j578712
$$ y = [373989410, 374540520, 375033569, 375402031, 375593376, 375635452, 375635567, 375712700, 375911369, 376161461, 376312141, 376220284, 375834770, 375224609, 374537888, 373920784, 373449669, 373112106, 372839279, 372562828, 372257080, 371947632, 371688004, 371523018, 371462097, 371472397, 371492577, 371455498, 371310692, 371036682, 370639305, 370138054, 369548149, 368868256, 368081055, 367164917, 366108704, 364914742, 363588867, 362122726, 360488167, 358657722, 356647987, 354566269, 352626228, 351113853, 350305977, 350373344, 351311455, 352934189, 354934006, 356983109, 358830872, 360356178, 361558342, 362500076, 363236198, 363768616, 364045639, 364002914, 363617172, 362941132, 362100945, 361257172, 360553207, 360073433, 359828186, 359763031, 359782791, 359778175, 359651184, 359334488, 358802261, 358064194, 357141838, 356040993, 354743652, 353236351, 351563072, 349853630, 348274918]
1002C48274918j382714j390991j947441l268166n225677p265358q546562q285351o142407
1011C04820251k446689J881370N689011Q053913Q620377P651901N809021L799210K097435
1020C45975800Q53920j2360o44646j121750j431656j524086j374473j011391n00870
1029C39208488Q0796O56662J144447J453667J509475J289177Q47359L01857k17247
1038C46274681o24618r05343j097259j247139j375389j474114j534080j569252j617928
1047C34829559j711464j836471j919556j849899j531754r36126j24855P64160J562385
1056C27245979K124405K367935K289353J951446J453095Q93783L46566j50109n84411
1065C37938042r57146j273346j548157j814041k118606k497750k936783l346176l578510
$$ y = [348274918, 346892204, 345501213, 343553772, 340285606, 335059929, 327794571, 319248009, 310962658, 304820251, 302373562, 304254932, 309943943, 317997856, 326618233, 334270134, 340079155, 343878365, 345975800, 346829720, 346817360, 346172714, 345050964, 343619308, 342095222, 340720749, 339709358, 339208488, 339289284, 339945946, 341090393, 342544060, 344053535, 345342712, 346190071, 346491928, 346274681, 345650063, 344744720, 343647461, 342400322, 341024933, 339550819, 338016739, 336447487, 334829559, 333118095, 331281624, 329362068, 327512169, 325980415, 325044289, 324919434, 325683594, 327245979, 329370384, 331738319, 334027672, 335979118, 337432213, 338325996, 338672562, 338522453, 337938042, 336980896, 335707550, 334159393, 332345352, 330226746, 327728996, 324792213, 321446037, 317867527]
1074C17867527l494701l049279k347774j635418j213417j322537k050399l302994m844093
1083B94606915o364670p546521q097476p775937o428165m050083q46844K754402O176701
1092B62428322Q843689J0351963J0591297R756355Q246155O504383M874706L529854
1100C25126724K489853J695213J084481O33621L45955K15988K00577K20070J92070
1109C32204552P3166j20087l25623m78553n55268n87578o35795p35436q53576q86231
1119C27099571p07588k45209M61541J259880J941299K333565K372894K120934J720848
1128C38357735J320419J008339P94640O35948M83703L19596J62849M8485o87Q278M1695
1139C43181000N6915K3079o6986j97220l38135m61616n51987o14166o69708p47910
$$ y = [317867527, 314372826, 311323547, 308975773, 307340355, 306126938, 304804401, 302754002, 299451008, 294606915, 288242245, 280695724, 272598248, 264822311, 258394146, 254344063, 253497219, 256251621, 262428322, 271272011, 281623974, 292215271, 301971626, 310217781, 316722164, 321596870, 325126724, 327616577, 329311790, 330396271, 331029892, 331375847, 331591835, 331792412, 332012482, 332204552, 332277718, 332157631, 331832008, 331353455, 330798187, 330210609, 329574814, 328839378, 327985802, 327099571, 326391983, 326146774, 326608315, 327868195, 329809494, 332143059, 334515953, 336636887, 338357735, 339678154, 340686493, 341481133, 342117081, 342600784, 342920380, 343083229, 343131714, 343131027, 343139305, 343181000, 343237915, 343260994, 343194008, 342996788, 342658653, 342197037, 341645050, 341030884, 340361176, 339613266]
1149C39613266q71086j042404j241761j431465j566581j607666j528092j319580r95293
1158C28009338n93719j79100J69411L78685M11262K84538P1793j23138k08245j39274
1168C28081551O1760L20701N44853O62651O50330N35927L81622K52876J90201J93672
1178C31876144K27051K39144J92070Q1863n9471j81503k45018k44179k08206j84365
1188C31493530k08511k86064l93143m95186n70946o22673o68411p23228p83997q32138
1198C25909233q50105q40302q27751q43201q95347r51882r48238q20351n47084j74027
1208C18210945J95904M43993M86125L04337n6458n19847j016312j501083j945553k309323
1218C12292728k523365k500286k173633j545506p09438J67446Q99735J349124J467381
$$ y = [339613266, 338742180, 337699776, 336458015, 335026550, 333459969, 331852303, 330324211, 329004631, 328009338, 327415619, 327236519, 327405930, 327784615, 328195877, 328480415, 328552208, 328429070, 328220825, 328081551, 328143311, 328464012, 329008865, 329671516, 330321846, 330857773, 331239395, 331492271, 331682472, 331876144, 332103195, 332342339, 332534409, 332616272, 332556801, 332375298, 332130280, 331886101, 331677895, 331493530, 331285019, 330998955, 330605812, 330110626, 329539680, 328917007, 328248596, 327525368, 326741371, 325909233, 325059128, 324218826, 323391075, 322547874, 321652527, 320700645, 319752407, 318932056, 318384972, 318210945, 318406849, 318850842, 319336967, 319641304, 319584846, 319064999, 318048687, 316547604, 314602051, 312292728, 309769363, 307269077, 305095444, 303549938, 302840500, 303007946, 303907681, 305256805, 306724186]
1227C06724186J298332R45072N22194J18160k19516m80347o78215q39310r93156j162911
1237C05234489j354408j550789j717815j822624j857033j849480j855182j925869k077599
1246B89223690k277431k458973k560940k562771k496471k425290k405109k452888k543469
1255B67040348k633038k691421k715855k716045k682114k562256k274017j746998r74121
1264B46044483l2215R42459J814308K507897L028583L435097L783054M078465M267235
1273B69869366M261341L977661L362808K400646J118012l94192j949234l253460l955421
1282B75437527l762455k583695o21471J653213L652878M888992N148659M548111L443203
1291B91804962K252426J285496O53725K84900J2513l22743q05473j434345k155629
$$ y = [306724186, 308022518, 308967590, 309489784, 309607944, 309388428, 308908081, 308229866, 307390556, 306397400, 305234489, 303880081, 302329292, 300611477, 298788853, 296931820, 295082340, 293227158, 291301289, 289223690, 286946259, 284487286, 281926346, 279363575, 276867104, 274441814, 272036705, 269583817, 267040348, 264407310, 261715889, 259000034, 256283989, 253601875, 251039619, 248765602, 247018604, 246044483, 246012268, 246954727, 248769035, 251276932, 254305515, 257740612, 261523666, 265602131, 269869366, 274130707, 278108368, 281471176, 283871822, 284989834, 284595642, 282646408, 279392948, 275437527, 271675072, 269091377, 268469906, 270123119, 273775997, 278664989, 283813648, 288361759, 291804962, 294057388, 295342884, 295996609, 296281509, 296294022, 295971279, 295165806, 293731461, 291575832]
1300B91575832k913284l688564m502373n378971o280060p049179p410145p047672n754070
1309B41551514l577137q81005J737233L661727M510212M299527L433284K514172K071457
1318B59320984K339439L189717M231834N017948N237923M822121L922691K811661J760139
1327B92654457R53846M65374K69604K78511L74927M41056L85208J67675j83544n78900
1337B95228214r03225j070861j072178r85375r37881j036492j304531j664696j983337
1346B84269638k151108k151413k072544k055301k208672k546902k988853l413925l737812
1355B60943108l956013m129410m327640m573231m823895n005283n066872n024147m959316
1364B19077301m980907n164376n505390n905304o191368o164055n653477m568004k920723
$$ y = [291575832, 288662548, 284973984, 280471611, 275092640, 268812580, 261763401, 254353256, 247305584, 241551514, 237974377, 237093372, 238830605, 242492332, 247002544, 251302071, 254735355, 257249527, 259320984, 261660423, 264850140, 269081974, 274099922, 279337845, 284159966, 288082657, 290894318, 292654457, 293608303, 294073677, 294343281, 294621792, 294996719, 295437775, 295822983, 295990658, 295807114, 295228214, 294324989, 293254128, 292181950, 291196575, 290258694, 289222202, 287917671, 286252975, 284269638, 282118530, 279967117, 277894573, 275839272, 273630600, 271083698, 268094845, 264680920, 260943108, 256987095, 252857685, 248530045, 243956814, 239132919, 234127636, 229060764, 224036617, 219077301, 214096394, 208932018, 203426628, 197521324, 191329956, 185165901, 179512424, 174944420, 172023697]
1373A72023697q25691J532993L943615O204071Q139954R608860J0503521J0769558
1381B21900578J0432720R619693Q547993P474861O619664O092395N858975N762005
1389B82308884N585193N141602M349880L272533K091198J022377J98555m25529j075401
1398C02469292k036057l448047n129071o545543o997872n952377l352699K74353M001388
1407B73283367O887608Q365402Q420029P481880O124267M762803L527298K347793J152039
1416C22352486J4648q43468j194496r70840l39127L65830Q04824P98226M00009j46294
1426C21241798n40657n78422k54440K29263N55839M51966j61209j104851k012196k507839
1436C15319252k402878j795997j017285m50802l43914p18231j419430k249202l074227
$$ y = [172023697, 171198006, 172730999, 176674614, 182878685, 191018639, 200627499, 211131020, 221900578, 232333298, 241952991, 250500984, 257975845, 264595509, 270687904, 276546879, 282308884, 287894077, 293035679, 297385559, 300658092, 302749290, 303771667, 303970222, 303544693, 302469292, 300433235, 296985188, 291856117, 285310574, 278312702, 272360325, 269007626, 269281979, 273283367, 280170975, 288536377, 296956406, 304438286, 310562553, 315325356, 318852654, 321200447, 322352486, 322367134, 321523666, 320329170, 319358330, 319019203, 319385033, 320189857, 320988083, 321388092, 321241798, 320701141, 320122719, 319868279, 320097542, 320653381, 321105347, 320944138, 319839287, 317827091, 315319252, 312916374, 311120377, 310103092, 309652290, 309308376, 308590145, 307170715, 304921513, 301847286]
1445C01847286l843803m531174n074997n389500n429573n239849m913425m470730l760509
1454B59193726k493439m40064K318764N273514P624950Q647976Q075962O269074M044094
1463B98514557K254677J364708J262855J408863J202622L41911j034698k475491l502407
1472B99337597l876572l694191l294410l062039l246574l883534m823131n817032o605168
1481B61034946o967010o742783n845718m280396k165660K56824K645340M617310N834560
1490B48387413O096973N417881M058114K494335J305809R91573J763630L403130N268592
1499B79187450O498242O358585M590721J580658j763248m391327n574932n211220l814564
1508B77460365k207603j099377p85522j117115j712742k242375k600612k884293l237953
$$ y = [301847286, 298003483, 293472309, 288397312, 283007812, 277578239, 272338390, 267424965, 262954235, 259193726, 256700287, 256260223, 258578987, 263852501, 271477451, 280125427, 288201389, 294470463, 298514557, 300769234, 302133942, 303396797, 304805660, 306008282, 306350193, 305315495, 302840004, 299337597, 295461025, 291766834, 288472424, 285410385, 282163811, 278280277, 273457146, 267640114, 261034946, 254067936, 247325153, 241479435, 237199039, 235033379, 235290203, 237935543, 242552853, 248387413, 254484386, 259902267, 263960381, 266454716, 267760525, 268752098, 270515728, 273918858, 279187450, 285685692, 292044277, 296634998, 298215656, 296452408, 292061081, 286486149, 281274929, 277460365, 275252762, 274153385, 273367863, 272250748, 270538006, 268295631, 265695019, 262810726, 259572773]
1517B59572773l704758m189701m541168m664898m579601m384041m183102m039669l981132
1526B21304703m026699m186669m418297m582271m463120l870563k769680j342907P4596
1535A91719093J163426J788559K064647K277527K716542L520755M617882N772362O697731
1544B22338524P172146P120933O646843O002464N494633N330200N459538N515423M932327
1553B76013031L242416M21067k924385n682297o680260n249767j619225L099003P346363
1562B67965946R779549R826832P869854M980220K368241Q30421M63219P51610R44500
1571C05780392M96292o56662k112942l274822l703289l360024k611751k013855k005406
1580B86537933k688160l797016m855404n412502n233536m364624l072777j722011o50044
$$ y = [259572773, 255868015, 251678314, 247137146, 242472248, 237892647, 233508606, 229325504, 225285835, 221304703, 217278004, 213091335, 208673038, 204090767, 199627647, 195757084, 192987404, 191644497, 191719093, 192882519, 194671078, 196735725, 199013252, 201729794, 205250549, 209868431, 215640793, 222338524, 229510670, 236631603, 243278446, 249280910, 254775543, 260105743, 265565281, 271080704, 276013031, 279255447, 279676514, 276752129, 271069832, 264389572, 259139805, 257520580, 260619583, 267965946, 277745495, 287572327, 295442181, 300422401, 302790642, 303621063, 304084282, 304835892, 305780392, 306276684, 305620022, 303507080, 300232258, 296528969, 293168945, 290557194, 288543339, 286537933, 283849773, 280052757, 275197353, 269784851, 264551315, 260186691, 257113914, 255391903, 254741859]
1589B54741859q5010j05038o37398j494483k445031l303165l993778m555893n077973
1598B33044090n607471o099796o445885o556740o438255o191788n935402n709114n440063
1607A78619576n000382m314709l425789k462081j524659n83458N26467J992473L865910
1616A67693348N968342P930603R344044R927082R615726Q540344O931896N027104L017807
1625B33996296J041222q26397k586804m327354o181412q226738j0366096j2269440
1633A90253277j3438969j3394337j1894121r079838n457944j718703J528473L976212
1641A40774050N696935P037783Q382425R896946J1388855J2368794J2303924J0947171
1649B18796883Q563575N904484L905564L240318L968220N485477O830063P184849O301422
$$ y = [254741859, 254656849, 254551811, 253914413, 252419930, 249974899, 246671734, 242677956, 238122063, 233044090, 227436619, 221336823, 214890938, 208334198, 201895943, 195704155, 189768753, 184059639, 178619576, 173619194, 169304485, 165878696, 163416615, 161891956, 161308498, 161834965, 163827438, 167693348, 173661690, 181592293, 190936337, 200863419, 210479145, 219019489, 225951385, 230978489, 233996296, 235037518, 234211121, 231624317, 227296963, 221115551, 212888813, 202522717, 190253277, 176814308, 163419971, 151525850, 142446012, 136988068, 135269365, 136797838, 140774050, 146470985, 153508768, 161891193, 171788139, 183176994, 195545788, 207849712, 218796883, 227360458, 233264942, 237170506, 240410824, 244379044, 249864521, 256694584, 263879433, 270180855]
1658B70180855M596824K877121J854592J757755K260666K753086K759686K227802J507492
1667B92775879J060009J112251J501255J814366J717891J231289P47891P64103J500835
1676C04225769K671986L576698L483601K083263k66743k662029m078617l872299k078724
1685C03082905O35967L321991N186253N891342N584888M692383L628540K602730J606445
1694C36233444N53513n50041j528740k105027k067642j424789m43840M61921R37996
1703C30066795Q72918M52194N1498K1973M86107J256065J916733K034340J379776O0119
1713C38598518j505546k753296l207550k681236j357651K84042J670647K384376K346306
1722C33778610J838455J339989J248856J636314K184448K361832J756134L68919j317787
$$ y = [270180855, 274777679, 277654800, 279509392, 281267147, 283527813, 286280899, 289040585, 291268387, 292775879, 293835888, 294948139, 296449394, 298263760, 299981651, 301212940, 301960831, 302724934, 304225769, 306897755, 310474453, 313958054, 316041317, 315774574, 313112545, 309033928, 305161629, 303082905, 303718872, 307040863, 312227116, 318118458, 323703346, 328395729, 332024269, 334626999, 336233444, 336786957, 336236916, 334708176, 332603149, 330535507, 329110718, 328666878, 329128799, 330066795, 330939713, 331391907, 331443405, 331465378, 331951485, 333207550, 335124283, 337158623, 338538399, 338598518, 337092972, 334339676, 331132126, 328450890, 327093239, 327377281, 329047928, 331432304, 333778610, 335617065, 336957054, 338205910, 339842224, 342026672, 344388504, 346144638, 346513557, 345195770]
1731C45195770k567558k789917j880760k91710J223602K028084J939239J279793O32553
1740C44769096M63677Q53500J487427J886253J710968R54933p5607r50508j342392
1749C49757347j164131n64613J80320Q02765J135025J136322Q68225M48304Q506l32946
1759C52275124m85039l93524n3215M71573J033668J417160J402245Q66813j17035j264724
1769C55153046k168579k475892k061233j093674M6234R55353J388931J334763R55811
1778C52034760M63905J9951k85950l97568k69203J01318O07834J017990J057473N73997
1788C54924507l25584j277352j830406j698265r33685Q6746Q66928J060066O42624
1797C51515579j03225p68052j039543q43658l40309J92833N10673N02281K12975k04697
$$ y = [345195770, 342628212, 339838295, 337957535, 337665825, 338889427, 340917511, 342856750, 344136543, 344769096, 345232773, 346086273, 347573700, 349459953, 351170921, 352125854, 352050247, 351099739, 349757347, 348593216, 348028603, 348208923, 349011688, 350146713, 351283035, 352151260, 352599564, 352608070, 352275124, 351790085, 351396561, 351343346, 351814919, 352848587, 354265747, 355667992, 356534805, 356417770, 355153046, 352984467, 350508575, 348447342, 347353668, 347399902, 348355255, 349744186, 351078949, 352034760, 352498665, 352518616, 352232666, 351835098, 351565895, 351667213, 352275047, 353293037, 354350510, 354924507, 354598923, 353321571, 351491165, 349792900, 348859215, 348945961, 349812889, 350872955, 351515579, 351412354, 350644302, 349604759, 348761101, 348420792, 348613625, 349124298, 349626579, 349839554, 349634857]
1807C49634857n70907p55272p21588n27497k84691r7236j1750o294k1515q278M3030
1818C46672859J10855J74370K34604L00636L54004L31040J54686j96839o36329r86405
1828C46513481j072426q36143l81584Q6555L95737N13878N48019O31676P89146Q84667
1838C48073006P09762J52130o78482j469116j867256j688042j026039k00043M29650
1847C42435570O53229M94804J52931j45607k74467k49100j73073j46408j99509k86064
1857C42262306l24173k53792p6065J38817K75917K23122p1259n57594j083641j449890
1867C39083748j501045j209641o99005j84669J35955J79940N722k42920m31214n01518
1877C34635353m77486m11949l33328k31132q8349P5493J94397J93748M6540j97983
$$ y = [349634857, 349063950, 348308678, 347587090, 347059593, 346774902, 346677666, 346665916, 346659622, 346638107, 346629829, 346672859, 346783714, 346958084, 347192688, 347493324, 347847328, 348178368, 348333054, 348136215, 347499886, 346513481, 345441055, 344604912, 344223328, 344309883, 344705620, 345219498, 345767517, 346399193, 347188339, 348073006, 348782768, 348934898, 348256416, 346787300, 344920044, 343232002, 342205963, 342005920, 342435570, 343088799, 343583603, 343736534, 343590927, 343316460, 343067360, 342894287, 342747879, 342548370, 342262306, 341938133, 341684341, 341608276, 341747093, 342023010, 342246132, 342174873, 341617279, 340533638, 339083748, 337582703, 336373062, 335674057, 335489388, 335625343, 335805283, 335811005, 335568085, 335136871, 334635353, 334157867, 333745918, 333412590, 333181458, 333093109, 333168602, 333362999, 333556747, 333603287, 333405304]
1887C33405304m41437o00090o57692o66351o94389p63054q21495p80526n77621k28157
1897C27174492J79634N34744P63512Q54530Q38776P47223N88875L62129R1705j53961
1907C31981659k83470k39449m6806J84936L16239K57568K4109k73476m93736n46493
1917C30881081m37355k53487j02577m9935q9492j64147k12173k07405j69526j41983
1927C29053001j57051k15454k84271l20129k95067k13166j12686n0239p6676k13928
1937C27114334m40140o92672q89168r61113q83942o89239m50745k50778j43280j35727
1947C21577530j95236k74659l39431l80516m06266m25243m31976m07429l32832k06051
1957C18177891m9515R4814J82782J83792R2640o9943k64683m44584n69534o15501n81837
$$ y = [333405304, 332963867, 332363777, 331706085, 331039734, 330345345, 329582291, 328760796, 327980270, 327402649, 327174492, 327354126, 327888870, 328652382, 329506912, 330345688, 331092911, 331681786, 332043915, 332135620, 331981659, 331698189, 331458740, 331411934, 331596870, 331913109, 332170677, 332194786, 331921310, 331427574, 330881081, 330443726, 330190239, 330087662, 330037727, 329948235, 329784088, 329571915, 329364510, 329194984, 329053001, 328895950, 328680496, 328396225, 328076096, 327781029, 327567863, 327455177, 327404938, 327328262, 327114334, 326674194, 325981522, 325092354, 324131241, 323247299, 322558060, 322107315, 321856537, 321713257, 321577530, 321382294, 321107635, 320768204, 320387688, 319981422, 319556179, 319124203, 318716774, 318383942, 318177891, 318128376, 318223190, 318405972, 318589764, 318682404, 318612461, 318347778, 317903194, 317333660, 316718159, 316136322]
1968C16136322m90875l78781k82611k26059k13166k30961k59361k83527l00102l14885
1978C13155994l35426l62492l87954m00830l97110l87363l96366m50916n63298p18574
1988C08755665q73413r71928r70840q61092o75793m77409l30238k73686l06797l94420
1998C02620049m88053n49393n66005n50423n27077n15384n18895n24444n12333m69017
2008B97399025l97987l20740k68536k68211l28541m34418n52597o46457o91624o85520
2018B92804394o44322n92613n50804n29671n32684n61142o17924p04098q12664r25960
2028B86332512j020413j078300j097031j092415j089801j112233j170539j261158j373291
2037B76037331j494637j616783j734486j843776j941338k026520k101974k172508k240239
$$ y = [316136322, 315645447, 315266666, 314984055, 314757996, 314544830, 314313869, 314054508, 313770981, 313470879, 313155994, 312820568, 312458076, 312070122, 311669292, 311272182, 310884819, 310488453, 310037537, 309474239, 308755665, 307882252, 306910324, 305939484, 305078392, 304402599, 303925190, 303594952, 303321266, 303014469, 302620049, 302131996, 301582603, 301016598, 300466175, 299939098, 299423714, 298904819, 298380375, 297868042, 297399025, 297001038, 296680298, 296411762, 296143551, 295815010, 295380592, 294827995, 294181538, 293489914, 292804394, 292160072, 291567459, 291016655, 290486984, 289954300, 289393158, 288775234, 288071136, 287258472, 286332512, 285312099, 284233799, 283136768, 282044353, 280954552, 279842319, 278671780, 277410622, 276037331, 274542694, 272925911, 271191425, 269347649, 267406311, 265379791, 263277817, 261105309, 258865070]
2046B58865070k301712k348575k373600k376442k364826k349606k335625k317371k280922
2055B37816391k212982k109432j977349j830330j680374j533489j391983j263428j165275
2064B22651749j124344j166954j307087j538925j839028k174835k516518k843837l145466
2073B04994755l414192l641129l814774l924522l967781l954220l907661l860607l848095
2082A70661774l899651m035263m261360m570637m940739n335035n705786o001329o174841
2091A25737133o194038o044941n731688n270634m685573m004851l262310k497367j752272
2100H6293459j064873m61016M8800M65307P91722J027546J169633J223736J217032
2109I0711346J205072J263266J465950J859913K446298L177471L972235M740582N408887
$$ y = [258865070, 256563358, 254214783, 251841183, 249464741, 247099915, 244750309, 242414684, 240097313, 237816391, 235603409, 233493977, 231516628, 229686298, 228005924, 226472435, 225080452, 223817024, 222651749, 221527405, 220360451, 219053364, 217514439, 215675411, 213500576, 210984058, 208140221, 204994755, 201580563, 197939434, 194124660, 190200138, 186232357, 182278137, 178370476, 174509869, 170661774, 166762123, 162726860, 158465500, 153894863, 148954124, 143619089, 137913303, 131911974, 125737133, 119543095, 113498154, 107766466, 102495832, 97810259, 93805408, 90543098, 88045731, 86293459, 85228586, 84767570, 84816370, 85281677, 86073399, 87100945, 88270578, 89494314, 90711346, 91916418, 93179684, 94645634, 96505547, 98951845, 102129316, 106101551, 110842133, 116251020]
2118A16251020N935936O317273O577196O756448O897860P035875P191573P369804P560139
2127A77893124P738266P868709P911682P832604P613506P261105O806774O295376N769577
2136B42990723N255069M756928M267330L780079L301849K853070K457428K129173J865311
2145B73656960J650047J467533J313209J197415J137562J144008J210785J313515J418705
2154B85509739J497497J535664J537819J521931J509094J512089J526451J531296J496791
2163B99178371J399956J238442J037254Q39462O87351O01464N72834N71518N70888
2172C06697540N67704N87444O66904Q25501J042633J260090J405811J430340J330910
2181C15814877J150398R52205P87907O74839N98107N29594M50401L63350K86980K39258
$$ y = [116251020, 122186956, 128504229, 135081425, 141837873, 148735733, 155771608, 162963181, 170332985, 177893124, 185631390, 193500099, 201411781, 209244385, 216857891, 224118996, 230925770, 237221146, 242990723, 248245792, 253002720, 257270050, 261050129, 264351978, 267205048, 269662476, 271791649, 273656960, 275307007, 276774540, 278087749, 279285164, 280422726, 281566734, 282777519, 284091034, 285509739, 287007236, 288542900, 290080719, 291602650, 293111744, 294623833, 296150284, 297681580, 299178371, 300578327, 301816769, 302854023, 303693485, 304380836, 304982300, 305555134, 306126652, 306697540, 307265244, 307852688, 308519592, 309345093, 310387726, 311647816, 313053627, 314483967, 315814877, 316965275, 317917480, 318705387, 319380226, 319978333, 320507927, 320958328, 321321678, 321608658, 321847916]
2191C21847916K23045K21558K07977J60828P6446k8114j22605j78222j79596j32828
2201C22096405o3133m769J3657j8349q7661j63231k10915k10342j65100j00708n0507
2212C21035347l6621n8327r2888j08566q3199j6593O9847J43509J78451J65444J14631
2223C21311035M6845j7434o8321j06544j38550j67618j88331j87417j50566p2288L8376
2234C20299187J59187K63290L30582L56445L51410L34168L19824L12843L06511K90337
2244C23323784K58636K14882J68000J25427Q6670M3564j2970q4382j60369k22321k52724
2255C23488197k44713k05535j52703j05400p4997o2179n8480n4283m4479l3608l2196
2266C22419624n1002r2163j45836j92375k13433k03514j75438j54571j61553j94587
$$ y = [321847916, 322070961, 322292519, 322500496, 322661324, 322737770, 322709656, 322587051, 322408829, 322229233, 322096405, 322033272, 322028503, 322042160, 322023811, 321936150, 321772919, 321562004, 321351662, 321186562, 321085854, 321035347, 320998726, 320940399, 320847511, 320738945, 320655746, 320639153, 320709000, 320852509, 321030960, 321196404, 321311035, 321357880, 321340446, 321272125, 321165581, 321027031, 320859413, 320671082, 320483665, 320333099, 320260811, 320299187, 320458374, 320721664, 321052246, 321408691, 321760101, 322094269, 322414093, 322726936, 323033447, 323323784, 323582420, 323797302, 323965302, 324090729, 324177399, 324220963, 324207993, 324123611, 323963242, 323740921, 323488197, 323243484, 323037949, 322885246, 322779846, 322704849, 322642670, 322584190, 322529907, 322485428, 322451820, 322419624, 322368622, 322276459, 322130623, 321938248, 321724815, 321521301, 321345863, 321191292, 321029739, 320835152]
2276C20835152k23923k05040j05667O9542K71873M28162M76951L99933K31629M1122
2286C22219734j03073j62353j39847o8054J2016O9771R1285P7057L6316j5602n8517
2297C21958733p1068l9482L4256J29089K13661K58217K47345J81236P1221o5270k04811
2308C22713127l12958l44505k58369m3145K56539N39207O77910N79071K38648k37236
2318C23808289o68259q80661p96929m84542j31531M4212q7852m95796r94263j342125
2328C17970543j376114j105213p04632m12750l90797o38485j019592j380615j674652
2337C09267693j991520k455864l056145l530827l424034k315635j09635K798290N602150
2346C00784473P402974P605037O179867L657913Q61740j463432k926292l548279l620052
$$ y = [320835152, 320611229, 320406189, 320300522, 320370064, 320641937, 321070099, 321547050, 321946983, 322178612, 322219734, 322116661, 321954308, 321814461, 321746407, 321758423, 321828194, 321919479, 321996536, 322032852, 322017250, 321958733, 321887665, 321848183, 321882439, 322011528, 322225189, 322483406, 322730751, 322911987, 322983208, 322917938, 322713127, 322400169, 322055664, 321797295, 321754150, 322010689, 322549896, 323227806, 323806877, 324045525, 323808289, 323140030, 322259369, 321462440, 320977898, 320846367, 320890579, 320802727, 320306931, 319312668, 317970543, 316594429, 315489216, 314784584, 314371834, 313981037, 313342552, 312322960, 310942345, 309267693, 307276173, 304820309, 301764164, 298233337, 294809303, 292493668, 292384033, 295182323, 300784473, 308187447, 315792484, 321972351, 325630264, 326492004, 325028572, 322102280, 318554001, 314933949]
2355C14933949l473607l313331l177128l009071k759705k440567k110977j829834j616726
2364B91203003j452675j305523j155052r97086q31279o48671m34303j80034J06182
2373B84304562M02908O90079R59797J213836J450329J652184J789245J835270J786461
2382B96084671J666031J512775J358681J215076J074696R27105P73277O29292N15804
2391C05757408M42658M01764L71990L32527K75154K06585J42326R6608P5550P7266
2401C08179836R4986J21060J47800J67446J70899J49288R7980J8940p7934j76144k57835
2412C08636322l07484l17726k91252k40059j81694j33095j06411j04808j24569j57109
2422C06672115j91841k18620k28901k16560j80626j26229o4640r460K8572M6558M9782
$$ y = [314933949, 311460342, 308147011, 304969883, 301960812, 299201107, 296760540, 294649563, 292819729, 291203003, 289750328, 288444805, 287289753, 286292667, 285461388, 284812717, 284378414, 284198380, 284304562, 284707470, 285397549, 286357346, 287571182, 289021511, 290673695, 292462940, 294298210, 296084671, 297750702, 299263477, 300622158, 301837234, 302911930, 303839035, 304612312, 305241604, 305757408, 306200066, 306601830, 306973820, 307306347, 307581501, 307788086, 307930412, 308027020, 308102570, 308179836, 308274822, 308395882, 308543682, 308711128, 308882027, 309031315, 309129295, 309148235, 309070301, 308894157, 308636322, 308328838, 308011112, 307719860, 307479801, 307298107, 307165012, 307058601, 306953793, 306829224, 306672115, 306480274, 306261654, 306032753, 305816193, 305635567, 305509338, 305444698, 305435238, 305463810, 305510368, 305560150]
2433C05560150M7856M8027N0697M9534L5457M025m1809r2926j39599j76640k05993
2444C05138779k32869k59780k82441k89783k70100k19268j45264o6910o332K1095J2817
2455C03399944k0733o2484r6646j15165j18332j12210j03702r8000r7980j04943j20105
2466C02349644j43128j72424k03419k30636k49253k56023k50988k35939k13833j89838
2476C00204163j69297j58500j60618j73168j87474j91288j75953j42746j05781q5945
2486B98653393j00594j51596k22187k82364l03993k75574k08702j32160p6218n6095
2496B96843910o6128q4781r0828p7419n6382m9972p5779j33324k03152k56881k73342
2507B95475922k50492k05746j65062j47762j55278j71432j72711j42479q2492j3275
$$ y = [305560150, 305608006, 305656033, 305706730, 305756264, 305791721, 305795746, 305753937, 305661011, 305521412, 305344772, 305138779, 304905910, 304646130, 304363689, 304073906, 303803806, 303584538, 303439274, 303372364, 303366032, 303387127, 303399944, 303379211, 303316727, 303220081, 303104916, 302986584, 302874374, 302770672, 302672672, 302574692, 302469749, 302349644, 302206516, 302034092, 301830673, 301600037, 301350784, 301094761, 300843773, 300607834, 300394001, 300204163, 300034866, 299876366, 299715748, 299542580, 299355106, 299163818, 298987865, 298845119, 298739338, 298653393, 298552799, 298401203, 298179016, 297896652, 297592659, 297317085, 297108383, 296976223, 296900005, 296843910, 296777782, 296693001, 296602173, 296524754, 296468372, 296418400, 296342621, 296209297, 296006145, 295749264, 295475922, 295225430, 295019684, 294854622, 294706860, 294551582, 294380150, 294207439, 294064960, 293982468, 293969193]
2517B93969193L5572M0016m692q1349j57470k01054j95007j44024p0095K67M8523P0457
2529B93310337P2479O3706M8198K5521n074l8337o2542o6643m7779j5431J3352K3727
2541B93321514J1749j4324m0703n7735o4220o5098o4411o0006m4956j4801K6035O2752
2553B92995796P8373O3439K2163l0117p6408j08548j30329j53694j87874k31972k72674
2564B91968155k90775k72046k15473j35479n7468o199L853k5196p6161j25427j53904
2575B90613880j56116j41163j26019j23615j34430j44367j33209q7624j2588O8569
2585B89623318J23367J26324P2117k1611j23233k01607k39926k38952k10800j68477
2595B88740520j18389o1092J259N7525Q8253P4959J3905p5627j56688j91803j63975
$$ y = [293969193, 294004765, 294044781, 294040089, 293958740, 293801270, 293600216, 293405209, 293261185, 293191090, 293191357, 293239880, 293310337, 293382816, 293446522, 293494720, 293520241, 293515167, 293476830, 293414288, 293347645, 293299866, 293284435, 293297787, 293321514, 293333263, 293318939, 293278236, 293220501, 293156281, 293091183, 293026772, 292966766, 292921810, 292907009, 292933044, 292995796, 293074169, 293137608, 293159771, 293129654, 293053246, 292944698, 292814369, 292660675, 292472801, 292240829, 291968155, 291677380, 291405334, 291189861, 291054382, 290996914, 290990715, 290994568, 290969372, 290893211, 290767784, 290613880, 290457764, 290316601, 290190582, 290066967, 289932537, 289788170, 289654961, 289567337, 289554749, 289623318, 289746685, 289873009, 289945126, 289923515, 289800282, 289598675, 289358749, 289119797, 288908997, 288740520, 288622131, 288561039, 288562298, 288619823, 288708076, 288783035, 288796940, 288721313, 288564625, 288372822, 288208847]
2606B88208847q7547j831M9743M3698j1235q0795j25866j24931q4419l1643L738P973
2618B87765732j1578l4542m4079l8624l2386m4270q4133j43833k02274k36111k33708
2629B86660194k00481j55220j18713j04313j12171j32561j52169j59702j49231j19610
2639B85256023p4043k0733K7466N4970M8179L720o7387j41754j92432k01569j67923
2650B84524517j07555m5090j698J2970K957j9760m2115n5713n8518n3119m4766m0283
2662B84071827m6310o6681j00308j39770j72272j86329j76048j45722j06868p3948
2672B82857571n6935n9051p6599j01834j26171j41334j40648j20964q4858m2038q469
2683B81898670J72k5387q1902j53427k17476k54097k53295k18888j64890j08929o5269
$$ y = [288208847, 288121300, 288119469, 288169212, 288212910, 288201675, 288120880, 287995014, 287870083, 287785664, 287754021, 287757759, 287765732, 287754154, 287719612, 287675533, 287636909, 287604523, 287560253, 287476120, 287332287, 287130013, 286893902, 286660194, 286459713, 286304493, 286185780, 286081467, 285969296, 285836735, 285684566, 285524864, 285375633, 285256023, 285181980, 285161247, 285188713, 285243683, 285291862, 285295582, 285228195, 285086441, 284894009, 284692440, 284524517, 284416962, 284371872, 284370174, 284383144, 284386101, 284366341, 284324226, 284268513, 284209995, 284156876, 284112110, 284071827, 284025517, 283958836, 283858528, 283718758, 283546486, 283360157, 283184109, 283038387, 282931519, 282857571, 282800636, 282741585, 282664986, 282563152, 282436981, 282295647, 282154999, 282034035, 281949177, 281907139, 281898670, 281898842, 281873455, 281791553, 281638126, 281420650, 281166553, 280913258, 280694370, 280529480, 280420551, 280355282]
2694B80355282l9406k8439k5425k3765k1534k1782k8820m3755o1779p5073p7495p0782
2706B79837227o5003p3223j02367j46351j86729k01455j78375j22890n7869j2551q277
2717B78682137m7417j12438j73283k01778j82953j21632m0512K8381N5828K6741n2890
2728B77860184j57700k52437l06283l06358k61021j95293j36070j00632r0351r6302
2738B75957737j08757j24321j45569j73473j99337k05612j75057j04351j2302O5078
2748B74774036R1687N0678m4403j55125k36969k61364k28824j66264j11866r5692j26552
2759B73489342j90563k59896l06225l11145k72007k01397j22757o2580m2134o9637
2769B71651001j35403k14233k75421k96688k75746k32715j99395k01931k45056l07884
$$ y = [280355282, 280315876, 280287437, 280262012, 280238247, 280216713, 280194931, 280166111, 280122356, 280060577, 279985504, 279908009, 279837227, 279772224, 279699001, 279596634, 279450283, 279263554, 279062099, 278883724, 278760834, 278702965, 278690414, 278682137, 278634720, 278522282, 278348999, 278147221, 277964268, 277842636, 277802124, 277830505, 277886333, 277913074, 277860184, 277702484, 277450047, 277143764, 276837406, 276576385, 276381092, 276245022, 276144390, 276054039, 275957737, 275848980, 275724659, 275579090, 275405617, 275206280, 275000668, 274825611, 274721260, 274708958, 274774036, 274865723, 274916401, 274871998, 274716873, 274479904, 274218540, 273989716, 273823452, 273711586, 273615894, 273489342, 273298779, 273038883, 272732658, 272421513, 272149506, 271948109, 271825352, 271762772, 271720638, 271651001, 271515598, 271301365, 271025944, 270729256, 270453510, 270220795, 270021400, 269819469, 269574413, 269266529]
2779B69266529l54538l54347k98843k07215j16100o0234n5332r3518j50451k00997
2789B67374954k30446k37789k28977k09274j79215j37138q6117l5839j087Q011q641
2800B66028442l9482o9809q9340r8133j03989j13906j28174j39828j41602j33266j23158
2811B64847755j22299j34353j49117j46980j11675m3221L7632R8095J10760O9065r766
2822B64445896r4166j54800j79596j74541j57319j44920j45054j56250j72176j87264
2832B62879810j99051k06909k10132k08340k02961j98078j98460k06623k18963k27356
2842B60802937k23313k04391j76144j51424j43338j59988k00272k54364l05996l37257
2852B58646450l33748k90489k16618j35460p7438o8111j14918k02217k97337l67603
$$ y = [269266529, 268911991, 268557644, 268258801, 268051586, 267935486, 267875252, 267819920, 267726402, 267575951, 267374954, 267144508, 266906719, 266677742, 266468468, 266289253, 266152115, 266065998, 266030159, 266029072, 266037083, 266028442, 265988960, 265919151, 265829811, 265731678, 265627689, 265513783, 265385609, 265245781, 265104179, 264970913, 264847755, 264725456, 264591103, 264441986, 264295006, 264183331, 264140110, 264177742, 264275837, 264386597, 264455662, 264445896, 264351730, 264196930, 264017334, 263842793, 263685474, 263540554, 263395500, 263239250, 263067074, 262879810, 262680759, 262473850, 262263718, 262055378, 261852417, 261654339, 261455879, 261249256, 261030293, 260802937, 260579624, 260375233, 260199089, 260047665, 259904327, 259744339, 259544067, 259289703, 258983707, 258646450, 258312702, 258022213, 257805595, 257670135, 257592697, 257524586, 257409668, 257207451, 256910114, 256542511]
2862B56542511l96347l90797l75328l75652m03404m50955m98047n24253n18075m77542
2872B52132111m03939k96268j51615K7122K24552M10843N51491O19926O08273N29957
2882B54252453M12159K84805J71547Q5468K9698m58j4706k5081m2038p0687j08814
2893B54974346j49002j84135k12880k41222k77462l24860l76930m18834m35925m22401
2903B51930695l86658l46985l22361l23067l46050l77979m02661m08420l93124l63979
2913B48259411l35331l24268l45154m04187m93602n89409o53877o46668n39245l29781
2923B43597889m9019K45953M89349O30951O53763N80005M59233L46432K79121K64988
2933B47498665K85091L09582L15704K98138K67086K36549K12918J90696J58883J12190
$$ y = [256542511, 256146164, 255755367, 255380039, 255004387, 254600983, 254150028, 253651981, 253127728, 252609653, 252132111, 251728172, 251431904, 251280289, 251307411, 251531963, 251942806, 252494297, 253114223, 253722496, 254252453, 254664612, 254949417, 255120964, 255206432, 255236130, 255235672, 255220966, 255195885, 255153847, 255083160, 254974346, 254825344, 254641209, 254428329, 254187107, 253909645, 253584785, 253207855, 252789021, 252353096, 251930695, 251544037, 251197052, 250874691, 250551624, 250205574, 249827595, 249424934, 249016514, 248623390, 248259411, 247924080, 247599812, 247254658, 246850471, 246356869, 245767460, 245113583, 244466915, 243927670, 243597889, 243548870, 243794823, 244284172, 244915123, 245568886, 246148891, 246608124, 246954556, 247233677, 247498665, 247783756, 248093338, 248409042, 248707180, 248974266, 249210815, 249423733, 249614429, 249773312, 249885502]
2943B49885502N8250J5126P24K0829O3743J06354J25942J12324P1087J7471l3951p7762
2955B50365639j19095j66264k22988k82593l29609l46221l20683k51656j49765l3760
2965B48143005P3643J51043J82209J61018R4662M540p7477j19591j01928k6589Q0929
2976B48565464J81675K39277K36511J81809J03874L5858j583q125j050k555k5044o4754
2988B49441357j04523j25942j20564r6187p3471p5188j15070j89782k80742l61748
2998B47898140m10900m18987l92456l47443l01399k64168k36225k13356j93062j79939
3008B44940205j83792k11926k62966l25241l83606m30355m71287n23186o03828p19681
3018B40824337q61053j006470j132984j224842j274033j275082j218776j092682q88520
$$ y = [249885502, 249943752, 249958878, 249959602, 249980431, 250044174, 250150528, 250276470, 250388794, 250459881, 250477352, 250443401, 250365639, 250246544, 250080280, 249857292, 249574699, 249245090, 248898869, 248578186, 248326530, 248176765, 248143005, 248216648, 248367691, 248549900, 248710918, 248805580, 248810120, 248732643, 248613052, 248511124, 248484535, 248565464, 248747139, 248986416, 249222927, 249404736, 249508610, 249544468, 249542885, 249534760, 249533710, 249531155, 249506111, 249441357, 249336834, 249210892, 249090328, 248994141, 248920670, 248845482, 248730412, 248540630, 248259888, 247898140, 247487240, 247068253, 246675797, 246328354, 246026955, 245762787, 245526562, 245313206, 245120144, 244940205, 244756413, 244544487, 244281521, 243956280, 243572674, 243142319, 242671032, 242147846, 241544018, 240824337, 239963284, 238956814, 237823830, 236598988, 235324955, 234049873, 232831097, 231738415, 230849895]
3027B30849895o12506k90184L8204L28827N47123O73828P05604O51188N29156L66783
3037B33787918J97849N5352l9196q5030j01891j18579j54725k07862k53964k61230
3047B32818642k10533j07518J8730J32084K07081K39849K44370K40917K41795K47154
3057B34072571K49042K41242K26764K18106K30808K74239L46050M32091N12790N71575
3067B37375278O01960O08444O02875N95741N88531N70870N25265M37164L05843J48335
3077B42360306o047j27906j99585k20471k00805j52455q0833J2989J24340K36950L24154
3088B42070637L61252L40557K79026K10666J66035J53389J52893J30367O2275m5585
3098B43881512j56536k23618k16751j41373l5000N4989R8267R6168P6161P0476R4090
$$ y = [230849895, 230237389, 229947205, 229985409, 230314236, 230861359, 231535187, 232240791, 232891979, 233421135, 233787918, 233985767, 234041119, 234001923, 233916893, 233815002, 233696423, 233541698, 233333836, 233079872, 232818642, 232608109, 232500591, 232519321, 232651405, 232858486, 233098335, 233342705, 233583622, 233825417, 234072571, 234321613, 234562855, 234789619, 235007725, 235238533, 235512772, 235858822, 236290913, 236803703, 237375278, 237977238, 238585682, 239188557, 239784298, 240372829, 240943699, 241468964, 241906128, 242211971, 242360306, 242354259, 242226353, 242026768, 241806297, 241605492, 241453037, 241372204, 241385193, 241509533, 241746483, 242070637, 242431889, 242772446, 243051472, 243262138, 243428173, 243581562, 243734455, 243864822, 243927097, 243881512, 243724976, 243501358, 243284607, 243143234, 243108234, 243163223, 243261490, 243357658, 243433819, 243504295, 243598385]
3109B43598385J34697J61876J46943Q1119j9073j21117j94855k26955k25411k10094
3119B43125515j99184j97773j97125j83487j49708j03035o2122m6883o6242j12743
3129B41807213j66092k05498k19726k12880j98211j89057j89933j95866j97601j90812
3139B39841537j79901j75495j88446k22130k70137l19729l57151l73459l66612l40786
3149B37047691l04756k69203k44942k39963k57530k93637l38154l77407l97873l91578
3159B33932648l58563l08323k58083k28882k37732k90146l74469m63295n23434n30396
3169B30359325m81071l96175l11509k59933k57225k96230l54538m08383m45041m64936
3179B26684284m76970m88301m99744n05963n01575m85382m62036m39625m25968m26941
$$ y = [243598385, 243733082, 243894958, 244041901, 244123020, 244103947, 243982830, 243787975, 243561020, 243335609, 243125515, 242926331, 242728558, 242531433, 242347946, 242198238, 242095203, 242033081, 241986198, 241919956, 241807213, 241641121, 241435623, 241215897, 241003017, 240804806, 240615749, 240425816, 240229950, 240032349, 239841537, 239661636, 239486141, 239297695, 239075565, 238805428, 238485699, 238128548, 237755089, 237388477, 237047691, 236742935, 236473732, 236228790, 235988827, 235731297, 235437660, 235099506, 234722099, 234324226, 233932648, 233574085, 233265762, 233007679, 232778797, 232541065, 232250919, 231876450, 231413155, 230889721, 230359325, 229878254, 229482079, 229170570, 228910637, 228653412, 228357182, 228002644, 227594261, 227149220, 226684284, 226207314, 225719013, 225219269, 224713306, 224211731, 223726349, 223264313, 222824688, 222398720, 221971779]
3189B21971779m45366m81129n29499n80959o22616o44932o46381o36635o30894o39896
3199B16113472o61793o81724o80847o50692o01159n57575n46970n81608o51455p29961
3209B09769688p89070q14724q13351q04577q07915q31241q68225r04980r30481r42574
3219B01262550r47227r51710r58023r61590r55696r38244r16195r04026r16824r62486
3229A91850529j035672j118412j186714j219730j209011j161995j100597j052037j038341
3238A81728020j067715j131515j208554j275425j315613j326561j317710j305275j303559
3247A70476093j319618j351509j390915j426887j449814j453553j436328j400938j354781
3256A57891750j308117j272363j256018j262207j288185j326056j366567j402378j430664
$$ y = [221971779, 221526413, 221045284, 220515785, 219934826, 219312210, 218667278, 218020897, 217384262, 216753368, 216113472, 215451679, 214769955, 214089108, 213438416, 212837257, 212279682, 211732712, 211151104, 210499649, 209769688, 208980618, 208165894, 207352543, 206547966, 205740051, 204908810, 204040585, 203135605, 202205124, 201262550, 200315323, 199363613, 198405590, 197444000, 196488304, 195550060, 194633865, 193729839, 192813015, 191850529, 190814857, 189696445, 188509731, 187290001, 186080990, 184918995, 183818398, 182766361, 181728020, 180660305, 179528790, 178320236, 177044811, 175729198, 174402637, 173084927, 171779652, 170476093, 169156475, 167804966, 166414051, 164987164, 163537350, 162083797, 160647469, 159246531, 157891750, 156583633, 155311270, 154055252, 152793045, 151504860, 150178804, 148812237, 147409859, 145979195]
3265A45979195j452103j468859j481027j483355j466017j416998j327352j194754j024313
3274A33664417q24585o01787l54471p4549K47249O12412J009302J414347J800394K147150
3284A39039879K447433K706175K931967L128796L291158L407707L467341L466587L410912
3293A67297955L312892L186741L045845K900982K760392K628631K504482K380314K244892
3302A92263126K089463J914444J731453J559028J414147J303043J219044J145954J067543
3311B05707245R74541Q68797P59964O59904N77526N15576M72278M42353M20723M03042
3321B11801949L86505L69262L49656L24974K92644K51255K02179J50318J01738N9567
3331B14290047K0866k2297p8411j48525k22550k81581l07961k95315k54726k09656
$$ y = [145979195, 144527092, 143058233, 141577206, 140093851, 138627834, 137210836, 135883484, 134688730, 133664417, 132839832, 132238045, 131883574, 131809025, 132056274, 132668686, 133677988, 135092335, 136892729, 139039879, 141487312, 144193487, 147125454, 150254250, 153545408, 156953115, 160420456, 163887043, 167297955, 170610847, 173797588, 176843433, 179744415, 182504807, 185133438, 187637920, 190018234, 192263126, 194352589, 196267033, 197998486, 199557514, 200971661, 202274704, 203493748, 204639702, 205707245, 206681786, 207550583, 208310547, 208970451, 209547977, 210063553, 210535831, 210978184, 211398907, 211801949, 212188454, 212557716, 212907372, 213232346, 213524990, 213776245, 213978424, 214128742, 214230480, 214290047, 214310913, 214288616, 214210205, 214061680, 213839130, 213557549, 213249588, 212954273, 212699547, 212489891]
3341B12489891j84441j92508k31114k85759l39946l82996m12750m29898m33273m18815
3351B09178391l84522l35598k87094k57855k61058k96708l51791m07123m48132m70085
3361B05678425m78840m83608m91391n03520n16587n26027n27459n18150m97513m67605
3371B00667725m34971m09088l99208m08497m31099m53758m62819m52213m26159l96213
3381A96393700l72773l59668l52745l45135l32832l17669l03345k92053k81220k66495
3391A93169765k47612k31285k28500k48089k90241l44372l95279m29916m42314m33159
3401A89878998m06666l66802l18375k68268k25983j99833j91574j92871j89495j70288
3411A87348843j36071j01432q6823j06087j57222k21425k72502k89269k63500k01512
$$ y = [212489891, 212305450, 212112942, 211881828, 211596069, 211256123, 210873127, 210460377, 210030479, 209597206, 209178391, 208793869, 208458271, 208171177, 207913322, 207652264, 207355556, 207003765, 206596642, 206148510, 205678425, 205199585, 204715977, 204224586, 203721066, 203204479, 202678452, 202150993, 201632843, 201135330, 200667725, 200232754, 199823666, 199424458, 199015961, 198584862, 198131104, 197668285, 197216072, 196789913, 196393700, 196020927, 195661259, 195308514, 194963379, 194630547, 194312878, 194009533, 193717480, 193436260, 193169765, 192922153, 192690868, 192462368, 192214279, 191924038, 191579666, 191184387, 190754471, 190312157, 189878998, 189472332, 189105530, 188787155, 188518887, 188292904, 188093071, 187901497, 187708626, 187519131, 187348843, 187212772, 187111340, 187024517, 186918430, 186761208, 186539783, 186267281, 185978012, 185714512, 185513000]
3421A85513000j18103l0803M4575R5424J13678R8953O1455K1343J660J6956O4793J24759
3433A86007690J67103J68228J21003L8356n5580j36509j89342k09179j97582j57223
3443A85556965r0752m921Q6766J62887K02999J96591J51882R3193N0907M5967P9498
3454A86531982J31989J74179J83067J53962J02481N6305M0207O3687J17397J78699
3464A87733955K23809K38514K23865J93844J67484J60542J77631K11487K45285K59075
3474A89835491K38533J81160R8915J5297m3373n8498k6188M1199J20792J89075K29683
3485A90822086K37542K17418J80264J41258J16177J19686J59015K27528L02353L49254
3495A92872581L38822K62852J43261K5157m6272m8942K651O8264J06964J03359P6237
$$ y = [185513000, 185394897, 185364094, 185408669, 185504093, 185617771, 185716724, 185778179, 185799522, 185801182, 185818138, 185882931, 186007690, 186174793, 186343021, 186464024, 186502380, 186446800, 186310291, 186120949, 185911770, 185714188, 185556965, 185466213, 185461292, 185548058, 185710945, 185913944, 186110535, 186262417, 186355610, 186406517, 186452484, 186531982, 186663971, 186838150, 187021217, 187175179, 187277660, 187333965, 187374172, 187437859, 187555256, 187733955, 187957764, 188196278, 188420143, 188613987, 188781471, 188942013, 189119644, 189331131, 189576416, 189835491, 190074024, 190255184, 190354099, 190369396, 190326023, 190267525, 190241337, 190282536, 190403328, 190592403, 190822086, 191059628, 191277046, 191457310, 191598568, 191714745, 191834431, 191993446, 192220974, 192523327, 192872581, 193211403, 193474255, 193617516, 193642673, 193596401, 193547459, 193550110, 193618374, 193725338, 193828697, 193904934]
3506A93904934O4526R9029J80740K79580L54042L79581L63159L35427L26614L42178
3516A96629810L57685L36056K54517J24531j1177j00403j09597l9234Q0147K06432
3526A97728767L05481L61557L75214L55339L16010K75688K59247K90794L79352N03941
3536B01151390O11420O34956N29080L01075J9111k13528l08704k38972n1193J60618
3546B02595253L10612L66878L62358L62416M14657N16186O21567O82964O90937O79169
3556B07602997O88343P14474O87847N08365J20030m22840r51081j252536j180954p38793
3566B05775852p8811N71403J019688J184406J103096Q83560O41098M62132L98540M73480
3576B12434444O73085R27753J108456J068287P20825J14174n59597j039238j125565
$$ y = [193904934, 193969460, 194068489, 194249229, 194528809, 194882851, 195262432, 195625591, 195961018, 196287632, 196629810, 196987495, 197323551, 197578068, 197702599, 197691422, 197591019, 197481422, 197442188, 197522335, 197728767, 198034248, 198395805, 198771019, 199126358, 199442368, 199718056, 199977303, 200268097, 200647449, 201151390, 201762810, 202397766, 202926846, 203227921, 203247032, 203033504, 202724800, 202485828, 202434635, 202595253, 202905865, 203272743, 203635101, 203997517, 204412174, 204928360, 205549927, 206232891, 206923828, 207602997, 208291340, 209005814, 209693661, 210202026, 210322056, 209899216, 208948135, 207695599, 206514645, 205775852, 205697041, 206268444, 207288132, 208472538, 209575634, 210459194, 211100292, 211562424, 211960964, 212434444, 213107529, 214035282, 215143738, 216212025, 216932850, 217047024, 216487427, 215448189, 214322624]
3585B14322624p88955j88942M10442P78294Q23440O13403L07255N5580o3610m7016
3595B16222515P6122K83242N59864Q70590J134548J240158J099549P10163J77688l18470
3605B22055969o02245n77068k64454K10113O65055R22737Q63933M71630j41811p39803
3615B22864056j024475p55730J07136J321296K401944K810764K215881O92387j260529
3624B29372730k920456l669243l276329j987381l73477R63134J660500J706104J354904
3633B22830486R41716P15751P75299J094685J574402K059364K333775K149410J328449
3642B35803337r3689j786499l200016l798771l340950k028122m21848Q40397J361694
3651B23335533J151257N54771J6499j61877P3757N86033J180782J705075K057628K151814
$$ y = [214322624, 213533669, 213344727, 213755169, 214533463, 215356903, 215970306, 216277561, 216333141, 216269531, 216222515, 216298637, 216581879, 217141743, 218012333, 219146881, 220387039, 221486588, 222196751, 222374439, 222055969, 221453724, 220876656, 220612202, 220822315, 221487370, 222410107, 223274040, 223745670, 223603859, 222864056, 221839581, 221083851, 221190987, 222512283, 224914227, 227724991, 229940872, 230633259, 229372730, 226452274, 222783031, 219506702, 217519321, 217145844, 218108978, 219769478, 221475582, 222830486, 223772202, 224487953, 225263252, 226357937, 227932339, 229991703, 232325478, 234474888, 235803337, 235709648, 233923149, 230723133, 226924362, 223583412, 221555290, 221133442, 221973839, 223335533, 224486790, 225041561, 225058060, 224896183, 224969940, 225555973, 226736755, 228441830, 230499458, 232651272]
3661B32651272J905804J295814M26159m66347j114979j378822j341133j259804j389026
3670B29328938j788693k258186k446556k068329j081352K86827J664028K712326L241863
3679B27590866L209705K650013J623650K39048j287899k617970l373260l300171k410087
3688B22323895j002198M61598J557331K060413J986084J510429Q50297J83620l57094
3697B29574375o56452o14471j99509M77810J144352J446724J118259J42651j189156
3706B31244583k379494k940940k621365j517944k5158J349144K199192K362728J933727
3715B29604473J166802L42369l34359p64026r27010q41121n36023o0787M94137R85012
3725B29129467J232014J070537M25930o15902j779995k650928k811146k034359m46892
$$ y = [232651272, 234557076, 235852890, 236279049, 235812702, 234697723, 233318901, 231977768, 230717964, 229328938, 227540245, 225282059, 222835503, 220767174, 219685822, 219972649, 221636677, 224349003, 227590866, 230800571, 233450584, 235074234, 235313282, 234025383, 231407413, 228034153, 224733982, 222323895, 221321697, 221783295, 223340626, 225401039, 227387123, 228897552, 229747849, 229931469, 229574375, 228917923, 228303452, 228103943, 228581753, 229726105, 231172829, 232291088, 232433739, 231244583, 228865089, 225924149, 223302784, 221784840, 221759682, 223108826, 225308018, 227670746, 229604473, 230771275, 231113644, 230779285, 230015259, 229088249, 228247128, 227711105, 227650318, 228144455, 229129467, 230361481, 231432018, 231857948, 231242046, 229462051, 226811123, 223999977, 221965618, 221518726]
3734B21518726J445866K925282L374023K590656R22909q84094k066441k244053j607780
3743B25975094p72934l82900p06387j481991k102451k017326j090146L14656J559353
3752B19294968K116108J858215J089477L18318n4112O1989M55322P90387Q16383M81739
3762B27228794q4381o72092j090851j221791j024818n36480J27754P81307J209622
3771B24717064J251392Q82454K44961m07658q29620r00822o74324l28541n3997N3750
3781B23954659L2596O580R0313L09029N85728P99656Q72573Q19474P27691O77586O63967
3792B29539852N81188K93656k52037r53656j581363j902085j821231j441269r89266
3801B21473789o55899m60548k44332J95141R19609J750164K338219K366123J748619
$$ y = [221518726, 222964592, 225889874, 229263897, 231854553, 232777462, 231893368, 229826927, 227582874, 225975094, 225202160, 224819260, 224112873, 222630882, 220528431, 218511105, 217420959, 217735615, 219294968, 221411076, 223269291, 224358768, 224677086, 224622974, 224684963, 225140285, 225930672, 226747055, 227228794, 227144413, 226472321, 225381470, 224159679, 223134861, 222598381, 222726135, 223507442, 224717064, 225968456, 226850910, 227095871, 226688213, 225858593, 224957771, 224283447, 223954906, 223900909, 223954659, 223987255, 223993835, 224084148, 224393177, 224978905, 225778561, 226651134, 227470608, 228198299, 228875885, 229539852, 230121040, 230414696, 230162659, 229209003, 227627640, 225725555, 223904324, 222463055, 221473789, 220817890, 220357342, 220113010, 220308151, 221227760, 222977924, 225316143, 227682266, 229430885]
3810B29430885O94790m11205j230526j639538j743984j739349j735383j671371j383572
3819B18570747p63282J15871J001129J595764J733475J473064J050320P21531O02169
3828B26100788O02589M99515R3460o44893j531296k250500k519569k234993j518536
3837B16596565o32171J82857Q45528J453705K162227K990971L696079L819943K922821
3846B34038525Q88595j887550m568024o199894o149711m413643j635056J186199L136559
3855B14396000L760204L180561J945343P05586q9550l42198k56996j58558k89306o86818
3865B22164268j185855j524220j487903j022301k60258N42088J124782J335697J180344
3874B20866642P90157L37391m8256l16639m76646n50594n45159m60129l18317j79386
$$ y = [229430885, 230125675, 229714470, 228483944, 226844406, 225100422, 223361073, 221625690, 219954319, 218570747, 217807465, 217923336, 218924465, 220520229, 222253704, 223726768, 224777088, 225498619, 226100788, 226703377, 227202892, 227296352, 226651459, 225120163, 222869663, 220350094, 218115101, 216596565, 215964394, 216147251, 216992779, 218446484, 220608711, 223599682, 227295761, 231115704, 234038525, 234927120, 233039570, 228471546, 222271652, 216121941, 211708298, 210073242, 211259441, 214396000, 218156204, 221336765, 223282108, 223987694, 223898144, 223555946, 223298950, 223140392, 222851086, 222164268, 220978413, 219454193, 217966290, 216943989, 216683731, 217225819, 218350601, 219686298, 220866642, 221656799, 221994190, 221945934, 221629295, 221152649, 220602055, 220056896, 219596767, 219278450, 219099064]
3884B19099064j13220j46103k20585k11449J793M45061J003208J453877J567649J220894
3894B24100189M58775n20897j449394k086773k294407k058354j470604o87141J16787
3903B14108181P86743J219158J379662J300125J055775P30266L85399N2185k54421
3912B20763073n13706o87714p35226o39648m32014j85490J6632J23157J36261R8668
3922B17943993N5408J8368l7365j43604k96841m39186m81243l56674p1469K84844N79223
3933B17055454P00703O13136L65677N9357k05002l66364m14886l78170k99549k19231
3943B16911125j63135j37120j26266j03817m9019L4447J14879J50986J22452M9419
3953B16803951j8882m0322j3485J9875R804n7221j41163j77669j29948k2716P3413
$$ y = [219099064, 218985844, 218839741, 218619156, 218407707, 218409500, 218854561, 219857769, 221311646, 222879295, 224100189, 224558964, 224038067, 222588673, 220501900, 218207493, 216149139, 214678535, 213991394, 214108181, 214894924, 216114082, 217493744, 218793869, 219849644, 220579910, 220965309, 221017494, 220763073, 220249367, 219561653, 218826427, 218186779, 217754765, 217569275, 217585907, 217709064, 217845325, 217943993, 217999401, 218017769, 217980404, 217836800, 217539959, 217100773, 216619530, 216262856, 216191387, 216476231, 217055454, 217756157, 218369293, 218734970, 218794327, 218589325, 218222961, 217808075, 217429905, 217130356, 216911125, 216747990, 216610870, 216484604, 216380787, 216331768, 216366215, 216481094, 216632080, 216754532, 216803951, 216785069, 216744747, 216731262, 216751137, 216760941, 216703720, 216562557, 216384888, 216254940, 216232224, 216305637]
3964B16305637R3899K6264q7204j89895k55623k95563l26710l36895k88810j66970
3974B14478130j9569N6076j2302j94817l59535l67604j95350K6150J06334l9921l01132
3985B13176460m54235l73554j85280j98574o22311j292610j694412j372147m96883
3994B06486454j39160j903114o988030j5199661k4590893l2098265
4000A25567331
$$ y = [216305637, 216399536, 216425800, 216338596, 216148701, 215893078, 215597515, 215270805, 214933910, 214645100, 214478130, 214458561, 214514637, 214502335, 214307518, 213947983, 213580379, 213385029, 213411179, 213517513, 213477592, 213176460, 212722225, 212348671, 212163391, 211964817, 211342506, 210049896, 208355484, 206983337, 206486454, 206347294, 204444180, 197456150, 182256489, 157665596, 125567331]
##END=$$ End of the data block
