##TITLE=LG 20% Recuperado + Samsung $$ Begin of the data block
##JCAMP-DX=5.00 $$ ACD/SpecManager v 10.08
##SPECTROMETER/DATA SYSTEM=Alpha
##DATE=02 Dec 2014 10:08:34
##DATA TYPE=INFRARED SPECTRUM
##DATA CLASS=XYDATA
##ORIGIN=
##OWNER=
##NPOINTS=1765
##FIRSTX=399.76428223
##LASTX=3997.64306641
##MAXX=3997.64306641
##MINX=399.76428223
##MAXY=0.81251770
##MINY=0.03884799
##XFACTOR=1.0000000000
##YFACTOR=1.000000000000000e-9
##FIRSTY=0.81128430
##DELTAX=2.03961372
##XUNITS=1/CM
##YUNITS=ARBITRARY UNITS
##XYDATA=(X++(Y..Y))
399.8H11284304j940728k198100j044273N95272J091182Q43704Q06331P14481R61065
418.1H11113238J065135L00348L8982j81437n56290n99921o11842p0810O63698M02391
438.5H11563492r1553m05908p97331r28998j116931j539529j488030j089811j470864
456.9H02634537k164602j944184j409889j091957r95516r20237n26309q1658q8394
475.2G93411791k25126j94014m3690K38061K41518k79963p42018o72996l77178o07729
495.6G90748656j222730j566291j906991k278745k486467l065646m192829n441845
511.9G68587112o460547p971823j0296703j2044489j2403429j1844277j0953247r926916
528.3F86685681r243190q960128q664429q285224p828176p361293o642640n110681
$$ y = [811284304, 809343576, 807145476, 806101203, 806696475, 807787657, 808631361, 809437692, 810152173, 811113238, 812178373, 812478721, 812517703, 812336266, 811779976, 811180055, 810568213, 810497403, 811161101, 811563492, 811471939, 811066031, 810268700, 809339702, 808222771, 806683242, 805195212, 804105401, 802634537, 800469935, 798525751, 797115862, 796023905, 795028389, 794108152, 793581843, 793500185, 793411791, 793186665, 792992651, 792948961, 793187022, 793428540, 793148577, 792406559, 791733563, 791356385, 790748656, 789525926, 787959635, 786052644, 783773899, 781287432, 778221786, 774028957, 768587112, 762126565, 754154742, 743858039, 731813550, 719410121, 707565844, 696612597, 686685681, 677442491, 668482363, 659817934, 651532710, 643704534, 636343241, 629700601, 624589920]
544.6F24589920k889693q25166Q83579K252281L009259L223777L055334K774537L041565
562.9F39115393L997147M934013N628526O167114O611884P265389P862270Q090913
579.3F89672649Q125484P817984P001578N671621M267752L154635K351761K031207
595.6G30094671K268732K982318L518343L070295J949906J089275N07355j19269p00235
613.9G44661391j804769l460169k422214K130032N205691M569948L067672K334118
630.2G54281700J836955J451135J136839O17326r0898o48498q81910r97663j039803
648.6G55665183j135051j383484j769661k364755l257513m247964m842698m707515
664.9G31956542o054283q318960o133497m929662n576849n785644o032705p248283
$$ y = [624589920, 621700227, 620875061, 621758640, 624010921, 627020180, 630243957, 633299291, 636073828, 639115393, 643112540, 648046553, 653675079, 659842193, 666454077, 673719466, 681581736, 689672649, 697798133, 705616117, 712617695, 718289316, 722557068, 725711703, 728063464, 730094671, 732363403, 735345721, 738864064, 741934359, 743884265, 744973540, 745480895, 745361626, 744661391, 742856622, 739396453, 736974239, 739104271, 744309962, 748879910, 751947582, 754281700, 756118655, 757569790, 758706629, 759323955, 759233057, 758584559, 757702649, 756704986, 755665183, 754530132, 753146648, 751376987, 749012232, 745754719, 741506755, 736664057, 731956542, 725902259, 717583299, 711449802, 706520140, 700943291, 695157647, 689124942, 681876659]
681.2F81876659r861350j4399171k2803545l9885818p3413611j21542036j52110696
695.5B47860432j28045962o6532339j4434141J6850189M5696668Q3348155J20897546
709.8C05640548J36708886J18331551P9044521M2534232J9685150P901132K260744
724.1G12106764q92520m037082q381069j4437675k1381974k6284993k6539326k3670137
740.4E86481988k2364139k5488854l1756460l8463384m4313461m8722327m9779087
754.7C25594276m4820368l2597303j4181480O871924K6631981M1986823N1077366N3711176
771D14274395N2007108M8828513M5359433M0890872L4837246K8054476K1783292J6510665
787.3G02546000J2272776R157657P033289N505919M321218L349960K552628J913428
$$ y = [681876659, 672015309, 657616138, 634812593, 594926775, 521513164, 399971128, 247860432, 119814470, 53282131, 38847990, 55698179, 101394847, 184743002, 305640548, 442349434, 560680985, 639725506, 682259738, 701944888, 709846020, 712106764, 711214244, 707177162, 698796093, 684358418, 662976444, 636691451, 610152125, 586481988, 564117849, 538628995, 506872535, 468409151, 424095690, 375373363, 325594276, 280773908, 248176605, 233995125, 240867049, 267499030, 309485853, 360563219, 414274395, 466281503, 515110016, 560469449, 601360321, 636197567, 664252043, 686035335, 702546000, 714818776, 723976433, 731009722, 736515641, 740836859, 744186819, 746739447, 748652875]
803.6G48652875J346529R75192Q39293P98940P75457O70135M98473L46482L13878M53413
824G55670667M36067N2631o00457j684725l441155n649150p342457p595957o236732
842.4G23608732l647566o03199K184868M331172N494237N521714M784227L720403K524256
860.7G47918844J518369R27925N32508Q3208l59416n49614m58122m49776o37293p70688
881.1G47755945q88527j177787j582683j983940k510667l380478m822313p466078j2239635
899.5G11703837j9714296k9209912l7375986l8038791k6739120o190717J5098691K9317915
915.8E98851621L3934832L1074822K4444878J7257929J1211693O727219L665566J569808
932.1G28738368l1472j328110k312005k996743l468990l930390m776776o438553r252727
$$ y = [748652875, 749999404, 750974596, 751813889, 752612829, 753388286, 754058421, 754556894, 754903376, 755217254, 755670667, 756106734, 756159365, 755558908, 753874183, 750433028, 744783878, 737441421, 729845464, 723608732, 719961166, 719357967, 721542835, 725874007, 731368244, 736889958, 741674185, 745394588, 747918844, 749437213, 750365138, 750897646, 750980854, 750621438, 750071824, 749613702, 749163926, 748526633, 747755945, 746867418, 745689631, 744106948, 742123008, 739612341, 736231863, 731409550, 723943472, 711703837, 691989541, 662779629, 625403643, 587364852, 560625732, 554435015, 569533706, 598851621, 632786453, 663861275, 688306153, 705564082, 716775775, 723502994, 727168560, 728738368, 728706896, 727378786, 725066781, 722070038, 718601048, 714670658, 709893882, 703455329, 694202602]
950.5F94202602j3635278k0269453k9657245m0533900m8289359m6331674l1508386
964.7D63977307q049667J5514553L2142907L8840771L6612868K9032946J9990206J2217044
981.1F40278935O694198K896965k81811l213883m368960j732946L616750O619752L329396
999.4F53838396k065837k029062J945019L526867K171695K64883j415610l133357n333126
1017.8F47769868q440315j3006509j8920600k2589982j6569614K091885K3779630L4229577
1034.1F28343940K9927969J8840730R074151L070534n5075j530588k167940k564788
1050.4F82938933l100752l918529m970312o118477p384300q793652r942889r833515
1066.7F28876507p303714k129376L904879Q171856R926081J0360598J0445059J0098934
$$ y = [694202602, 680567324, 660297871, 630640626, 590106726, 541817367, 495485693, 463977307, 455927640, 471442193, 503585100, 542425871, 579038739, 608071685, 628061891, 640278935, 646973133, 649870098, 649588287, 646374404, 642005444, 640272498, 643889248, 650509000, 653838396, 651772559, 649743497, 651688516, 655215383, 657387078, 657651961, 656236351, 653102994, 647769868, 639329553, 626323044, 607402444, 584812462, 568242848, 570334733, 594114363, 628343940, 658271909, 677112639, 686186790, 689257324, 689202249, 687671661, 685503721, 682938933, 679838181, 675919652, 670949340, 664830863, 657446563, 648652911, 638710022, 628876507, 621572793, 619443417, 623348296, 631520152, 641446233, 651806831, 662251890, 672350824]
1083F72350824R042203P484377N855620M465043L518403K927005K471864K112627J879871
1101.4G12107837J752794J545668J082122N10216J12712J24872Q81791K269149L435790
1119.8G23822951L783644L458499K792895K074480J482129R77457M95076O259m96447
1138.1G38396943j100481k006531l450930n912721j0172367j5959382j9572258j5676201
1154.4F64546072m399299O976068J1879444J0405123O629050L531337J594841K35796
1170.7G01398432j169502l439427p098913j0658205j0494887m878462K900064P777751
1187.1F74336851P656216M112304M1127k629102l477394k962589j839102p11083J25944
1205.4F74653172P54118J555443K555967L334283L641785L471851K824664J857281
$$ y = [672350824, 681393027, 688877404, 694733024, 699198067, 702716470, 705643475, 708115339, 710227966, 712107837, 713860631, 715406299, 716488421, 716998637, 717111349, 717236221, 718118012, 720387161, 723822951, 727606595, 731065094, 733857989, 735932469, 737414598, 738392055, 738887131, 738893390, 738396943, 737296462, 735289931, 731839001, 725926280, 715753913, 699794531, 680222273, 664546072, 660146773, 667122841, 679002285, 689407408, 696036458, 699567795, 701162636, 701398432, 700228930, 696789503, 689690590, 679032385, 668537498, 663659036, 666559100, 674336851, 681993067, 686105371, 686146498, 683517396, 680040002, 677077413, 675238311, 674527228, 674653172, 675407290, 676962733, 679518700, 682852983, 686494768, 689966619, 692791283, 694648564]
1221.7F94648564P88629k56300j101613j484871j449883j373589j304686r15349j07348
1240.1F87443554P38204J185000J201510J183212J377821J522362J294792Q53300N70893
1258.4F97370648N07653N15103M65990L32892R7692l33310r58919j560271k008855
1276.8F94428623k285540k465189k601087k684057k854645l093362l228485l184081
1293.1F72032177l113865l290475l864288m605770n092085n003750m356623l561318
1309.4F39144003k904236k297461j469195n83887P4148L31998J42574m34815j123488
1327.8F30879641j265884m77195O50227Q03888o70254l185809m927456n290806m956723
1346.2F11559629m283189l590703l008187k552331j995861j349211p86424m32789J90437
$$ y = [694648564, 695437193, 695180893, 694079280, 692594409, 691144526, 689770937, 688466251, 687550902, 687443554, 688181758, 689366758, 690568268, 691751480, 693129301, 694651663, 695946455, 696799755, 697370648, 697878301, 698393404, 698859394, 699192286, 699289978, 698956668, 697997749, 696437478, 694428623, 692143083, 689677894, 687076807, 684392750, 681538105, 678444743, 675216258, 672032177, 668918312, 665627837, 661763549, 657157779, 652065694, 647061944, 642705321, 639144003, 636239767, 633942306, 632473111, 631889224, 631963372, 632295370, 632437944, 632003129, 630879641, 629613757, 629136562, 629786789, 630590677, 629920423, 626734614, 621807158, 616516352, 611559629, 607276440, 603685737, 600677550, 598125219, 596129358, 594780147, 593993723, 593560934, 593751371]
1364.5E93751371J224518K408325L605068N224645P695616J0001003J1828900J2688100
1380.8F48427546J1854470J0228038R091258P796228O301462N583704M853785L201306
1397.1G07337797J484692P22110R26673J245380O85871o16372k653182m976928o445408
1415.5F97710633o439984m533350k621770m560411r868741j6429782k4939418l0435502
1431.8E97881675l0812860l6199093m0708333l5355747l6427050m2970330m9197048
1446.1C26211214n6376636n5530384l7560910O369486R2253596J56196654J01487458
1460.4E33050478N3646504L8268388K6050210J4563620R852707R473980P792771L529906
1476.7F96228564j311422p476925j6297997k8174281m9278795r2768908j29296124
$$ y = [593751371, 594975889, 597384214, 600989282, 606213927, 613909543, 623910546, 635739446, 648427546, 660282016, 670510054, 679601312, 687397540, 693699002, 699282706, 704136491, 707337797, 708822489, 709544599, 710471272, 711716652, 712402523, 711786151, 709132969, 704156041, 697710633, 691270649, 686737299, 684115529, 679555118, 669686377, 653256595, 628317177, 597881675, 567068815, 530869722, 490161389, 454805642, 418378592, 375408262, 326211214, 269834578, 214304194, 176743284, 183112770, 275366366, 431563020, 533050478, 586696982, 624965370, 651015580, 665579200, 675431907, 684905887, 692698658, 696228564, 694917142, 687440217, 671142220, 642967939, 593689144, 500920236, 371624112]
1491C71624112q7780088R521514J15312636J40820622Q7457359M2573333K3669660
1505.2G03199148J6814530P596195L026604K344788K156853J735568J299918P19965
1521.6G38893569J10089j63972l75211n24402o33776j340866j533926j044154j753628
1539.9G31633723k672672k266109j732886j376808j535833j997113j829624j97828
1556.2G18024850L112435M775048K993583K680481K524376J599729j38641j766085
1572.6G33805776m306615j1334538j9526839k3735166j7282963L239393J8371284J4622748
1588.9F93853080J387418j0819912k2901476l7802160m7928214l6755204K20537L7665308
1605.2E76919377M9964547L9914370K3289680J1620998O317020L779173J923919J137137
$$ y = [371624112, 283844024, 293365538, 408678174, 549498796, 636956155, 679529488, 703199148, 720013678, 727609873, 730636477, 732981265, 735138118, 736873686, 738173604, 738893569, 739003658, 738839686, 738464475, 737940073, 737306297, 735965431, 734431505, 733387351, 731633723, 728961051, 726694942, 724962056, 723585248, 722049415, 720052302, 718222678, 718024850, 721137285, 725912333, 728905916, 731586397, 734110773, 735710502, 735571861, 733805776, 729499161, 718164623, 698637784, 674902618, 657619655, 660859048, 679230332, 693853080, 695240498, 684420586, 661519110, 623716950, 575788736, 539033532, 539254069, 576919377, 626883924, 666798294, 690087974, 701708972, 708025992, 711805165, 713729084, 714866221]
1621.5G14866221O14762k30074j834929m364848o208837q290887j1324525o148278
1637.8F77078605M626810J1514962J3143718J1633814P426202K947450J030385n25355
1654.1G28876591q38280n64635q99255j791895k226293j354038m08233L27945J092136
1672.5G22214043J697123J948655J978099K181769K445221K337396J549542J166522
1688.8G37518370R77218Q22783P57754O98507R52482J171589R87768P10010K99275
1707.2G44895756q106m5776j02878n01037j595735k124608j481294j123548r16600
1725.5G36996174m59314l4213J00136l13222o08146k25187j30772k00928j09016n5731
1745.9G34959781q3268k77817k98917K29239Q57473J275718J578450J845360J906395
$$ y = [714866221, 715480983, 715250909, 713415980, 709051132, 702842295, 694551408, 683226883, 677078605, 681705415, 693220377, 706364095, 717997909, 725424111, 728371561, 729401946, 728876591, 728038311, 727473676, 726574421, 724782526, 722556233, 721202195, 720793962, 721121907, 722214043, 723911166, 725859821, 727837920, 730019689, 732464910, 734802306, 736351848, 737518370, 738495588, 739318371, 740076125, 740774632, 741727114, 742898703, 743886471, 744596481, 744895756, 744887650, 744841874, 744738996, 744237959, 742642224, 740517616, 739036322, 737912774, 736996174, 736536860, 736502647, 736602783, 736289561, 735681415, 735456228, 735325456, 735124528, 735015512, 734959781, 734876513, 734598696, 734299779, 734529018, 735386491, 736662209, 738240659, 740086019, 741992414]
1764.3G41992414J954019J918197J510858Q75235O02484R90331J491844J671017J385569
1782.6G54391968Q03650J67370l09647j083433k418459l082454l121972l452599l807306
1801G38087118l543794k739788j867413j107216n35607N960O26385J160205J485288
1819.4G31571138J745164K058089K306938K407015K500832K426505K276122K254546
1835.7G49546349K091765J837194J661659J406073Q95620M32431Q3447k11239m94242
1854G57249057q91626j452863k097130k666294l069341l453672m130960m324317l494441
1872.4G31668413k616406j875162j040637k44439L75211P99596J150191J443923J616359
1890.7G31277049J729428J915098K140224K320289K430797K429783K359629K240062
$$ y = [741992414, 743946433, 745864630, 747375488, 748250723, 748853207, 749843538, 751335382, 753006399, 754391968, 755195618, 755362988, 755053341, 753969908, 751551449, 748468995, 745347023, 741894424, 738087118, 734543324, 731803536, 729936123, 728828907, 728293300, 728299260, 728925645, 730085850, 731571138, 733316302, 735374391, 737681329, 740088344, 742589176, 745015681, 747291803, 749546349, 751638114, 753475308, 755136967, 756543040, 757438660, 757871091, 757954538, 757743299, 757249057, 756357431, 754904568, 752807438, 750141144, 747071803, 743618131, 739487171, 735162854, 731668413, 729052007, 727176845, 726136208, 725891769, 726266980, 727066576, 728216767, 729660690, 731277049, 733006477, 734921575, 737061799, 739382088, 741812885, 744242668, 746602297, 748842359]
1907.1G48842359J976609J570821J251638J050651P37846L07679l9876l91066p49946
1925.4G54556715j006782j295208j713336k255857k834857l339350l736078m191518
1941.7G34183729m353643l741205k855241j962423r34363N5671Q28266J439572J858353
1960.1G24518716K020121K089620K184510K245903K271533K293467K263964K150118
1976.4G42037952J984298J750946J440764J200556J250804J590311J949072K022028
1992.7G55226731J818419J588642J325250R93311P07329N26190M39524L98338L46005
2011.1G63369739L03268K67506J90020J52409J97291K13742J60218R7513M6730L1769
2031.5G65030205O4075R6917J40667J80722J51634Q8453M3094L7134N8055J9908n3883
$$ y = [748842359, 750818968, 752389789, 753641427, 754692078, 755429924, 755737603, 755697727, 755306661, 754556715, 753549933, 752254725, 750541389, 748285532, 745450675, 742111325, 738375247, 734183729, 729830086, 726088881, 723233640, 721271217, 720336854, 720392525, 721220791, 722660363, 724518716, 726538837, 728628457, 730812967, 733058870, 735330403, 737623870, 739887834, 742037952, 744022250, 745773196, 747213960, 748414516, 749665320, 751255631, 753204703, 755226731, 757045150, 758633792, 759959042, 760952353, 761659682, 762185872, 762625396, 763023734, 763369739, 763673007, 763940513, 764130533, 764282942, 764480233, 764693975, 764854193, 764951706, 764998436, 765030205, 765094280, 765191197, 765331864, 765512586, 765664220, 765752673, 765795767, 765832901, 765890956, 765910864, 765856981]
2053.9G65856981m9293J7464L3677q166o0260r7692r1076o3300n0008n2929m7803k9981
2078.4G65357614l4810m2736k1517k1756p1526j11639q4102m5359o9261j03593j06335
2100.8G64644980j05798j15752j22547j09136q4818p8201q3148o2407o2465r5487q1062
2123.3G63644159m2558k5093j9491j8478l5703r2089j36852j13309q1241j10566j34111
2145.7G62834668j17719j09792j02401n3167j5855n1021o1632n6624j03414j54138
2166.1G62008905j95264k39313l01242l95298n70774q45194j060307j057565q01563
2184.5G56542385l07620K29180N25653N64277M86970L06607N2333j57476l40760n42402
2204.8G57359147o68049o76214o53506p03573r14454j348317k085745l403008n986870
$$ y = [765856981, 765807688, 765825152, 765858829, 765850663, 765790403, 765692711, 765601635, 765538335, 765488327, 765435398, 765387595, 765357614, 765322804, 765280068, 765258551, 765236795, 765165269, 765053630, 764969528, 764924169, 764854908, 764751315, 764644980, 764539182, 764423430, 764300883, 764191747, 764106929, 764028728, 763945580, 763883173, 763820708, 763725221, 763644159, 763601601, 763576508, 763557017, 763538539, 763502836, 763410747, 763273895, 763160586, 763079345, 762968779, 762834668, 762716949, 762607157, 762504756, 762451589, 762435734, 762384713, 762323081, 762266457, 762163043, 762008905, 761813641, 761574328, 761273086, 760877788, 760307014, 759461820, 758401513, 757343948, 756542385, 756234765, 756463945, 756989598, 757553875, 758040845, 758347452, 758399785, 758242309, 757901549, 757359147, 756691098, 756014884, 755361378, 754657805, 753743351, 752395034, 750309289, 746906281, 740919411]
2223.2G40919411j1135638k0696997l5327137n0619304n6396067m4480860j7482817
2237.5E04780591J2928307L5344839M4886887M3194651L5160065K5518715J7174483
2251.8G18988538J1126637P161320M665553L115237K216697J709520J343072J042724
2268.1G51369298Q37802P32184O31034M82500L51965K59817J57535L9160p5161j83046
2288.5G54603088k45333k70605k69294k00391j52707j84834k59697m68135p71105r52959
2308.9G50828028r68814q26895m35591R0718M18127M18067K68221N9008k71022p00116
2329.3G48879731j181245j648128j864076j527190p97987q464P90358J474321J685321
2347.6G45802641J313209O59109P093l78430m06981k24292p4864M4227L75152O75261
$$ y = [740919411, 729783773, 709086776, 673759639, 623140335, 566744268, 522263408, 504780591, 517708898, 553053737, 597940624, 641135275, 676295340, 701814055, 718988538, 730115175, 737276495, 741942048, 745057285, 747273982, 748983502, 750326574, 751369298, 752207100, 752939284, 753570318, 754052818, 754404783, 754664600, 754822135, 754861295, 754786134, 754603088, 754357755, 754087150, 753817856, 753617465, 753464758, 753279924, 753020227, 752552092, 751780987, 750828028, 749859214, 749032319, 748596728, 748687446, 749105573, 749523640, 749791861, 749850869, 749579847, 748879731, 747698486, 746050358, 744186282, 742659092, 741861105, 741852641, 742642999, 744117320, 745802641, 747115850, 747774959, 747782052, 747403622, 746996641, 746772349, 746697485, 746741712, 747116864, 747792125]
2368G47792125O72936O75142P30634O10411M06027K95341K74241K65479K14517J27733
2388.4G52064586M1067k2649l2902n365k503j8179j5200K6882Q4460Q8155P8201J09792
2412.9G52396345J11878N6028P630J1504M1484M2916Q225m4107q0526r2149j13010
2435.3G52346218j16647p6294l9935m2617o0618l3021K3186L2008j4842m8160j6213
2457.8G51953065L0935K6345j1086l1650m8578j22368k14279k05696j74760k38180
2478.1G50963748l18707l46839l23772k91825k92718k81811k49326k38121k26199k41220
2498.5G48153210l00527l13163k99513l37124l51191k80141k03193j93297k14696j63377
2518.9G45496988o4254L934N1618O8426R0897J11163Q9645M5419j9133m7147n8234
$$ y = [747792125, 748465061, 749140203, 749870837, 750481248, 750887275, 751182616, 751456857, 751722336, 751936853, 752064586, 752105653, 752083004, 752050102, 752044737, 752042234, 752024055, 752008855, 752035737, 752120197, 752208352, 752286553, 752396345, 752508223, 752564251, 752571881, 752583385, 752624869, 752667785, 752676010, 752631903, 752551377, 752459228, 752346218, 752229571, 752153277, 752113342, 752070725, 752010107, 751977086, 752000272, 752032280, 752017438, 751969278, 751953065, 751984000, 752010345, 751999259, 751967609, 751919031, 751796663, 751582384, 751376688, 751201928, 750963748, 750645041, 750298202, 749974430, 749682605, 749389887, 749108076, 748858750, 748620629, 748394430, 748153210, 747852683, 747539520, 747240007, 746902883, 746551692, 746271551, 746068358, 745875061, 745660365, 745496988, 745432734, 745436668, 745488286, 745556712, 745647609, 745758772, 745848417, 745893836, 745874703, 745827556, 745769322]
2541.4G45769322j68085k93136k55942j23203l5882L9041Q3745N4776K9862J9729K7359
2563.8G45147586N1439L3855j5557j12891k75731m23729m88699m11093j43349J55210
2584.2G43517041K76149K34544Q0049j70529m34220o58095p92384p86483o41465l44277
2604.6G40280330L4571L48151M87923L97682J87576L1710n8174j86622l78311n74172
2625G40570664p53283r08673r69589q13543m07637O9678L93927M86791L60668J45972
2645.4G38174975L4988J5437j7643l9756k205K9504m3213j70350k46585k69830k81751
2667.8G37183571k89321k60115j78098m0412J03473J50860J08420Q2493J02222P3672
2688.2G37036765J1503J4484K6345k0921n0723k4796j7881k8730M590l219q9586j34468
$$ y = [745769322, 745601237, 745308101, 745052159, 744928956, 744893074, 744932115, 745015860, 745070636, 745100498, 745120227, 745147586, 745199025, 745232880, 745217323, 745104432, 744828701, 744404972, 743916273, 743505180, 743361831, 743517041, 743793190, 744027734, 744107783, 743937254, 743503034, 742844939, 742052555, 741266072, 740624607, 740280330, 740314901, 740663052, 741150975, 741548657, 741736233, 741767943, 741709769, 741523147, 741144836, 740570664, 739817381, 738908708, 737939119, 737125576, 736717939, 736787617, 737181544, 737668335, 738029003, 738174975, 738209963, 738225400, 738207757, 738168001, 738165796, 738195300, 738152087, 737981737, 737735152, 737465322, 737183571, 736894250, 736634135, 736456037, 736415625, 736519098, 736669958, 736778378, 736860871, 736963093, 737036765, 737048268, 737062752, 737089097, 737068176, 737017453, 736992657, 736974776, 736946046, 736950636, 736947417, 736857831, 736723363]
2712.7G36723363j33693j14560p0095m0710k0742j2100l3498o1035n2691n066M2379
2735.1G36221552M8399L1531M4107N2095J2457o9857j56045k15768k72870l27707l65972
2757.6G35001922m17590m93885n31315n45442o13928o76096p14481q86202j169085
2775.9G28953898j311600j256943j156449j083434r71556q51929r37641j145660j204670
2794.3G19034016j177430j210868j315356j396298j446128j568973j733959j994848
2810.6G07190156k393365k871990l489733m286110n433798p183254r493291j2199283
2826.9F59839332j5198171j8245995k0881713k2799193k4113000k5093257k5635839
2841.2E07872164k5299012k3423702j8775493j0934293k402574L421307O305158Q286446
$$ y = [736723363, 736589670, 736475110, 736405015, 736364305, 736343563, 736331463, 736297965, 736236930, 736184239, 736179173, 736221552, 736269951, 736301482, 736345589, 736397684, 736410141, 736340284, 736184239, 735968471, 735695601, 735367894, 735001922, 734584332, 734090447, 733559132, 733013690, 732399762, 731723666, 731009185, 730122983, 728953898, 727642298, 726385355, 725228906, 724145472, 723173916, 722321987, 721384346, 720238686, 719034016, 717856586, 716645718, 715330362, 713934064, 712487936, 710918963, 709185004, 707190156, 704796791, 701924801, 698435068, 694148958, 688715160, 681531906, 672038615, 659839332, 644641161, 626395166, 605513453, 582714260, 558601260, 533508003, 507872164, 482573152, 459149450, 440373957, 429439664, 427037090, 430458397, 436763555, 445050001]
2857.5D45050001J0200203J1576831J2022585J1435479R873926P608593M887104J724720
2873.8E14379442j781166n238891q292347j0771483j2592882j3787031j4437199j4682889
2890.1D32795554j4692753j4605552j4605075j4911920j5660614j6784549j8024802
2904.4C23510289j9204914k0369977k1579236k2272348k0821080j6521871j1176840
2918.7A91564023o662338l071905n0380K504184M616827O166265P442817Q907675J0581360
2937B21998528J2443095J4615685J6842857J8596768J9826323K0920932K2098035K3178220
2953.4C70520443K4096250K4886519K5108427K4273962K2332876J9612223J6572655
2967.6E27403355J3433039J0362625P662594N642295M725337M891038N238354M932464
$$ y = [445050001, 455250204, 466827035, 478849620, 490285099, 500159025, 507767618, 512654722, 514379442, 512598276, 507359385, 499067038, 488295555, 475702673, 461915642, 447478443, 432795554, 418102801, 403497249, 388892174, 373980254, 358319640, 341535091, 323510289, 304305375, 283935398, 262356162, 240083814, 219262734, 202740863, 191564023, 184901685, 181829780, 181779400, 184283584, 188900411, 195066676, 202509493, 211417168, 221998528, 234441623, 249057308, 265900165, 284496933, 304323256, 325244188, 347342223, 370520443, 394616693, 419503212, 444611639, 468885601, 491218477, 510830700, 527403355, 540836394, 551199019, 558861613, 564503908, 569229245, 574120283, 579358637, 584291101]
2984E84291101L942608K557218P64430j940668o387353j2521147j8033147j8986345
3000.3E33686697j3116359k796531O550849J0846078R379506L261745o332815j8517255
3016.6E22961915l1839252m2715102m5570702l6583632j7325550O187707K6982367
3030.9C82097751L9765835M2711258L8449555L1437338K4253428J7313540J0338544
3045.1E86367249K997458m495263j1357724j6866803k0420075k0775497j6058564n868584
3061.5D93522197O881624J7195583K1274567J9270241J4338910Q903206L178537l202975
3077.8E81361890q508444q471131n87046J1855423K2116482K5551021K2336305J5803515
3094.1F61458015Q969367L221810p84040k219438m18246L669322P618665R554684R420216
$$ y = [584291101, 588233709, 590790927, 591555357, 589614689, 583227336, 570706189, 552673042, 533686697, 520570338, 517773807, 524324656, 535170734, 544550240, 547811985, 541479170, 522961915, 491122663, 448407561, 402836859, 366253227, 348927677, 355115384, 382097751, 421863586, 464574844, 503024399, 534461737, 558715165, 576028705, 586367249, 589364707, 584869444, 573511720, 556644917, 536224842, 515449345, 499390781, 493522197, 500403821, 517599404, 538873971, 558144212, 572483122, 581386328, 584564865, 581361890, 572853446, 564382315, 563795269, 575650692, 597767174, 623318195, 645654500, 661458015, 670427382, 673649192, 672865152, 670645714, 670227468, 673896790, 681515455, 691070139, 700490355]
3112.4G00490355Q103610O259977M386664K857148J796782J242757J023293Q60274
3128.8G27020860O55889M88937M53890N11765M59194K05875K0206L7729J02997K02537
3149.2G30159879K39610m5657m87387o59406n76854m11749o5148M25816P51018P83146
3169.6G30113268O43730L93808J43170M3929L0339k1816r4890q3029n007J073l3379
3192G31131196o676J2636m6610p8261K503R5129J08957Q2612N6386K8253m9353q8214
3216.5G31248558L5822J22666M8101L7015J49965J88708K19465L01838J50621j29462
3236.9G32373297j57296L635J21236J89007J30653j05619k04325o6459p391j80960
3257.3G32095778l44634l30806k78532k56241k34604k33233m16815p84695j060843
$$ y = [700490355, 708593965, 714853942, 719240606, 722097754, 723894536, 725137293, 726160586, 727020860, 727676749, 728165686, 728619576, 729131341, 729590535, 729796410, 729816616, 729854345, 729957342, 730159879, 730399489, 730353832, 729866445, 729207039, 728630185, 728218436, 728153288, 728579104, 729330122, 730113268, 730756998, 731150806, 731293976, 731337905, 731368244, 731346428, 731251538, 731168509, 731163502, 731164575, 731131196, 731124520, 731137156, 731090546, 731012285, 731014788, 731109917, 731218874, 731301486, 731357872, 731386125, 731336772, 731248558, 731284380, 731407046, 731455147, 731492162, 731642127, 731830835, 732050300, 732352138, 732502759, 732373297, 732216001, 732219636, 732340872, 732529879, 732660532, 732554913, 732350588, 732284129, 732276738, 732095778, 731751144, 731420338, 731141806, 730885565, 730650961, 730417728, 730000913, 729216218, 728155375]
3275.6G28155375j259804j501620j691878j766622j721501j566291j402795j458824
3291.9G15786040j716256j684368q40306Q96334K886951M052341L855586K863467J912177
3310.3G28011966J306653R69887P48038O10769N29766M79817L91305J25169j24931
3328.6G33048439j21713K2829J49071J93536O0618j55687k26438j59025N0962K61903
3349G33124495J12056j85191k10464j10627r4294r3937o378J31250J63912m2974m01676
3371.5G32386172n35846l55303j57655q3088j84477l22342k52127k981K86222K21074
3391.9G30999649k20478k76208J88410L82245r6798n31971k83897J09672J27673p927
3412.3G30390370j30534j82390p1705K1577n0187j22726k4557J20878P2539L159Q1062
$$ y = [728155375, 726895571, 725393951, 723702073, 721935451, 720213950, 718647659, 717244864, 715786040, 714069784, 712385416, 711545110, 712441444, 715328395, 719380736, 723236322, 726099789, 728011966, 729318619, 730288506, 731036544, 731647313, 732177079, 732656896, 733048201, 733173370, 733048439, 732926726, 732949555, 733098626, 733292162, 733352780, 733197093, 732970655, 732811630, 732862592, 733124495, 733236551, 733051360, 732840896, 732730269, 732635975, 732542038, 732535660, 732666910, 732830822, 732787848, 732386172, 731850326, 731495023, 731337368, 731254280, 731069803, 730747461, 730495334, 730492353, 730778575, 730999649, 730779171, 730502963, 730691373, 731073618, 730976820, 730444849, 730160952, 730270624, 730398297, 730390370, 730259836, 730077446, 730005741, 730027318, 729977131, 729854405, 729829848, 729950726, 730023265, 730026424, 730107486]
3434.7G30107486q9705m75883n55456l58879r2388N3168k5392p4267j6570L099k3961
3457.1G28451252o6817k21789k89738k7060J43289j61946n69403n98728l52800j07170
3477.5G26199090j39355m78029n16057k79785l93092n80907m44234k91049l15547l56495
3497.9G22404540l70443n34535p66635p37011o36935o34551n41866n46873p46965q18134
3518.3G16070592o05404l76165n32627q52644q59440o77466m61757k32518k00391k57790
3538.7G11014390M113M13775L65794o8903q3625K83002M58539N32567O62327P42257
3559.1G14324236P52091P82609P70271N43416L98934M28795M04358M34757M91678N08070
3579.5G19839215O36459P81297M82142k58922l54350J00970K1220k78950k36571k65837
$$ y = [730107486, 730017781, 729541898, 728986442, 728627563, 728535175, 728588343, 728562951, 728488684, 728472114, 728475213, 728451252, 728384435, 728162646, 727872908, 727845848, 727989137, 727827191, 727257788, 726659060, 726306260, 726199090, 726059735, 725581706, 725065649, 724785864, 724392772, 723811865, 723367631, 723076582, 722761035, 722404540, 722034097, 721499562, 720732927, 719995916, 719358981, 718724430, 718182564, 717635691, 716888726, 716070592, 715465188, 715089023, 714556396, 713703752, 712844312, 712166846, 711705089, 711472571, 711272180, 711014390, 711018503, 711432278, 711798072, 711729169, 711645544, 711928546, 712387085, 712919652, 713581979, 714324236, 715076327, 715858936, 716629207, 717172623, 717571557, 718000352, 718404710, 718839467, 719331145, 719839215, 720475674, 721256971, 721739113, 721480191, 721125841, 721226811, 721248031, 720969081, 720732510, 720466673]
3599.9G20466673m56988l91543m23432r20355j210749j125932j081347j038969j347721
3618.3G12469637j577615r45390k08437o8128q19147j208067o93500p89583j137495
3636.6G05022275j229345j258314j081705o50644m71533o83248l67999N31972J035392
3655G00846851J231134J404583J352668J281917J564086J815557J603067J577795J926660
3673.3G14604318J781047J545906J660943J681804J753509J965821J890540J014769
3689.6G27898657K51472L63827M92692L80158J76430j8477J85609O50346P42495L08275
3710G31431484k70962k02358R6559M2081p8440m4643l1591n5551K22981N72323N98729
3732.5G32280612K35558k08796j22725K19106O0678m18902k3544L09825j94966l27588
$$ y = [720466673, 720009685, 719618142, 719194710, 718274355, 717063606, 715937674, 714856327, 713817358, 712469637, 710892022, 709946632, 709738195, 709670067, 708850920, 707642853, 706949353, 706159770, 705022275, 703792930, 702534616, 701452911, 700802267, 700330734, 699647486, 699279487, 699811459, 700846851, 702077985, 703482568, 704835236, 706117153, 707681239, 709496796, 711099863, 712677658, 714604318, 716385365, 717931271, 719592214, 721274018, 723027527, 724993348, 726883888, 727898657, 728150129, 728513956, 729006648, 729386806, 729563236, 729544759, 729730368, 730380714, 731123209, 731431484, 731160522, 730958164, 731054723, 731096804, 731018364, 730973721, 730942130, 730886579, 731109560, 731681883, 732280612, 732516170, 732307374, 732184649, 732403755, 732464433, 732045531, 732021987, 732331812, 732136846, 731809258]
3752.9G31809258J15693K52724r8288l37899q6784O6101K1994j52349l46065j20520
3773.3G31123865K35557K50817r2805k86579j81735j09613o8366o0201m9293n4061
3793.7G30707586k13564j38521K0206l39806k83897n4180k38359r6918J60814O8724
3814.1G29592085k60949r8229k8073m00007j24514J59263J69575J85967J72079K29537
3834.4G29596734L9458l13580j62482O2048M6194J22607L35634K97844n64754q99255
3854.8G28560448J56641M81546K26199p1287j79768p152o6400j99198j14501n4777
3875.2G28731751J26660N8115j11997m053k58208l16143L7909j54555l93271j15812
3895.6G27600396K6524q1122j50323l58999m71294k11358J0312R0301O9558q7618k41161
$$ y = [731809258, 731924951, 732177675, 732079387, 731741488, 731654704, 731720805, 731742799, 731590450, 731244385, 731123865, 731359422, 731610239, 731517434, 731230855, 731049120, 730939507, 730871141, 730810940, 730761647, 730707586, 730494022, 730355501, 730375707, 730035901, 729752004, 729697824, 729459465, 729362547, 729523361, 729592085, 729331136, 729232907, 729204834, 728804827, 728680313, 728839576, 729009151, 729195118, 729367197, 729596734, 729636192, 729322612, 729160130, 729222178, 729268372, 729390979, 729726613, 730024457, 729459703, 728560448, 728717089, 729198635, 729424834, 729353547, 729173779, 729166627, 729100227, 728901029, 728786528, 728731751, 728858411, 728916526, 728804529, 728800476, 728542268, 728226125, 728264034, 728109479, 727716208, 727600396, 727626920, 727545798, 727395475, 727036476, 726565182, 726353824, 726364136, 726454437, 726523995, 726436377, 726195216]
3918.1G26195216j80363l5763j34707k41041j05441p1466j85191j57774r8228q1778
3938.5G24903464l695n96l2425m2319j68801j84238j4066j1623j49727j23859l5524
3960.9G24136591n7161p7248r4592j39892j27018p9870r3281j39952j79350k06113
3981.3G22942114j74701j19329j02639j67728k64465k99394l51966m27782
3997.6G21034110
$$ y = [726195216, 726014853, 725979090, 725844383, 725603342, 725497901, 725426435, 725241244, 725083470, 724985242, 724903464, 724899769, 724899173, 724866748, 724824429, 724655628, 724471390, 724457324, 724445701, 724295974, 724172115, 724136591, 724079430, 724002182, 723907590, 723767698, 723640680, 723560810, 723467529, 723327577, 723148227, 722942114, 722767413, 722648084, 722545445, 722377717, 722113252, 721813858, 721461892, 721034110]
##END=$$ End of the data block
