##TITLE=LAP1 $$ Begin of the data block
##JCAMP-DX=5.00 $$ ACD/SpecManager v 10.08
##SPECTROMETER/DATA SYSTEM=Alpha
##DATE=19 May 2015 10:54:12
##DATA TYPE=INFRARED SPECTRUM
##DATA CLASS=XYDATA
##ORIGIN=
##OWNER=
##NPOINTS=1765
##FIRSTX=399.76428223
##LASTX=3997.64306641
##MAXX=3997.64306641
##MINX=399.76428223
##MAXY=0.90046751
##MINY=0.59145170
##XFACTOR=1.0000000000
##YFACTOR=1.000000000000000e-9
##FIRSTY=0.86461282
##DELTAX=2.03961372
##XUNITS=1/CM
##YUNITS=ARBITRARY UNITS
##XYDATA=(X++(Y..Y))
399.8H64612818N803406N4896j4814913p460952J1586606Q228720n687535q91447J0242343
418.1H71673942j05441r341180L004312Q948446m425467r843349M023492P897079o645798
436.5H65186036q190632O740987O660938q477688o953239O088316J048744j4184356
452.8H47919106j0674357L408074K301395m494965K698899J0848343L802717m236043
469.1H51573169M140735J0676801k417683j0017097K078413Q048356m880547j0069311
485.4H49132836K702832N427122q302450j0988295P56979p25746j5698314j8168628
501.7H04136336q329272j0250926j3906181P720232L1778514K2127271j974046l781021
518.1H27520907P527351L895641m960299J756728J0349035j00672j3010740q001328
$$ y = [864612818, 870416224, 870471120, 855656207, 848195255, 859781861, 868010581, 862323046, 861431599, 871673942, 871568501, 862227321, 865231633, 874180079, 869754612, 859911263, 863934755, 871831834, 865186036, 856995404, 863736391, 870397329, 861919641, 854966402, 861054718, 862103462, 847919106, 837244749, 840652823, 842954218, 838459253, 841158152, 852006495, 855809212, 851573169, 855713904, 866390705, 863973022, 853955925, 856034338, 864082694, 859202147, 849132836, 851835668, 857262790, 848960340, 837972045, 838729024, 838003278, 822304964, 804136336, 795807064, 785556138, 771649957, 779370189, 811148703, 833275974, 831301928, 827520907, 835048258, 838943899, 833983600, 835740328, 846089363, 845988691, 832977951, 824976623]
534.4H24976623L42727l080547l035605R785950J5921474L683567n646050L028094
550.7H45976233Q690417k421200r024203K6345L557921n263984m827440Q227289J0133862
569.1H55075240l061414o396055M654765O035567n762577o959320M124165M000187
585.4H51710558p457078p175147L518820J800179r332239p619143K689004L78907r452939
603.7H19060922o333888M290342L992260j916826K794862J1412620P137537j347959
620H39089870L819287J2141586N650162m326403R08852R290099K198040q136987l755510
638.4H56878996M213095R64820k953470M496873J0288298J125216o883561O98805O920576
656.8H75749648j825810q067071L56078N756259n836368j5637040M005969J3031244
$$ y = [824976623, 825319350, 822238803, 819203198, 828989148, 844910622, 848594189, 842948139, 845976233, 854666650, 852245450, 843221247, 843247592, 846805513, 841541529, 836714089, 844941378, 855075240, 852013826, 845617771, 850272536, 856308103, 850545526, 843586206, 847710371, 851710558, 844253480, 837078333, 840597153, 842397332, 833065093, 825445950, 828134954, 828513861, 819060922, 812727034, 817017376, 821009636, 819092810, 821887672, 833300292, 840437829, 839089870, 842909157, 855050743, 860700905, 856374502, 857283354, 866573453, 868771493, 860634506, 856878996, 861092091, 862056911, 859103441, 863600314, 873888612, 875013828, 868130267, 868829072, 875749648, 873923838, 865856767, 866212845, 871969104, 866132736, 850495696, 854501665, 867532909]
673.1H67532909K936780l968417L589809O447076m461824j0695875p565439j6683698
689.4H37131321l4548521k2124052J9969344L9905131K2621632O589770Q768261Q029699
705.7H86342585k623796m723311M496813N237758m927397o748318J488626K096176
722H80639136m605234k117455O937742M964650o567061j0405779n696177j368344J724958
740.4H63506436N795122Q599340K111495j0057926j3875663j6569138l2516599l8231075
756.7G68761992m896402L8477600M2325258J3475656q157849k3674011n5057526o5129995
773G06124723m716456O7412674O8834305K9619217J0421992R940445L952682n387604
789.3H86201978k375782O030679K560675o152034m203021k67923j1349678k6299358
$$ y = [867532909, 870469689, 866501272, 870091081, 876538157, 872076333, 861380458, 853815019, 837131321, 802582800, 780458748, 800428092, 840333223, 862954855, 869544625, 878312886, 886342585, 883718789, 878995478, 883492291, 888730049, 883802652, 877054334, 878542960, 880639136, 876033902, 873916447, 880854189, 885818839, 879251778, 868845999, 863149822, 861781478, 863506436, 869301558, 877900898, 880012393, 869954467, 856078804, 839509666, 806993067, 768761992, 763865590, 802343190, 844668448, 858144104, 849986255, 826312244, 771254718, 706124723, 701408267, 768820941, 837655246, 867274463, 877696455, 887636900, 891589582, 886201978, 883826196, 889856875, 892417550, 886265516, 882062495, 881794572, 870444894, 844145536]
805.6H44145536j5420019J5311956K4705351J0202169L751040O209671J388013l521025
822H86772692K471328Q233309K243578m523635k72631N198955L43919n251586n18680
840.3H94697249M458129q05139n863250j41382N827070Q73565m829347p02500L253579
858.7H96767974j759768o289363k153813L438294J849532j142145K612889N258501
875H98582101o37829m523516Q60751M331707j179635m600644Q36849L887355j847386
893.4H95709753m988253N36144L262818k805770o667614k613604n83708l907204j694798
911.7H76247764O666720P662415n37693m333318j75476k13027n964994m267216L563404
930.1H78648579J117408j5123367k7249277j2979447J5706896K3105860J2376964P047296
$$ y = [844145536, 828725517, 844037473, 868742824, 878944993, 882696033, 888905704, 890293717, 886772692, 889244020, 897477329, 899720907, 895197272, 894924641, 900123596, 900467515, 895215929, 894697249, 899155378, 898350239, 892486989, 892345607, 898172677, 899046242, 894216895, 893514395, 896767974, 895008206, 888718843, 886565030, 890003324, 891852856, 890710711, 893323600, 898582101, 897944272, 893420756, 894281507, 898613214, 897433579, 892832935, 893669784, 897557139, 895709753, 890721500, 891257644, 894520462, 891714692, 885047078, 882433474, 881849766, 877942562, 876247764, 882914484, 890576899, 890039206, 885705888, 885530412, 885317385, 879352391, 875085175, 878648579, 879765987, 864642620, 837393343, 824413896, 840120792, 863226652, 875603616, 882650912]
946.4H82650912L596842k866924k155542M742443M698277k213240l623604J836419
962.7H86665583K689361k900064l763556J684308K540052k620518l252984J606107
979H82648289J433373m629731n444050R72211L641486n60701j747071K103507J491606
997.4H79908919l384411k791822K170205J507521m068017m847229j564562k656877
1013.7H64273727m734576N83708P372439N228818j991749l605425j16587Q69632p65920
1032H67114067L27349L214180J202941m142582l898740J168191J823068j989186j823961
1050.4H62995327J551985l98874o333411q177519q025884j2130559j2472987J731038
1066.7H18739116J8356085J8279731P193208K161741L213287L39746n104601m141093
$$ y = [882650912, 886247754, 883380830, 881225288, 885967731, 890666008, 888452768, 884829164, 886665583, 889354944, 886454880, 882691324, 884375632, 886915684, 884295166, 881042182, 882648289, 884081662, 879451931, 874007881, 874980092, 878621578, 878060877, 876313806, 878417313, 879908919, 876524508, 873732686, 875902891, 877410412, 873342395, 868495166, 866930604, 864273727, 859539151, 860122859, 867495298, 872724116, 870732367, 867126942, 867010355, 867879987, 867114067, 867441416, 870655596, 871858537, 867715955, 863817215, 864985406, 866808474, 864819288, 862995327, 864547312, 864148438, 857815027, 849637508, 841611624, 829481065, 817008078, 818739116, 837095201, 855374932, 862568140, 864729881, 867943168, 868282914, 863178313, 859037220]
1083H59037220J047791J7344p172822j1877895j1437416n923986M671692J4011622
1099.4H42373550J5033960P934809M63545J22488L197193J482010k471864j219631
1115.7H66916060K281726O12914l186822j773655J709461J04785l330290j601875J767159
1134H63499463l38912m447043k942801J697362J498103k012372j570940L22282k768934
1152.4H52936208o113648k663016K673327J647413l324568n079746n003929o469667
1168.7H28602374m214466N337000J2421906P911563K91705J62244K693116K41995l350198
1187.1H50097239j924276M96208j967013n340516m050076k273321n625904j0241330
1203.4H19171011j0634362r295762j0267854r051144P69735J0703027O480932q317470
$$ y = [859037220, 860085011, 860102355, 852929533, 841051638, 829614222, 823690236, 828361928, 842373550, 857407510, 865342319, 865805864, 865928352, 869125545, 870607555, 868135691, 866916060, 869197786, 869810700, 866623878, 864850223, 866559684, 866664469, 863334179, 861732304, 863499463, 863160551, 858713508, 855770707, 857468069, 858966172, 856953800, 855382860, 855705142, 852936208, 846822560, 844159544, 846832871, 848480284, 845155716, 840075970, 835072041, 828602374, 824387908, 829724908, 842146814, 850058377, 850350082, 850512326, 853205442, 853447437, 850097239, 848172963, 848669171, 846702158, 841361642, 837311566, 835038245, 829412341, 819171011, 808536649, 799240887, 788973033, 779921889, 780691624, 791394651, 797875583, 789558113]
1219.7G89558113k0992399k7316868k4027169o255150J8297792L2213092K8984606
1234G90462017J8696189J2230933Q280754J052201q146942j6340315k4514318k4629772
1250.3G57090747l881693K3959876L0985117J7095983K497732l408193o526471j1223197
1266.6H06589901j1686265n945504k785623o405055r431959o608188j220226L522575
1282.9G66029656Q636057J5689910K1302044J8894315J0846019N777359L376305j294792
1299.2H49256873n016804k350270L712654O823003O750286O667196N164862o1214m318714
1317.6H66627872k884269L42369J26303r59516J211703L661811J968503m26292J126408
1336H70794892K621889r94980m376590j240730L245949K303958n44846O98328K484858
$$ y = [789558113, 768565714, 741248846, 717221677, 710966527, 729264319, 761477411, 790462017, 809158206, 821389139, 829669893, 830722094, 822575152, 806234837, 781720519, 757090747, 753209054, 777168930, 808154047, 825250030, 827747762, 824339569, 817813098, 806589901, 794903636, 788958132, 786172509, 779767454, 770335495, 763727307, 762507081, 766029656, 774665713, 790355623, 811657667, 830551982, 841398001, 847175360, 850551665, 849256873, 844240069, 841889799, 845602453, 852425456, 859175742, 865842938, 871007800, 870946586, 866627872, 863743603, 864085972, 864212275, 863252759, 864464462, 868126273, 870094776, 869668484, 870794892, 873416781, 872421801, 868045211, 866804481, 870050430, 872354388, 871809542, 872507870, 874992728]
1354.3H74992728J72258j888275M18543K300382p91013l233969j195133O13808j905500
1372.7H69483829n077422m101217l018379n710840o868899j218140N837202N390882
1389H54717016J348555J074612N55993m126132n221009K311647Q430540N569220M05609
1407.3H65066051O55711J784027o17326k184569K38478K020418p86542k777219j097620
1425.7H62301409K58923k305746m445017k238929j201272m305839m677952k766311
1442H40619266o042719j1037469k159476J3610482J3893604M893482j525044l632188
1458.3H48619938l076315l281832l286421j216829L01123j300633m607797n351364
1474.7H26799870n576313q882940j2490809j3290703j2443841j2793541j2396931j0150671
$$ y = [874992728, 875164986, 873276711, 873695254, 875995636, 875204623, 871970654, 870775521, 871389329, 869483829, 864406407, 860305190, 857286811, 851575971, 844707072, 843488932, 849326134, 854717016, 856065571, 857140183, 857696176, 853570044, 848349035, 850660682, 859091222, 864660442, 865066051, 865721762, 867505789, 866888463, 864703894, 864942372, 866962790, 866176248, 863399029, 862301409, 862560332, 860254586, 855809569, 853570640, 852369368, 848063529, 843385577, 840619266, 834576547, 823539078, 821379602, 834990084, 848883688, 853777170, 852252126, 848619938, 845543623, 842261791, 838975370, 837758541, 838059664, 836759031, 832151234, 826799870, 821223557, 812340617, 799849808, 786559105, 774115264, 761321723, 748924792, 738774121]
1491G38774121j1403859k0680725l4734309l6955953k7494073j6053497Q210241N2639962
1507.3F52301908N5798947L4936786K4458349J3565123J714945r864331k1544694k5161803
1523.6G26205230k5436640l0940950l0810773k4440110j4585257q30173J3730109L6642015
1539.9F49533451M9983322L9929986L0232728K3607731K0406127J5689551J0485709
1554.2H39868605Q743644R655654N351127O83784K391815M005671J688659k275109
1570.5H70113850k100408J88529n85914j898229j44481M31835k256989n386651p332802
1588.9H51028740r718835j2606680j4696718j2405753j043915J3315558J7378986J1755645
1605.2H43007028O037116J655400j126289o26505J18017k397000l548205j293302k20418
$$ y = [738774121, 727370262, 706689537, 671955228, 634999275, 607505202, 591451705, 599661946, 652301908, 708100855, 743037641, 767495990, 781061113, 782776058, 772911727, 751367033, 726205230, 700768590, 669827640, 639016867, 614576757, 599991500, 599161327, 612891436, 649533451, 699516773, 739446759, 769679487, 793287218, 813693345, 829382896, 839868605, 848612249, 858267903, 863619030, 864302814, 866694629, 870700300, 872388959, 870113850, 868013442, 868201971, 867616057, 865717828, 865573347, 866005182, 863748193, 858361542, 851028740, 841309905, 828703225, 814006507, 801600754, 800556839, 813872397, 831251383, 843007028, 849044144, 850699544, 849573255, 848946750, 849064767, 846667767, 843119562, 841826260, 841605842]
1623.5H41605842j907885l012896j144170J654207K503455J231134O99878J633644
1639.9H43263209J443744J184046L010809M193545K698481K530396K728700J201868
1656.2H62254798L90888M99963J833678K578556J451850P60198J656294K508223J286745
1674.5H75221193n69642M66526K647519K577007l93331j094461M12047q0109p51912
1692.9H78434837Q21829K681374J273453j576125r69708M47631r05574k091527n22196
1711.3H77593994J523376J428425o44743j360834n34594q36790j056731Q05498K739787
1729.6H79657388K262473J64449n61476M54188k6167j160502q1062J483559Q67546
1748H83060396r74298j075148L3497l20375j108288Q7201J350582K52545p67470J94908
$$ y = [841605842, 839697957, 836685061, 835540891, 837195098, 839698553, 840929687, 841629565, 843263209, 844706953, 845890999, 848901808, 853095353, 855793834, 858324230, 861052930, 862254798, 862645686, 863145649, 864979327, 867557883, 869009733, 869769931, 871426225, 873934448, 875221193, 874651551, 875118077, 877765596, 880342603, 879949272, 878854811, 879266858, 879186749, 878434837, 879256666, 881938040, 883211493, 881635368, 880665660, 881113291, 880207717, 878116190, 877593994, 879117370, 880545795, 879901052, 878540218, 878005624, 877168834, 876112103, 876917601, 879657388, 881919861, 882084310, 881522834, 881977022, 881950855, 880790353, 880709291, 882192850, 883060396, 882086098, 881010950, 881044447, 880724072, 879615784, 879702985, 881053567, 881306112, 880538642, 880733550]
1768.4H80733550J323282j32858j948655p09832R70006M16100r80854n23031N97299
1786.7H79745007M14609k22086N5253N81861N602q60750o94156l39687j378238k548456
1807.1H74758959j755834R2209M40299J0431Q34703J873672J182258j82747k22981
1825.5H77030969N91099J64330q79705q5890J196503O63579l79384K46406J189470
1843.8H79737377J36852j144290o19173L11494j54078r93073l34561P36416K95222
1862.2H77972186n85139j37031L48866r14634j907765q97408N46992M63843l90291
1880.5H74499619j25587N62966N6505r41694o80029L95477L17514n14269j63615P48396
1900.9H74155283L21209p26461n37276J72496m08948j407683q23676O60300P99954
$$ y = [880733550, 882056832, 881923974, 879975319, 879265487, 880235493, 880651593, 879670739, 879147708, 879745007, 880159616, 879937530, 879992783, 880574644, 880580246, 879719496, 879025340, 878685653, 877307415, 874758959, 873003125, 873095334, 873535633, 873546064, 874380767, 876254439, 877436697, 877253950, 877030969, 877622068, 877786398, 876906693, 876820803, 878017306, 878680885, 878301501, 878547907, 879737377, 879874229, 878729939, 878110766, 878422260, 878268182, 877275109, 876940548, 877676964, 877972186, 877387047, 877250016, 877598882, 876684248, 874776483, 873879075, 874426067, 874889910, 874499619, 874374032, 874936998, 874993503, 874051809, 873371780, 873767257, 874084771, 873570502, 873406887, 874155283, 874476492, 873750031, 873212755, 873385251, 872976303, 871568620, 870744944, 871405244, 872205198]
1919.3H72205198p6115m2796N50925K13504p27057p76470j97053l10779o14524J31429
1939.7H70356262J052439M55081p79748q46326l83377q43525j529515q20696N73933
1958.1H67234528O65426k87473m98176p9393l51906p40051J48296J503647J479804
1976.4H69074702M11988P8439M24683J26779m97698j53184O43313L20017o18100n49555
1996.8H69261384J08540m0770o31630l32951M25338K32101n38826m59373J80125l8028
2017.2H68165910q16405o85632m5538q2969k76566J18434N36263K08617m36306k69115
2037.6H66416693M15921K84314m74751n02407Q3982K4081n21898l23952L93570K94327
2058H66089880m46498m56750J59681J06751m57465k82705M08530L23951l94582m26352
$$ y = [872205198, 872129083, 872086287, 872637212, 872850716, 872123659, 871347189, 871150136, 870839357, 870224833, 870356262, 871408701, 871863782, 871084034, 870237708, 869854331, 869010806, 867481291, 866660595, 867234528, 867899954, 867612481, 867114305, 867034912, 866683006, 865942955, 866091251, 867594898, 869074702, 869486690, 869565129, 869989812, 870116591, 869618893, 869465709, 870109022, 870429039, 869810939, 869261384, 869369924, 869329154, 868697524, 868364573, 868789911, 869022012, 868483186, 868023813, 868203938, 868165910, 867349505, 866663873, 866618335, 866535366, 866258800, 866377234, 866913497, 867122114, 866685808, 866416693, 866832614, 867116928, 866642177, 866139770, 866223752, 866247833, 865725935, 865401983, 865795553, 866089880, 865643382, 865186632, 865346313, 865453064, 864995599, 864712894, 865121424, 865445375, 865050793, 864624441]
2078.4H64624441J73151J55628m02808k82705L66926K75910m17113m26770J66059J49906
2098.8H64382625l84987k71141L59118L02732l44992l98874J01447N9724m30048k92182
2119.2H63083422L14653K59578l73721m22358J39773J78158l17812k39790L27707K43664
2139.6H63193274m11392m67598R4771J79589k64645k21312L14653K94388k80977l21507
2160H62109244K02238K21193k94625k93077K90931L44038k80559m06206J33812K28823
2180.4H62255812k13981j72734L61383L31342k99394m29630M9173J07825l15010k38955
2200.8H61435831L33547L29316l13342m65750r835K6941l89755k87473K88129K81334
2221.2H61228943l20494m23789O7591J27912l02613k53856K57611K37346l30806m15921
$$ y = [864624441, 864797592, 864953220, 864550412, 864267707, 864634633, 864910543, 864493430, 864066660, 864232719, 864382625, 863997638, 863726497, 864085615, 864388347, 864043355, 863644481, 863745928, 863805652, 863375604, 863083422, 863398075, 863657653, 863283932, 862861574, 863001347, 863179505, 862861693, 862621903, 862949610, 863193274, 862781882, 862314284, 862409055, 862588644, 862323999, 862102687, 862417340, 862711728, 862430751, 862109244, 862311482, 862532675, 862238050, 861944973, 862235904, 862579942, 862299383, 861893177, 862026989, 862255812, 862041831, 861869097, 862230480, 862561822, 862262428, 861832798, 861881971, 861989796, 861674786, 861435831, 861769378, 862098694, 861785352, 861319602, 861309767, 861336708, 860946953, 860659480, 860947609, 861228943, 860908449, 860484660, 860552251, 860680163, 860377550, 860123694, 860381305, 860618651, 860287845, 859871924]
2241.6H59871924N2929Q2671l56614k80619K91705K92302k93732l88086O0081O8129
2262H59400690l55304k44558L40522L17693l47198n38885r4295O736l77357l27885
2282.3H57780159K17378K72274k91884m61340j5617J08183k59042k43127K23875J82509
2302.7H57513368m80413o98150k45690j42574n57423n03063J06752K65002k77519n24819
2323.1H54455471j04010N305m11630k60949M87387M24504m66764q18371l65913J3590
2343.5H52958620J46567M91739P67767M44949n10812j084030o91056l83854m25517
2361.9H51714373O2346Q36670O67036k27511m11391J31786K71976m5598L4094M60386
2382.3H53494167L21925l67105n44071n2750J01447k26557j42098L42906K70843l58522
$$ y = [859871924, 859924853, 860007524, 859650910, 859370291, 859661996, 859954298, 859660566, 859272480, 859332561, 859400690, 859045386, 858800828, 859141350, 859459043, 859111845, 858572960, 858478665, 858485401, 858108044, 857780159, 857997537, 858269811, 857977927, 857516587, 857500970, 857609153, 857350111, 857106984, 857330859, 857513368, 857032955, 856334805, 856089115, 855946541, 855389118, 854886055, 854992807, 855257809, 854980290, 854455471, 854351461, 854356766, 853945136, 853684187, 854171574, 854596078, 854129314, 853310943, 852945030, 852958620, 853105187, 853596926, 854364693, 854809642, 854298830, 853214800, 852523744, 852139890, 851714373, 851776719, 852613389, 853280425, 853052914, 852641523, 852773309, 853045285, 852999687, 853033781, 853494167, 853816092, 853448987, 852904916, 852852166, 852953613, 852727056, 852584958, 852927864, 853198707, 852840185]
2402.7H52840185n11288o5208L6001l22759k61068K76983K93552l36349n35369n4597
2423.1H51360083J32858k17616k46704J77682J74641l76820n06103k3961J12414k43068
2443.5H50343406j98126L16918L32952k79546m46439K4855Q5533l93927m08113J37925
2463.9H49515438J98245l95357n77748j26362k027l44515k79069K38777K40624l87967
2484.3H48080039n78344r6440P3492k86460k85208K20418K59638l23296m79281k8133
2504.7H46556425K6763m18485m03404J48535K32458l32236n12243n7637Q8751k69473
2525.1H45059454k61843K32280K65479l22700n02467m1783P7784l22699l34144J78695
2545.5H44028056K64048l28302n75364r4831J34945k19464k36511K73704K93613l95835
$$ y = [852840185, 852328897, 852263689, 852299690, 851976931, 851715863, 851992846, 852286398, 851950049, 851414680, 851360083, 851492941, 851275325, 851028621, 851206303, 851380944, 851004124, 850498021, 850474060, 850586474, 850343406, 850145280, 850462198, 850795150, 850515604, 850069165, 850094020, 850179553, 849785626, 849377513, 849515438, 849713683, 849318326, 848740578, 848614216, 848612189, 848267674, 847988605, 848227382, 848468006, 848080039, 847501695, 847405255, 847478747, 847192287, 846907079, 847127497, 847387135, 847063839, 846584558, 846556425, 846583188, 846164703, 845761299, 845909834, 846142292, 845810056, 845297813, 845240176, 845328927, 845059454, 844797611, 845029891, 845295370, 844972670, 844470203, 844428420, 844506204, 844183505, 843849361, 844028056, 844292104, 843963802, 843388438, 843293607, 843428552, 843209088, 842972577, 843246281, 843539894, 843144059]
2565.8H43144059o83069k08259K0981l33011l85582J00553J69038m44114o75320j94192
2586.2H40511084j1564l91662l93629J91152L88503j58965m88878j10745J11639j94191
2606.6H39452744k22207K41638L15725k99274o24001j48714J91808q8692j46210K92241
2627H38965058L40283k73764n73218j11818J42932k46167l53456J05322J72495m26232
2647.4H37741435o97673k38597L7849k67565l33786J13248J89722m01855p13288k97487
2667.8H35132003L278k55525k97010J82211K66016l72350p21693l14653n0783l57032
2688.2H33214462m24922M1068J56164m03702p16150l64244j36554m17173m77672l6299
2708.6H30434978K4319n78285q68082m64916j93536m43757n21838q8394L8683m95076
$$ y = [843144059, 842460990, 842252731, 842273712, 841940701, 841555119, 841655672, 841824710, 841380596, 840705276, 840511084, 840499520, 840107858, 839714229, 839905381, 840293884, 840134919, 839646041, 839535296, 839646935, 839452744, 839230537, 839472175, 839787900, 839488626, 838864625, 838715911, 838907719, 838819027, 838672817, 838965058, 839305341, 839031577, 838458359, 838346541, 838489473, 838243306, 837889850, 837995172, 838167667, 837741435, 837043762, 836805165, 836843014, 836575449, 836241663, 836354911, 836544633, 836142778, 835429490, 835132003, 835135281, 834879756, 834582746, 834764957, 835030973, 834658623, 833936930, 833622277, 833571494, 833214462, 832789540, 832830608, 832986772, 832583070, 831866920, 831502676, 831366122, 830948949, 830471277, 830434978, 830459297, 829881012, 829012930, 828548014, 828354478, 827910721, 827388883, 827300489, 827339172, 826844096]
2729H26844096o92785j27375K79308J7285j80960J69337L50893p0393l77536j57357
2749.4H26054513k4974l01421l64244L4214J18374m14908o94215l02553r000k82824
2769.8H23812962m65990j61945j55807p77125j091123o62804k68995l54529l51727
2788.2H19522917k5391j3531n00142p19130m00901k65658n18620m67479Q1062K97487
2808.6H16990614k86579p91609n00262j08302j89960j57654L40462N79834J09255k99573
2828.9H15686226m0591K46942Q285j80304j3292j30415o61552q82148n19097k60234
2849.3H13253820m40896m36604L6836L17216q4400n32449l34382m8935l33428n50568
2869.7H10846210j72019p3314p05719j036883n70416j72913l88086o23822l95835k45511
$$ y = [826844096, 826151311, 826023936, 826303244, 826320529, 826139569, 826308906, 826659799, 826589406, 826211870, 826054513, 826029539, 825728118, 825363874, 825398088, 825516462, 825101554, 824407339, 824104786, 824095786, 823812962, 823346972, 823185027, 823029220, 822252095, 821160972, 820498168, 820229173, 819874644, 819522917, 819497526, 819483995, 818983853, 818264723, 817863822, 817598164, 817079544, 816612065, 816693127, 816990614, 816704035, 815912426, 815412164, 815303862, 815113902, 814956248, 815296710, 815876544, 815985799, 815686226, 815645635, 815892577, 815900862, 815720558, 815707266, 815576851, 814915299, 814033151, 813514054, 813253820, 812812924, 812376320, 812413156, 812730372, 812645972, 812113523, 811779141, 811730206, 811396778, 810846210, 810674191, 810600877, 809895158, 808858275, 808287859, 808114946, 807726860, 807103038, 806707203, 806461692]
2890.1H06461692n79715q31842o84619o33300q59022q70704m91620l24189o84083r06348
2910.5G99596250o32048n92172j131832j496852j235902r05931j051128j168072q11756
2928.9G90570557p06255j125634j326084j150012j232982j775980k272189k424955
2945.2G78556466k606273l038942l294349l300905l575385m179537m534364m329622
2961.5G49697089m079401m178226m195512l734886l003300k141773o49035J853168
2977.8G29568124M591048O494879P552028Q067012P683635O302058M707337L526807
2994.2G78492928K621650J820743J517594J817465J893044J335442Q72671R89437J053810
3012.5G92414784L90888o37353j386046j783490j794219j401902q12530J21653J099467
$$ y = [806461692, 805881977, 805050135, 804365516, 803732216, 802873194, 802002490, 801510870, 801186681, 800502598, 799596250, 798964202, 798372030, 797240198, 795743346, 794507444, 793601513, 792550385, 791382313, 790570557, 789864302, 788738668, 787412584, 786262572, 785029590, 783253610, 780981421, 778556466, 775950193, 772911251, 769616902, 766315997, 762740612, 758561075, 754026711, 749697089, 745617688, 741439462, 737243950, 733509064, 730505764, 728363991, 727714956, 729568124, 734159172, 740654051, 748206079, 756273091, 763956726, 770258784, 774966121, 778492928, 781114578, 782935321, 784452915, 786270380, 788163424, 789498866, 790371537, 791360974, 792414784, 792805672, 792168319, 790782273, 788998783, 787204564, 785802662, 784990132, 785111785, 786211252]
3030.9G86211252J328707R71198M65095k14159p11561n52654m39405j276195k216816
3049.2G83565462k117277j480519j240731j058578N1379J653910K228975J627088Q40783
3067.6G84070492P2717r67919j863122j884759j201391p38204q59320j159191j506150
3085.9G73963153k009749k403975k445221k344906k427339k585710k711951l139377
3102.2G53894925l859937m309833m369855m470289m557490m339039m036069l941298
3118.6G20011115m110396m001558k806782q43883Q78692K072811L139675M216551M968047
3136.9G23524272N233288N253017N304337N274951N099356N024851M860997M102945
3153.2G63678014L146291K832472K895415K676368K338469K198637J988232J450777
$$ y = [786211252, 787539959, 788511157, 788976252, 788762093, 788050532, 787497878, 787058473, 785782278, 783565462, 781448185, 779967666, 778726935, 777668357, 777719736, 779373646, 781602621, 783229709, 784070492, 784143209, 783175290, 781312168, 779427409, 778226018, 777487814, 776628494, 775469303, 773963153, 771953404, 769549429, 767104208, 764759302, 762331963, 759746253, 757034302, 753894925, 750034988, 745725155, 741355300, 736885011, 732327521, 727988482, 723952413, 720011115, 715900719, 711899161, 709092379, 708248496, 709127188, 711199999, 714339674, 718556225, 723524272, 728757560, 734010577, 739314914, 744589865, 749689221, 754714072, 759575069, 763678014, 766824305, 769656777, 772552192, 775228560, 777567029, 779765666, 781753898, 783204675]
3169.6G83204675R69887R35375J057625R02712O50406O41406N91576J56403k63811
3187.9G88846254k24709l0756q6129k40505k24530k30611n14090p30991n18799k01762
3208.3G85843372j67310k18034j15692j15156m42207p68006p09534n02407n23866n59032
3228.7G81722128l16858k56836q37267j355529j123249o80924n80847n81086n14328
3247.1G75475204o42300r22620r57131p53641p31946r26017r99034q48889p34091p98166
3267.5G67161369q36789r01461j109242j333237j437843j284659j163840j418769j737535
3285.8G55937994j716614j518786j684308k252221k754450l238261l939033m617452
3302.1G34216869n438745p347167j0935485j5976310k1810889k5765538k1213472l231347
$$ y = [783204675, 784174562, 785109937, 786167562, 787070274, 787720680, 788362086, 788953662, 789110065, 788846254, 788621545, 788590789, 788504660, 788264155, 788039625, 787809014, 787294924, 786563933, 786045134, 785843372, 785676062, 785458028, 785342336, 785227180, 784784973, 784016967, 783307433, 782805026, 782281160, 781722128, 781405270, 781148434, 780311167, 778955638, 777832389, 777151465, 776570618, 775989532, 775475204, 774832904, 773910284, 772953153, 772199512, 771467566, 770541549, 769542515, 768693626, 767959535, 767161369, 766324580, 765423119, 764313877, 762980640, 761542797, 760258138, 759094298, 757675529, 755937994, 754221380, 752702594, 751018286, 748766065, 746011615, 742773354, 738834321, 734216869, 728778124, 721430957, 710495472, 694519162, 672708273, 646942735, 625729263, 622497916]
3318.4F22497916K0650327L4109891L0743420J9066811R058535L428161N90741o90937
3334.8G39454865r68158j211166j740098j988471j951277j902580j923561k233684
3351.1G25535870k599419k582252k383530k271175k261758k326429k311110k234757
3367.4G06565440k403558k818226k911985k500415k090812k044976k298772k415955
3383.7F87080741k121329j616598j175761j164794j547217j666367j343668j145661
3400F75299346j500248j891494j652479j156092r42826j054764j393855j519680j131415
3418.4F63056493p91431q10802p09295l48091j62065l53754l55243K0921L099m40240
3438.8F59109592m09007J59860M90010L11494O0796J77682M94897P00414Q77321J036346
$$ y = [622497916, 643148243, 677258134, 708001554, 727068365, 736126900, 739555061, 740145802, 739454865, 738486707, 737275541, 735535443, 733546972, 731595695, 729693115, 727769554, 725535870, 722936451, 720354199, 717970669, 715699494, 713437736, 711111307, 708800197, 706565440, 704161882, 701343656, 698431671, 695931256, 693840444, 691795468, 689496696, 687080741, 684959412, 683342814, 682167053, 681002259, 679455042, 677788675, 676445007, 675299346, 673799098, 671907604, 670255125, 669099033, 668156207, 667101443, 665707588, 664187908, 663056493, 662265062, 661454260, 660744965, 660396874, 660234809, 659881055, 659525812, 659546733, 659549832, 659109592, 658700585, 658860445, 659350455, 659661949, 659722745, 659900427, 660395324, 661095738, 661973059, 663009405]
3459.2F63009405Q71360O50049R43660J276136R29654L85522M81069R64404J238882
3477.5F70750141J095593O78480O49571J009762J052261R29057J088322J228511J094163
3495.9F79575861R31084J114547J389027J118779Q14795J101434J365424J260519J095235
3514.2F89766705J053572J157820J364589J636922J611710J211643R14097R09447J213193
3532.6G00839698J615167J582146J326918J582682J971305J701951J008808Q64983
3548.9G12493658J247644J361430J309395J543343J769066J641631J475990J597822
3565.2G24439979J650214J379669J299679J562655J783967J721978J760602K143741
3581.5G37742484K465903K339125J805067J551986J736462J778066J778185K049804
$$ y = [663009405, 663880765, 664530814, 665474474, 666750610, 667680264, 668065786, 668546855, 669511259, 670750141, 671845734, 672524214, 673173785, 674183547, 675235808, 676164865, 677253187, 678481698, 679575861, 680506945, 681621492, 683010519, 684129298, 684944093, 686045527, 687410951, 688671470, 689766705, 690820277, 691978097, 693342686, 694979608, 696591318, 697802961, 698717058, 699626505, 700839698, 702454865, 704037011, 705363929, 706946611, 708917916, 710619867, 711628675, 712493658, 713741302, 715102732, 716412127, 717955470, 719724536, 721366167, 722842157, 724439979, 726090193, 727469862, 728769541, 730332196, 732116163, 733838141, 735598743, 737742484, 740208387, 742547512, 744352579, 745904565, 747641027, 749419093, 751197278, 753247082]
3597.9G53247082K136529J893758J890481K112150K086461J758218J594841J704574
3614.2G68424094J770913J695335J526416J409709J468182J494050J285076R30905
3630.5G80004680P91192Q09252Q32141R39846J007974R66072J180947J654863J501859
3648.8G89688826K55644k81036K09808N17667K15828r7632n365M58420Q16166P00951
3669.2G92479277M75585M50313j08301q36194o11722j54675K38657Q09014J309574
3687.6G94051528O60360o13570o34551p0930J88649J97053J53541K19345L89517M52697
3708G94993639J99497l27170m91083k23040J21355L74376K41638k03193l91066l1769
3728.4G94263184N16355Q44777O34193Q047l54469l66211l35157k34008O9618J22250
$$ y = [753247082, 755383611, 757277369, 759167850, 761280000, 763366461, 765124679, 766719520, 768424094, 770195007, 771890342, 773416758, 774826467, 776294649, 777788699, 779073775, 780004680, 780795872, 781605124, 782437265, 783377111, 784385085, 785351157, 786532104, 788186967, 789688826, 789944470, 789663434, 789873242, 790390909, 790606737, 790509105, 790503740, 790962160, 791778326, 792479277, 792954862, 793405175, 793296874, 792460680, 791848958, 791694283, 791932940, 792741954, 794051528, 794711888, 794098318, 793463767, 793392837, 793581486, 793778539, 793932080, 794151425, 794540942, 794993639, 795193136, 794865966, 794374883, 794151843, 794273198, 794647574, 794889212, 794686019, 794294953, 794263184, 794779539, 795624316, 796258509, 796266556, 795912087, 795545876, 795210719, 794976711, 795046329, 795168579]
3748.8G95168579k00391m19080l44277l47197m82857m39763j81973k4677N1737O6877
3769.2G92846978k61486n56409k50995L00824K29061l54946l77655o4134j13130l47376
3789.6G91050732k90751R7274L26992K47538K13384J39058j72138n92828q02636l67880
3810G89848745J70708L20911K97129L70324O2406p26044p92921l21031j11818l2961
3830.4G89085448K33829O16491M86076l32058p36237m89652l46362j93417L44634Q49366
3850.8G89518118K65360j016557q52466j95384J50621J73390R0182J81317L0577m00960
3871.2G87944198m76122k69234o0082M0233P4089J57714o8307m73857l90709j69575
3891.6G86308348j81496n9128K60771L92437L3497n58793p47204m59552k12610j13427
$$ y = [795168579, 794968188, 794549108, 794204831, 793857634, 793374777, 792935014, 792753041, 792728364, 792780101, 792846978, 792585492, 792029083, 791778088, 792078912, 792307973, 791953027, 791575372, 791511238, 791398108, 791050732, 790759981, 790857255, 791184247, 791431785, 791645169, 791784227, 791612089, 791019261, 790216625, 789848745, 790019453, 790340364, 790637493, 791007817, 791070223, 790344179, 789551258, 789230227, 789118409, 789085448, 789319277, 789935768, 790421844, 790089786, 789353549, 788863897, 788517535, 788324118, 788668752, 789518118, 789783478, 788766921, 787914455, 787719071, 787869692, 788043082, 788133264, 788314581, 788345158, 787944198, 787468076, 787198842, 787138760, 787178993, 787253082, 787410796, 787342489, 786868632, 786477923, 786308348, 786126852, 786067724, 786328495, 786720932, 786754429, 786195636, 785448432, 784988880, 784776270, 784662843]
3912G84662843R5248K81870M8936l30925l33846j55330j23977j04010N5611J23381
3932.3G84219801q1956l14236k63393m8637n3346j62721n3167O7234p2777l06130l38733
3954.8G82591939j66118n0605j01089j14202K0265J5795k36809l23355j49012p8559
3975.2G81408250j28209m6850J15574Q4877j83344l24965j56342j3352o4731m2438
3995.6G80648470J03295
3997.6G80751765
$$ y = [784662843, 784758091, 785039961, 785088897, 784757972, 784424126, 784268796, 784144819, 784040809, 784096420, 784219801, 784137845, 783823609, 783560216, 783511579, 783458233, 783295512, 783242345, 783309579, 783236802, 782930672, 782591939, 782425821, 782375216, 782274127, 782159925, 782180190, 782195985, 781959176, 781635821, 781486809, 781408250, 781280041, 781233191, 781348765, 781433642, 781250298, 780925333, 780768991, 780755639, 780690908, 780648470, 780751765]
##END=$$ End of the data block
