##TITLE=L2O Kauen1 $$ Begin of the data block
##JCAMP-DX=5.00 $$ ACD/SpecManager v 10.08
##SPECTROMETER/DATA SYSTEM=Alpha
##DATE=24 Nov 2014 08:11:02
##DATA TYPE=INFRARED SPECTRUM
##DATA CLASS=XYDATA
##ORIGIN=
##OWNER=
##NPOINTS=1765
##FIRSTX=399.76428223
##LASTX=3997.64306641
##MAXX=3997.64306641
##MINX=399.76428223
##MAXY=1.00258362
##MINY=0.10810412
##XFACTOR=1.0000000000
##YFACTOR=0.000000010000000
##FIRSTY=1.00000000
##DELTAX=2.03961372
##XUNITS=1/CM
##YUNITS=ARBITRARY UNITS
##XYDATA=(X++(Y..Y))
399.8A00000000q06582j019800m80652j18345p48872j506567j267147m79973m89956
418.1I3082106j316607j173502m40484k35498p06190j039440o04951L0380J21230o598
438.5H7710446L88241J072138J166678O85441M66896O89995O68895N6213m70531k51257
458.9I2183155J81234o7485n74773l35044N69147J035267N68134j2738L0625N6112
479.3I3633634o50722j641041j918125j333767o32376j80936K38365P03937R09436
497.7H9128405P40039O18828Q32372R38702L82239n59622j034433r02015q09252j021433
518.1H8313830r31394k28936N13852P60919O96111Q82762J200319R91898K12014l58945
538.5I2052430j97548K39122K67691j1337j5015K61593K66326q1015k49308n0319P934
$$ y = [100000000, 99193418, 98173618, 97692966, 97574621, 96825749, 95319182, 94052035, 93572062, 93082106, 91765499, 90591997, 90151513, 89916015, 89209825, 88170385, 87565434, 87595814, 87717044, 87710446, 88098687, 89170825, 90337503, 91022944, 91489840, 92179835, 92848730, 92904943, 92434412, 92183155, 92364389, 92296904, 91722131, 91387087, 91956234, 92991501, 93559635, 93546897, 93577522, 93633634, 92982912, 91341871, 89423746, 88089979, 87457603, 87276667, 87515032, 88218969, 89128405, 89868444, 90487272, 91319644, 92258346, 92640585, 92080963, 91046530, 90144515, 89335263, 88313830, 87382436, 87153500, 87667352, 88428271, 89124382, 90007144, 91207463, 92199361, 92411375, 92052430, 91854882, 92094004, 92361695, 92350358, 92335343, 92596936, 92863262, 92782247, 92532939, 92482620, 92490554]
560.9I2490554m07088q68434q40222m65227l08966m07780k44510L09289O52528L90637
581.3I0300781n9951k08986k03949m23479p81304r28527r63330j368874k153003k616889
601.7H0592489k238124j363087p52312p16984r78184j478082k864182n408949p956892
620E6835693q685017o411468j708329K966660N617800N104086J887953J191569N448592
638.4F2247539R154915Q503402N556285K999145J529682R18793O86223M09346P7468
656.8I2082798J07658O46121J066231Q93349O59859Q08346P11835M01944J67751N3984
677.2I7599876L3557j11276l81916m79824l44616l12823n86700r76748j120406o67310
697.5I2651814K90120R23651P36362K93690P9954k1798k4569J16724J78415O4450j0890
$$ y = [92490554, 92083466, 91215032, 90374810, 89909583, 89600617, 89192837, 88948327, 89257616, 89910144, 90300781, 90240830, 90031844, 89827895, 89404416, 88623112, 87694585, 86731255, 85362381, 83209378, 80592489, 78354365, 76991278, 76238966, 75521982, 74543798, 73065716, 70201534, 64792585, 56835693, 48150676, 41739208, 40030879, 42997539, 48615339, 53719425, 55607378, 56798947, 62247539, 71402454, 79905856, 85462141, 88461286, 89990968, 90909761, 91595984, 92005330, 92082798, 92190456, 92836577, 93902808, 94796157, 95456016, 96264362, 96976197, 97378141, 97545892, 97599876, 97633433, 97522157, 97140241, 96660417, 96315801, 96002978, 95416278, 94439530, 93319124, 92651814, 92941934, 93865585, 94601947, 94895637, 94975591, 94953793, 94929224, 95045948, 95224363, 95288813, 95277923]
720I5277923P7302K03049J59770j97601p77293j301986j665169j908206j940668j691049
740.4H6236072j414127j577299k369899l457183m229992m248327l489912k307647j077241
758.7F2064445R9498J189500K104414K796822L296024L605753L675682L458052L034622
777.1H5324812K554297J993198J179224J22064q25333j219434q75145k0796R06259
795.4H9139146J650297K155161K272588J907063J320195Q68601N48762J38187l19773
813.8I9680227n87082n77694m47744l03179q8877J48470J05929n47183j854092k574425
834.2I2954350r06301J611608J902884N80270l30353n73218n71418m89181l05259r3520
854.6I3779862m5085k15840m38053n58215n70053n04816l09908M3511L94541N43261
$$ y = [95277923, 95355225, 95558274, 95718044, 95520443, 94743150, 93441164, 91775995, 89867789, 87927121, 86236072, 84821945, 83244646, 80874747, 77417564, 73187572, 68939245, 65449333, 63141686, 62064445, 62163943, 63353443, 65457857, 68254679, 71550703, 75156456, 78832138, 82290190, 85324812, 87879109, 89872307, 91051531, 91173595, 90348262, 89128828, 88253683, 88232887, 89139146, 90789443, 92944604, 95217192, 97124255, 98444450, 99313051, 99861813, 100000000, 99680227, 99093145, 98515451, 98067707, 97764528, 97675651, 97824121, 97930050, 97382867, 95528775, 92954350, 92048049, 93659657, 95562541, 96142811, 95812458, 95239240, 94667822, 94178641, 93873382, 93779862, 93734777, 93518937, 93080884, 92522669, 91952616, 91447800, 91137892, 91181403, 91575944, 92119205]
875I2119205N46741O52600Q74668R39804O30403Q4263k93666k84886q5128J7596n6363
897.4I5145237k36290m38756o88112j036960j345366j305801p87669L5000P98589J114654
917.8I1254526Q44044K62201j81693l05355j92451O6072L35013L46202j40613r76652
938.2I1311294q77536O83272J567680Q43912J8627k95592l88944l75193l36599l68739
958.6I1782182m77969n74756n97113n80782n89520n99855n61178m93735m83256n44721
979H6279297o02740o06543o05792o97577r01133j148253j383126j446009j129210p32416
999.4G7026498o93226q74656r96369j040316j071268j212317j644724k266121k441663
1017.8F4785838j679522m88257J58906j06126p71570j027853p30735m62061o23941
$$ y = [92119205, 92665946, 93318546, 94193214, 95133018, 95763421, 95847684, 95554018, 95269132, 95184004, 95201600, 95145237, 94908947, 94470191, 93782079, 92745119, 91399753, 90093952, 89306283, 89341283, 90139872, 91254526, 92098570, 92360771, 92179078, 91873723, 91681272, 91747344, 92082357, 92428559, 92287946, 91311294, 90433758, 91117030, 92684710, 93528622, 93547249, 93251657, 92862713, 92487520, 92150921, 91782182, 91304213, 90729457, 90132344, 89551562, 88962042, 88362187, 87801009, 87307274, 86824018, 86279297, 85676557, 85070014, 84464222, 83766645, 82865512, 81717259, 80334133, 78888124, 77758914, 77026498, 76333272, 75458616, 74462247, 73421931, 72350663, 71138346, 69493622, 67227501, 64785838, 63106316, 62618059, 62776965, 62670839, 61899269, 60871416, 60140681, 59678620, 59054679]
1036.1E9054679j079685j575672k025092k397430k564275k380953j869201j319424
1052.4D3842947j148572j551345k323374l062362l460708l428516l070479k551625
1068.8B3245966k067722j854014j904650j878149j589796j189048q61628o35833l95543
1087.1A0869583n9171L02886N48082O04171M84520K67630L8291j57301k98847k63658
1107.5A2336186O2436M08340N03676M85309M20202M18037J143579K358291K562549
1125.9B0698605J727669J111111R66447Q77098O63406M00048K10670J18491N5307K5994
1146.3B6854846K38708Q59311J727003K502527L010729L303013L510615L694716L815758
1164.6D9517226L797603L594077L200238K625168J958632J510299J611769K078444
$$ y = [59054679, 57974994, 56399322, 54374230, 51976800, 49412525, 47031572, 45162371, 43842947, 42694375, 41143030, 38819656, 35757294, 32296586, 28868070, 25797591, 23245966, 21178244, 19324230, 17419580, 15541431, 13951635, 12762587, 11900959, 11265126, 10869583, 10810412, 11113298, 11661380, 12265551, 12750071, 13017701, 13055992, 12898691, 12599844, 12336186, 12398622, 12806962, 13310638, 13795947, 14216149, 14634186, 15777765, 18136056, 20698605, 22426274, 23537385, 24503832, 25380930, 26044336, 26444384, 26655054, 26773545, 26828852, 26854846, 27093554, 27952865, 29679868, 32182395, 35193124, 38496137, 42006752, 45701468, 49517226, 53314829, 56908906, 60109144, 62734312, 64692944, 66203243, 67815012, 69893456]
1180.9F9893456K341282K149546J676744J101834M57620k29960q11190j055544q41511
1199.3G4682277k47114M94688J106036J414377J424235J218378Q86691N44816L08496
1217.7H1832880K14439K00224K10762K40732K54333J61242p2491l82817o76989q93158
1238.1H1089157r80729q98868o81364m39912k84613k13736j56146p4923J5735R4211
1258.4G7468812J37467O0951k94679r64415j603371j745218j360595q96055p46178
1276.8G0056719j007188j532954j911133j749420j140511n03034p8416J51342K27410
1295.2F2512815J15168j27697k95591k25735M4835L59839N84155O55949N94819M86737
1315.6F4705294M65924N79441P21359P29763N30768J72722k35486n95772q16733q46004
$$ y = [69893456, 72234738, 74384284, 76061028, 77162862, 77620482, 77390522, 76579332, 75523788, 74682277, 74435163, 74929851, 76035887, 77450264, 78874499, 80092877, 80979568, 81524384, 81832880, 82047319, 82247543, 82458305, 82699037, 82953370, 83114612, 83042121, 82659304, 81982315, 81089157, 80108428, 79209560, 78528196, 78088284, 77803671, 77589935, 77433789, 77358866, 77374601, 77468812, 77606279, 77667230, 77372551, 76408136, 74804765, 73059547, 71698952, 70802897, 70056719, 69049531, 67516577, 65605444, 63856024, 62715513, 62212479, 62134063, 62285405, 62512815, 62627983, 62500286, 62204695, 61978960, 62023795, 62383634, 62967789, 63623738, 64218557, 64705294, 65171218, 65750659, 66472018, 67201781, 67732549, 67905271, 67669785, 67074013, 66257280, 65411276]
1336F5411276p44290o38878o81645r54669j365656j696414j852935j829827j603162
1354.3E4043800j192105p42167m30614l11923l10749k48027k4587K61259L72243K60711
1374.7E1677841o5798p97051k022075k441553o55776J852050K228487R38725M9472
1393.1E0764322m70853q08328p70572k60860N24250J345587J884538K062642K016187
1411.4E6286913J696575J281446J026547R18919P35539O19197N00882J67155m16666
1429.8F2816507j072348j615333k593821l349913k585810j721728j156375k82329J331171
1448.1D9770021K991301L592330L386158L198946K097088j82367j832371l298098l288323
1466.5E6434685j235324Q12530K057642J675141R80592J451963K582586L411364L427542
$$ y = [65411276, 64666986, 64028108, 63346463, 62391794, 61026138, 59329724, 57476789, 55646962, 54043800, 52851695, 52109528, 51678914, 51366991, 51056242, 50808215, 50783628, 51044887, 51417130, 51677841, 51612043, 50814992, 48792917, 46351364, 45695588, 47547638, 49776125, 50714850, 50764322, 50293469, 49485141, 48714569, 48453709, 48977959, 50323546, 52208084, 54270726, 56286913, 57983488, 59264934, 60291481, 61210400, 61945939, 62565136, 63066018, 63233173, 62816507, 61744159, 60128826, 57535005, 54185092, 51599282, 49877554, 48721179, 48438850, 49770021, 52761322, 56353652, 59739810, 62938756, 65035844, 64853477, 63021106, 59723008, 56434685, 55199361, 56011891, 58069533, 59744674, 60725266, 62177229, 64759815, 68171179, 71598721]
1484.9G1598721L227043L126043K606535J578939Q65096M55749J01083l9059j8310
1503.2H3501840R626j30201k81703l35378m09269n11849o11847p06965j033211j296037
1523.6G8195006j456446j807284k008349k484745l483891l324181k571964k054751
1539.9E9003395N11795L607428M983860M735506L730130K153450O76728k01237j397920
1558.3G7803135k724451k344614k546525k837306k048552o2639J782191K174675R82452
1576.6G0178366j121354k342773l054672l438622l489572l137976k453184j879999
1593D9260214j732150j588395j028013m80879p15401j579520k248803k271033j671642
1611.3C5944378q11848P0694J049197J651794K200129L117088L425831L417599L465986
$$ y = [71598721, 74825764, 77951807, 80558342, 82137281, 83002377, 83458126, 83559209, 83520150, 83501840, 83511466, 83381265, 83099562, 82764184, 82354915, 81843066, 81231219, 80524254, 79491043, 78195006, 76738560, 74931276, 72922927, 70438182, 66954291, 63630110, 61058146, 59003395, 59515190, 63122618, 68106478, 72841984, 76572114, 78725564, 79402292, 79201055, 77803135, 75078684, 72734070, 70187545, 67350239, 65301687, 65239048, 67021239, 69195914, 70178366, 69057012, 66714239, 63659567, 60220945, 56731373, 53593397, 51140213, 49260214, 47528064, 45939669, 44911656, 44430777, 43715376, 42135856, 39887053, 37616020, 35944378, 35132530, 35203224, 36252421, 37904215, 40104344, 43221432, 46647263, 50064862, 53530848]
1629.7E3530848L115284L092969L751248L292877K275478J922048J680636J610112
1646G4271500J419139Q63159O26468M33094N2118o5768j15406k51675l57634l22640
1666.4G6552355l50171m66549m37320l52198j75863J52773M26268P69186J305056J358163
1686.8G8781700J290149J397198J301968J371229J419097J141524R85045P69054P65956
1705.1H9222920R20981R14759R15175R61697R98801R11761N49245K83235K47186K57027
1725.5I6182787K21432K07001K44695L55035L55905K63935K95389L52257L49874K94554
1745.9I9122864K16246J64085J46056J05279L8558p325K1672O0040L0321r227N722
1768.4I9894291O2168M3541k1124o4301m2445m3630j51957l54272m08607j12760K69550
$$ y = [53530848, 56646132, 59739101, 63490349, 66783226, 69058704, 70980752, 72661388, 74271500, 75690639, 76553798, 77180266, 77613360, 77665478, 77599710, 77484304, 77232629, 76874995, 76552355, 76202184, 75735635, 75298315, 74946117, 74770254, 74923027, 75349295, 76118481, 77423537, 78781700, 80071849, 81469047, 82771015, 84142244, 85561341, 86702865, 87687910, 88456964, 89222920, 90143901, 91058660, 91973835, 92935532, 93934333, 94846094, 95395339, 95678574, 95925760, 96182787, 96404219, 96611220, 96855915, 97210950, 97566855, 97830790, 98126179, 98478436, 98828310, 99122864, 99339110, 99503195, 99649251, 99754530, 99793088, 99785763, 99807435, 99867475, 99897796, 99888569, 99894291, 99956459, 100000000, 99978876, 99914575, 99872130, 99828500, 99676543, 99322271, 98913664, 98800904, 99070454]
1790.8I9070454L64655J83362R4008R7978O1065j4287k6405K9475O3121J4949m3506
1813.2I9894869k0194L3862L7080p624k7632P999M6098L737o6680m6503J4829K8420
1837.7I9898261q911k8044j1736M917k2566p0322p0291j9098P683k8920o5505l6645
1862.2I9548823K8854M0233k9343p5555k5058J5080j5002m9180k3109K9183K9576j8591
1886.7I9455911m8757k3293J0663j4967o3276n2124J13J0753l1120n5253k4712Q267
1911.1I9172205q643m4322m4495o234Q106l3552o3580l1465R495r66m6396n7149j5956
1937.7I8837048J0425k7371p3641n2697m852k211l6591m7881j8990K379k1893n7119
1962.1I8506606m6009p826r376m9037o4164l4255n680k6524p4733q5371n6005n1498
$$ y = [99070454, 99435109, 99618471, 99712479, 99810457, 99871522, 99857235, 99830830, 99860305, 99923426, 99938375, 99894869, 99874675, 99908537, 99945617, 99937993, 99910361, 99918360, 99964458, 99968195, 99901515, 99855012, 99869841, 99898261, 99889350, 99861306, 99849570, 99854487, 99831921, 99761599, 99691308, 99672210, 99679893, 99650973, 99585468, 99548823, 99577677, 99617910, 99588567, 99513012, 99487954, 99503034, 99488032, 99438852, 99415743, 99444926, 99474502, 99455911, 99407154, 99383861, 99394524, 99379557, 99316281, 99264157, 99264270, 99275023, 99243903, 99188650, 99163938, 99172205, 99163562, 99119240, 99074745, 99068511, 99076617, 99043065, 98979485, 98948020, 98957515, 98956549, 98910153, 98853004, 98837048, 98847473, 98820102, 98746461, 98693764, 98688912, 98686701, 98650110, 98602229, 98583239, 98585618, 98563725, 98506606, 98460597, 98452771, 98443395, 98394358, 98330194, 98295939, 98290259, 98263735, 98189002, 98103631, 98047626, 97996128]
1986.6I7996128r0963j28001j26874j09208j30934j88392k13122j80751j37407j25957
2007I6564519j27786r6065l9267r692j7709j7607J7333N7477O8796P0691R9456J36948
2031.5I6707094J34140R0069N4031N2518N9229L6877L04L749M5711N9796K9045J1629
2056I7284192M4012R1022J04124Q3506O5088O3139M9925J6695p325O312M6855O5971
2080.4I7913516M7612L1662L9631M1795J8334l457R149L9530M7928K8545J4210K7299
2104.9I8255754M5299L8958K0849K3264M4978N4371L6639J7750K3222L8427L0691K390
2129.4I8632592q291J1766L0595J9520j901j305J4698J3721q040k1577j0586N722k730
2155.9I8674184k3031k0778j08O074j2869k9528j9198j407j0610l6895m2009k2221
$$ y = [97996128, 97905165, 97777164, 97650290, 97541082, 97410148, 97221756, 97008634, 96827883, 96690476, 96564519, 96436733, 96340668, 96301401, 96291709, 96274000, 96256393, 96273726, 96331203, 96399999, 96470690, 96570146, 96707094, 96841234, 96931303, 96985334, 97037852, 97097081, 97133958, 97134262, 97138011, 97183722, 97243518, 97272563, 97284192, 97328204, 97419226, 97523350, 97606856, 97671944, 97735083, 97785008, 97801703, 97794378, 97800690, 97847545, 97913516, 97961128, 97992790, 98032421, 98074216, 98092550, 98089093, 98098242, 98137772, 98185700, 98214245, 98228455, 98255754, 98301053, 98340011, 98360860, 98384124, 98429102, 98483473, 98520112, 98537862, 98561084, 98599511, 98630202, 98632592, 98624301, 98636067, 98666662, 98686182, 98684281, 98682976, 98697674, 98711395, 98703355, 98681778, 98671192, 98676914, 98674184, 98651153, 98630375, 98630267, 98636341, 98623472, 98593944, 98574746, 98573339, 98562729, 98525834, 98483825, 98461604]
2180.4I8461604j1587k5034l8695k8199o390l636j8221k3043j0777j609j3149l4088
2204.8I8247176l8790l0202l4434n8019p7611p0554m4262k2138j823L2949O7526P3558
2229.3I8043376M8781K0975K1785M6670N7102M3153L2658L5888L3271J2028o395n19
2253.8I8388773J1927O420j1409j6713r66J3596Q381l440k908K730j884j0383p236
2280.3I8376888P784J9128J4632L666k56l70q249k6977m1521m0549l3253l3665m0734
2306.8I8196524m1008k8497j6337k1559l8749m8059m1205l1346k8545l0994l1144k0295
2331.3I7818786j4442k7281l6317k7150k0469k7150m452M0591K3263m9662j03849r8574
2355.8I7473294o1954l2311j8311Q29K8622M8911N9206O2126O0665O2919O5279N7262
$$ y = [98461604, 98450017, 98424983, 98386288, 98358089, 98351699, 98348063, 98329842, 98306799, 98296022, 98294413, 98281264, 98247176, 98208386, 98178184, 98143750, 98085731, 98008120, 97937566, 97893304, 97871166, 97869343, 97902292, 97969818, 98043376, 98092157, 98113132, 98134917, 98181587, 98238689, 98281842, 98314500, 98350388, 98383659, 98395687, 98389292, 98388773, 98400700, 98407120, 98395711, 98378998, 98378032, 98391628, 98400009, 98396569, 98393661, 98396391, 98394507, 98384124, 98376888, 98384672, 98403800, 98418432, 98422098, 98421842, 98421472, 98413223, 98386246, 98344725, 98304176, 98270923, 98237258, 98196524, 98155516, 98127019, 98110682, 98089123, 98050374, 98002315, 97961110, 97929764, 97901219, 97870225, 97839081, 97818786, 97804344, 97777063, 97740746, 97713596, 97693127, 97665977, 97661525, 97702116, 97725379, 97675717, 97571868, 97473294, 97411340, 97379029, 97360718, 97361547, 97390169, 97439080, 97498286, 97560412, 97621077, 97683996, 97749275, 97806537]
2380.2I7806537L9804K0164K063j5480l4076m7475n4151n9759o3676o4444o0588n0837
2404.7I7418082l9900l6609m6909o8068r2584j25182j71071k12437k23583j88428j09357
2427.2I6103954k6649J4263J8716J0717k956j3256j4627j5909k1761k7979k9284k4497
2451.6I5970732k1702k5737l4207m2862n1117o5881r2530j22130j40763j47694j52427
2474.1I5073682j56677j49369j32030j18822j18512j25217j17350o5005M5931J65761
2494.5I4302392K18552J98347J52617J10764P9316O2000N5486M8739L7628K9469K7794
2516.9I5323104K1791O855j866K110Q273Q714N699N674R423J1051L690j1242k2661
2543.4I5370615k5625l1578m6700n5665n1534m8810n1934n5021n8454n9128n7852o1667
$$ y = [97806537, 97846341, 97866505, 97868568, 97853088, 97819012, 97771537, 97717386, 97657627, 97593951, 97529507, 97468919, 97418082, 97378182, 97341573, 97294664, 97226596, 97134012, 97008830, 96837759, 96625322, 96401739, 96213311, 96103954, 96077305, 96091568, 96110284, 96121001, 96118045, 96104789, 96090162, 96074253, 96052492, 96024513, 95995229, 95970732, 95949030, 95923293, 95889086, 95846224, 95795107, 95729226, 95636696, 95514566, 95373803, 95226109, 95073682, 94917005, 94767636, 94635606, 94516784, 94398272, 94273055, 94155705, 94090700, 94136631, 94302392, 94520944, 94719291, 94871908, 94982672, 95061988, 95123988, 95179474, 95228213, 95265841, 95295310, 95323104, 95344895, 95351750, 95349884, 95351994, 95360267, 95368981, 95374680, 95380354, 95389777, 95400828, 95404518, 95393276, 95370615, 95344990, 95313412, 95266712, 95211047, 95159513, 95110703, 95058769, 95003748, 94945294, 94886166, 94828314, 94766647]
2567.9I4766647o4052n5688m4114m3076n5462p2199q5306r4533j02318j06793j05298
2590.3I3937808j02049r9987r7674r0462p0822m7243m0048n0521o3521p2699q1164
2612.8I3121618r2500r9248q9502p5084p2122p5334p6980p8463q5342j00279j18607
2635.2I2158157j29271j28525j31214j44070j50931j45769j36996j30087j27989j29658
2655.6I0803647j36924j56826j85316k10488k32506k59519k93159l19815l15863k55024
2676H8438207j29837L1352J92809L17979L75664L74496L51441L28785L06327K78437
2696.4I0865660K42305J99192J54174J10519O3461J5151j9187l1530k8742k3961k4789
2718.8I1522253k4236j5294j0240k4909n3978p9501r5755r9653p1907r495N8079R6858
$$ y = [94766647, 94702595, 94646907, 94602793, 94559717, 94504255, 94432056, 94346750, 94252217, 94149899, 94043106, 93937808, 93835759, 93735772, 93638098, 93547636, 93476814, 93429571, 93389523, 93339002, 93275481, 93202782, 93121618, 93029118, 92929870, 92840368, 92765284, 92693162, 92617828, 92540848, 92462385, 92377043, 92276764, 92158157, 92028886, 91900361, 91769147, 91625077, 91474146, 91328377, 91191381, 91061294, 90933305, 90803647, 90666723, 90509897, 90324581, 90114093, 89881587, 89622068, 89328909, 89009094, 88693231, 88438207, 88308370, 88339722, 88532531, 88850510, 89226174, 89600670, 89952111, 90280896, 90587223, 90865660, 91107965, 91307157, 91461331, 91571850, 91635311, 91650462, 91631275, 91599745, 91571003, 91547042, 91522253, 91498017, 91482723, 91472483, 91447574, 91393596, 91314095, 91218340, 91118687, 91046780, 91037285, 91095364, 91192222]
2743.3I1192222R1606N8335K6465O943r429k4402k6214k0951k1714j6743R280M7845
2767.8I1313243P7122Q4275P5168O5475O0386N5599M9251M0722L6282M1520M3959K9915
2792.2I1972917R442K289R381J4437J1187J3149K2167K2817J2451%k098R263J8352
2818.8I2115754J9467K4163L5465M2743L6591K5666K3764K4754J5342o372l0678m7874
2843.2I2278785o0034p3856q6385q1295n9945n0419o4659q6743j00857j08522j23948
2865.7I1382122j45465j57255j54161j44583j38039j23548r1094o0094n1713o2155
2886.1I0254015p0662o8706p1049q8822j09673j16432j14059j19805j35476j46901
2906.5H9212430j48482j47277j52766j69194j79601j76185j79601j94401k08210k14446
$$ y = [91192222, 91283828, 91342163, 91368628, 91375571, 91366142, 91341740, 91315526, 91294575, 91272861, 91256118, 91265398, 91313243, 91390365, 91474640, 91549808, 91615283, 91675669, 91731268, 91780519, 91821241, 91857523, 91899043, 91943002, 91972917, 91982359, 91984648, 91994029, 92008466, 92019653, 92032802, 92054969, 92077786, 92090237, 92090237, 92088139, 92097402, 92115754, 92135221, 92159384, 92194849, 92237592, 92274183, 92299849, 92323613, 92348367, 92363709, 92357337, 92326659, 92278785, 92218751, 92144895, 92058510, 91977215, 91917270, 91866851, 91802192, 91715449, 91614592, 91506070, 91382122, 91236657, 91079402, 90925241, 90780658, 90642619, 90519071, 90427977, 90367883, 90316170, 90254015, 90183353, 90114647, 90043598, 89954776, 89845103, 89728671, 89614612, 89494807, 89359331, 89212430, 89063948, 88916671, 88763905, 88594711, 88415110, 88238925, 88059324, 87864923, 87656713, 87442267]
2926.8H7442267k11310k08557k14279k11406j82104j38658r6297m1980L2670J04117
2947.2H6274463J57058J90222K00236J94490J74707J33223P1859J919o5285j26361
2967.6H7206531j83028k31791k56163k32565j59699p9358k6661J2875N4669Q8018J14769
2990.1H6307597J29843J12903Q1885N4335L2580K7121K6416J8364R132o44k3490o9267
3014.5H6706775j18416j40488j32817j08826q5718o1846j6105L1978M5359J2720m5783
3037H6086833r0771j26458j82402k45470k78610k69401k47931k42114k35683k08211
3057.4H3959782j58775r7900l9482J9741P8350J13732J21396J20485J21957J24061
3077.8H4363347J17398J00046R1487J01781J17374J19215J04135R5016J01912J00225
$$ y = [87442267, 87230957, 87022400, 86808121, 86596715, 86414611, 86275953, 86179656, 86137676, 86170346, 86274463, 86431521, 86621743, 86821979, 87016469, 87191176, 87324399, 87396258, 87398177, 87332892, 87206531, 87023503, 86791712, 86535549, 86302984, 86143285, 86063927, 86037266, 86050141, 86104810, 86192828, 86307597, 86437440, 86550343, 86632228, 86686563, 86719143, 86746264, 86772680, 86791044, 86800176, 86799532, 86776042, 86706775, 86588359, 86447871, 86315054, 86206228, 86120510, 86058664, 86042559, 86074537, 86119896, 86132616, 86086833, 85996062, 85869604, 85687202, 85441732, 85163122, 84893721, 84645790, 84403676, 84167993, 83959782, 83801007, 83703107, 83663625, 83683366, 83761716, 83875448, 83996844, 84117329, 84239286, 84363347, 84480745, 84580791, 84672278, 84774059, 84891433, 85010648, 85114783, 85209799, 85311711, 85411936]
3098.2H5411936O8182K8086K4658N3608P1168O8659Q3673J23536J42640J23006R1237
3120.6H6290389P2927P2562O8516M7612K6101J7911J6588J0115O664K0343M5460O2794
3145.1H6757982O3324O4885P2086N6929J8525n353l332M471L045r995k1464k0587j9676
3171.6H6960840l1024m3499m6188m1443l7366m4555n8961o1476n6511o6894q5479r1780
3196.1H6295664r0468r4127j01579j05875r9313q6058q2612q9085r1117q5354q0282
3218.5H5289794q1366q7828r3638r6566j04999j21630j27142j10877r8002j06317j22022
3240.9H4139407j24193j13332j04707j02812j07223j12415j13320j16694j23739j25271
3261.3H2995701j19430j18363j26976j36166j44351j51169j59455j78122j91939j86139
$$ y = [85411936, 85480118, 85508204, 85532862, 85586470, 85657638, 85726297, 85809970, 85933506, 86076146, 86199152, 86290389, 86363316, 86435878, 86504394, 86552006, 86578107, 86596018, 86612606, 86622721, 86629385, 86649728, 86695188, 86757982, 86821306, 86886191, 86958277, 87015206, 87033731, 87028378, 87025046, 87029517, 87032562, 87022567, 87001103, 86980516, 86960840, 86929816, 86886317, 86840129, 86798686, 86761320, 86716765, 86657804, 86596328, 86539817, 86472923, 86387444, 86295664, 86205196, 86111069, 86009490, 85903615, 85804302, 85718244, 85635632, 85546547, 85455430, 85370076, 85289794, 85208428, 85120600, 85026962, 84930396, 84825397, 84703767, 84576625, 84465748, 84367746, 84261429, 84139407, 84015214, 83901882, 83797175, 83694363, 83587140, 83474725, 83361405, 83244711, 83120972, 82995701, 82876271, 82757908, 82630932, 82494766, 82350415, 82199246, 82039791, 81861669, 81669730, 81483591]
3281.7H1483591j78069j84268j94246j86807j72477j78618j96981k05791j93119j60998
3302.1G9632217j37031j44554j73670j96659j98800j90305j87606j85680j80292j80942
3322.5G7856678j92428k15119k29651k26104k28047k31988k21437k23607k46787k64150
3342.9G5577360k71320k59978k38418k50882k85780k88582k66719k62064k77638k81906
3363.3G2894073k55847k36136k57027k87885k79921k42293k21932k22170k22641k15322
3383.7G0452899j98704j67316j31846j39886j85198j93453j51568j25468j63168k10511
3404.1F8785781j93012j49137j30808j31816j47450j56808j39087j19984j08862q8251
3424.5F7420566o2877m1544l1227j2261J3548q028n6416m8423J0139N3161O4111O9481
$$ y = [81483591, 81305522, 81121254, 80927008, 80740201, 80567724, 80389106, 80192125, 79986334, 79793215, 79632217, 79495186, 79350632, 79176962, 78980303, 78781503, 78591198, 78403592, 78217912, 78037620, 77856678, 77664250, 77449131, 77219480, 76993376, 76765329, 76533341, 76311904, 76088297, 75841510, 75577360, 75306040, 75046062, 74807644, 74556762, 74270982, 73982400, 73715681, 73453617, 73175979, 72894073, 72638226, 72402090, 72145063, 71857178, 71577257, 71334964, 71113032, 70890862, 70668221, 70452899, 70254195, 70086879, 69955033, 69815147, 69629949, 69436496, 69284928, 69159460, 68996292, 68785781, 68592769, 68443632, 68312824, 68181008, 68033558, 67876750, 67737663, 67617679, 67508817, 67420566, 67357689, 67316145, 67284918, 67272657, 67286205, 67278177, 67221761, 67173338, 67183477, 67236638, 67300749, 67370230]
3449F7370230Q9049J06234J13678J33699J62887J63865J60313J99175K30718K00122
3469.4F8929970J50293J49995J91230K37924K47681K06852J99008K41947K52962K39629
3489.8G1047491K45368K50697K50584K46150K40439K37232K14470J92624K04670K27219
3510.2G3356944K44409K37435K08372K05338K32119K62135K51186K07090J99723K28143
3530.6G5632894K52098K70861K65706K42501K69509L18318L08144K47586K22326K51132
3551G8281075K78771K83080K86704L05623L18682L05057K87908L08496L34346L26377
3571.3H1316119L21848L36986L52067L72225L98147M01759L68810L30800L47525L72046
3591.7H4918332L70914L78114M01562M08864L96920L86309L74746L79724L97640M05836
$$ y = [67370230, 67459279, 67565513, 67679191, 67812890, 67975777, 68139642, 68299955, 68499130, 68729848, 68929970, 69080263, 69230258, 69421488, 69659412, 69907093, 70113945, 70312953, 70554900, 70807862, 71047491, 71292859, 71543556, 71794140, 72040290, 72280729, 72517961, 72732431, 72925055, 73129725, 73356944, 73601353, 73838788, 74047160, 74252498, 74484617, 74746752, 74997938, 75205028, 75404751, 75632894, 75884992, 76155853, 76421559, 76664060, 76933569, 77251887, 77560031, 77807617, 78029943, 78281075, 78559846, 78842926, 79129630, 79435253, 79753935, 80058992, 80346900, 80655396, 80989742, 81316119, 81637967, 81974953, 82327020, 82699245, 83097392, 83499151, 83867961, 84198761, 84546286, 84918332, 85289246, 85667360, 86068922, 86477786, 86874706, 87261015, 87635761, 88015485, 88413125, 88818961]
3612.1H8818961M11368M06068M01330M08018L90357L70425L61067L72070L99613L84778
3632.5I2724055L74609L72428L64518L64053L65341L59362L50744L51793L30525K85721
3652.9I6243149K73162L02291L02690K55126K25431K34818K29883J98490K00921J86807
3673.3I8652768J14077Q8555J17135J28096J42402J57511J38199N3418j061L1603N1403
3695.8I9674106L7408J6379L415K4700N6494N7518J5432l3516n788K8390J7226J866
3720.2I9893630m536j7745j6951K7954O4367N3281J1146j6320K1637L4618l5357p6926
3744.7I9938798K6208L5304o4588m0811M2880L8010j3638j6362J8698K2740P575j7422
3769.2I9977392k7633j555K3758K8658o20k6506j6135k301L845P158J1766J2821J0020
$$ y = [88818961, 89230329, 89636397, 90037727, 90445745, 90836102, 91206527, 91567594, 91939664, 92339277, 92724055, 93098664, 93471092, 93835610, 94199663, 94565004, 94924366, 95275110, 95626903, 95957428, 96243149, 96516311, 96818602, 97121292, 97376418, 97601849, 97836667, 98066550, 98265040, 98465961, 98652768, 98766845, 98855400, 98972535, 99100631, 99243033, 99400544, 99538743, 99592161, 99591100, 99622703, 99674106, 99711514, 99727893, 99731308, 99756008, 99812502, 99870020, 99885452, 99851936, 99846148, 99874538, 99891764, 99893630, 99889094, 99871349, 99854398, 99882352, 99946719, 100000000, 100011146, 99994826, 100016463, 100051081, 100015724, 99938798, 99965006, 100000310, 99935722, 99894911, 99937791, 99975801, 99962163, 99945801, 99964499, 99987239, 99994814, 99977392, 99949759, 99948204, 99971962, 100000620, 100000000, 99973494, 99957359, 99955058, 99958903, 99966061, 99977827, 99990648, 100000668]
3795.7A00000668J7154j3387n5749j0001P15k6959J1545M7815K5398q583N155l3426
3820.2I9960345o6388K122K7943J7059P415J2695L8809N198n9665l2645R614K2823
3844.6I9945325M1896N1343K277j29574j13965N0611Q1515M3601p69r835J1504j0580
3869.1I9963349k6673p868Q303K8825J0639K313J6004k0635k2924R71j2797M298M3255
3895.6I9987060L8248k086l8832n0587k3001J9401K6560J5646P457r758j4329M763
3920.1I9960542Q553o819j478J1671J812l910R876J5229J1128N090p820l874R441N293
3948.7A00014734J67M864Q213Q166J3221J0228k718L123J8883J9836J6141J7870K0027
3975.2A00152755J5270L589L81R668J0645J204L827J5676J6821J2564J5962
$$ y = [100000668, 100017822, 100004435, 99948686, 99938685, 99939400, 99912441, 99923986, 99971801, 99997199, 99988616, 99993771, 99960345, 99893957, 99896079, 99924022, 99941081, 99948496, 99961191, 100000000, 100005198, 99945533, 99912888, 99922502, 99945325, 99987221, 100038564, 100040841, 99911267, 99797302, 99847913, 99929428, 99973029, 99972260, 99962425, 99973929, 99963349, 99936676, 99928808, 99937111, 99965936, 99976575, 99978888, 99994892, 99974257, 99951333, 99952304, 99939507, 99943805, 99987060, 100025308, 100023222, 99984390, 99933803, 99910802, 99930203, 99956763, 99972409, 99979866, 99970108, 99955779, 99960542, 99969095, 99962276, 99960798, 99972469, 99974281, 99970371, 99980247, 99995476, 100006604, 100011694, 100003874, 100000000, 100009441, 100014734, 100014901, 100019765, 100027978, 100036144, 100049365, 100059593, 100056875, 100059998, 100078881, 100098717, 100114858, 100132728, 100152755, 100168025, 100171614, 100171995, 100181663, 100192308, 100193512, 100197339, 100213015, 100229836, 100242400, 100258362]
3997.6A00258362
$$ y = [100258362]
##END=$$ End of the data block
