##TITLE=KSeCN 2 $$ Begin of the data block
##JCAMP-DX=5.00 $$ ACD/SpecManager v 10.08
##SPECTROMETER/DATA SYSTEM=Alpha
##DATE=13 Jul 2015 15:22:34
##DATA TYPE=INFRARED SPECTRUM
##DATA CLASS=XYDATA
##ORIGIN=
##OWNER=
##NPOINTS=1765
##FIRSTX=399.76428223
##LASTX=3997.64306641
##MAXX=3997.64306641
##MINX=399.76428223
##MAXY=0.47595534
##MINY=0.00072515
##XFACTOR=1.0000000000
##YFACTOR=1.000000000000000e-9
##FIRSTY=0.13397662
##DELTAX=2.03961372
##XUNITS=1/CM
##YUNITS=ARBITRARY UNITS
##XYDATA=(X++(Y..Y))
399.8A33976623k079576k762481j522363j2308k57850q90270p24181k40475P38203
418.1A26225322J439006R64567P54788N27621L5345j90034p0095J01700j91391p27564
438.5A28869265q46356n31405l10868n13107n64560l47137l03969k83331r0852j31980
458.9A24945700l33436l67470l93361j18278K02813J02721j37195k42263R440L16009
479.3A23984680L41244K62037l6985l27364j48400J66677L89225M75593K34857j6301
499.7A25325263J73166N10693O09695M39376R3773O780K32116N28499O98566O34000
520.1A29251927N04226N47990P22945P49647P05496O44996M52534L58030O83114J116738
540.5A35737643J079127N65588J90556L06249N40078O63548P69481O88360L11926J98230
$$ plain form
399.8 133976623 131897047 129134566 127612203 127599895 127342045 126451775 125727594 125487119 126225322
418.1 126225322 127664328 128628895 129383683 129911304 129946649 129756615 129686520 129788220 129596829 128869265
438.5 128869265 128022909 127491504 127180636 126667529 126102969 125755832 125451863 125168532 125077680 124945700
458.9 124945700 124612264 124244794 123851433 123733155 123935968 124038689 123901494 123659231 123668671 123984680
479.3 123984680 124325924 124587961 124550976 124223612 124075212 124241889 124631114 125106707 125341564 125325263
499.7 125325263 125498429 126009122 126618817 127058193 127151966 127158746 127390862 127919361 128617927 129251927
520.1 129251927 129756153 130304143 131027088 131776735 132482231 133127227 133579761 133937791 134620905 135737643
540.5 135737643 136816770 137382358 137572914 137879163 138419241 139082789 139852270 140540630 140852556 141050786
560.9A41050786M88996R06989J369551J431972J065060Q85368J024768J160249J165524
579.3A50549263J097664J021653R88454J030490J127064J189187J161099J164272J176879
597.6A60506025J080424J083254J195774J210868J131386R84177R39995J223668J569644
616A70925215J527324J141325R28953J037330J222893J388654J412794J228228J026407
634.3A81839123J056210J276046J470774J505911J367972J153826J123593J312598
650.6A92106053J470015J509800J374081J118824J062930J220881J353905K283454
667B03499943K835691R95427O14107J434267J897990J916439J699745J488507J468495
685.3B17850611J681164J970395K064347J904100J710311J651138J826018K182767
$$ plain form
560.9 141050786 141539782 142446771 143816322 145248294 146313354 147198722 148223490 149383739 150549263
579.3 150549263 151646927 152668580 153657034 154687524 155814588 157003775 158164874 159329146 160506025
597.6 160506025 161586449 162669703 163865477 165076345 166207731 167191908 168131903 169355571 170925215
616 170925215 172452539 173593864 174522817 175560147 176783040 178171694 179584488 180812716 181839123
634.3 181839123 182895333 184171379 185642153 187148064 188516036 189669862 190793455 192106053
650.6 192106053 193576068 195085868 196459949 197578773 198641703 199862584 201216489 203499943
667 203499943 206335634 207331061 207945168 209379435 211277425 213193864 214893609 216382116 217850611
685.3 217850611 219531775 221502170 223566517 225470617 227180928 228832066 230658084 232840851
701.6B32840851K372757K197518J979620K036050K243608K434060K567977K604499
717.9B51276940K472162K285481K379894K761454K958148K811015K590895K574205
734.3B72110194K758056K962768L103167L020853K790749K690851K866596L175259
750.6B95478493L361821L268808K990455K829134K929032L234237L498495L455937
766.9C21046412L119946K871900K963901L318220L615231L552377L151208K726138
783.2C46365333K673536K986998L286778L232450K813220K356201K281010K583117
799.5C68578643K883285K731472K142280J702309J717180K050549K291024K171606
815.8C86268348J769244J445592J578062K145887K675742K695620K285659J916379
$$ plain form
701.6 232840851 235213608 237411126 239390746 241426796 243670404 246104464 248672441 251276940
717.9 251276940 253749102 256034583 258414477 261175931 264134079 266945094 269535989 272110194
734.3 272110194 274868250 277831018 280934185 283955038 286745787 289436638 292303234 295478493
750.6 295478493 298840314 302109122 305099577 307928711 310857743 314091980 317590475 321046412
766.9 321046412 324166358 327038258 330002159 333320379 336935610 340487987 343639195 346365333
783.2 346365333 349038869 352025867 355312645 358545095 361358315 363714516 365995526 368578643
799.5 368578643 371461928 374193400 376335680 378037989 379755169 381805718 384096742 386268348
815.8 386268348 388037592 389483184 391061246 393207133 395882875 398578495 400864154 402780533
832.2D02780533J990080K561778L306478L544122L081530K569527K579212L052056
848.5D25465316L438294L307133K725959K125383K006828K414227K759069K620667
864.8D46862876K070636J444340J279175J727462K204448K116561J487523Q63046Q38547
883.2D60894614J324565J682520J520454R54777M31806L56734P67172J270592J298845
901.5D70502079O73055j0222m3511M99695R75579R01997L55095j52975j97411K12818
921.9D73716199O95140P53849K51711l10540l54052Q9914N40435N35339L7342m67658
942.3D75487679n12212o9827L92794L23207j99050o24031n89222j69247K10404J73092
962.7D74423587k87294p84099p76500k64138J45048O7681m03016q80510r17435m65214
$$ plain form
832.2 402780533 404770613 407332391 410638869 414182991 417264521 419834048 422413260 425465316
848.5 425465316 428903610 432210743 434936702 437062085 439068913 441483140 444242209 446862876
864.8 446862876 448933512 450377852 451657027 453384489 455588937 457705498 459193021 460056067 460894614
883.2 460894614 462219179 463901699 465422153 466376930 466808736 467165470 467932642 469203234 470502079
901.5 470502079 471175134 471164912 471121401 471621096 472596675 473498672 473853767 473700792 473503381 473716199
921.9 473716199 474411339 475165188 475416899 475106359 474752307 474842221 475382656 475917995 475955337 475487679
942.3 475487679 474975467 474905640 475298434 475621641 475422591 474798560 474209338 474040091 474250495 474423587
962.7 474423587 474136293 473352194 472575694 472311556 472456604 472524285 472121269 471240759 470323324 469858110
983.1D69858110K4766P1525l63558q33035q74549m82202n4091j1712l79413p79838
1003.5D66176003q03619m35383j04934j64181n30749q68410q60840m56125l6984j4514
1023.9D61900264l56078p22468p80463m49717j01179j22100m31449p11560o98238l76434
1044.3D57150578n4657p3135l69906n83470n26548k68995P45O0051k04235o04898p43925
1066.7D53781605m86046j41800n9396k82287n35578n60075l52323j14530j11401l83437
1087.1D50754732o74427o58363l44455o8456p6503l37094n88834n98699l39389k8848
1107.5D47039664J6153k47360n35011n54681k70068O7293J58012n2601l26425l33816
1127.9D44961160n4985J92434J72168q8096l56376m01199k01434M0561N9754j94967
$$ plain form
983.1 469858110 469882876 469954401 469590843 468757808 467883259 467401057 467346966 467335254 466955841 466176003
1003.5 466176003 465372384 464937001 464832067 464667886 464137137 463268727 462407887 461951762 461914778 461900264
1023.9 461900264 461544186 460821718 460041255 459591538 459490359 459368259 458936810 458225250 457527012 457150578
1044.3 457150578 457095921 457022786 456652880 456069410 455542862 455273867 455274612 455334663 455130428 454525530 453781605
1066.7 453781605 453295559 453153759 453094363 452812076 452276498 451716423 451364100 451249570 451138169 450754732
1087.1 450754732 450080305 449421942 449077487 449009031 448932528 448595434 448006600 447407901 447068512 447039664
1107.5 447039664 447055817 446808457 446273446 445718765 445448697 445515990 445674002 445621401 445294976 444961160
1127.9 444961160 444906175 445098609 445270777 445182681 444826305 444425106 444223672 444264233 444323987 444129020
1148.3D44129020m54247m48138k28524j0699N0754j17898l68208l76672j09344J55687
1168.7D42221731J78516o6251l53694m29988k52902j550P7695j03712l77387m65751
1189.1D40426707k63482J4752R8378j06246m09394m72009k72006j6481P6026j07885
1209.5D38968360l56316m08679k70933n0247N8532j16527m03196m79072k76894l9458
1229.9D36625570j401j76429l76493m19766k52902j2309O0857p6503l08603m29839
1250.3D34632182k99364q2970l0666j56552l37750l98040k05308R9570K33233R0807
1270.7D33545142j56104k67297j49906N4747J44184L1292j75536k73764j77413L0279
1291.1D32605624J49667P2510j38104k66254j53304P8798J66386M9919j16050j84030
$$ plain form
1148.3 444129020 443674773 443226635 442998111 442987412 443038166 442920268 442552060 442175388 442066044 442221731
1168.7 442221731 442400247 442333996 441980302 441550314 441297412 441295862 441373557 441269845 440892458 440426707
1189.1 440426707 440163225 440177977 440276355 440170109 439760715 439288706 439016700 439000219 439076245 438968360
1209.5 438968360 438612044 438203365 437932432 437882185 437940717 437824190 437420994 436941922 436665028 436625570
1229.9 436625570 436624169 436447740 436071247 435651481 435398579 435386270 435447127 435370624 435062021 434632182
1250.3 434632182 434332818 434249848 434219182 434062630 433724880 433326840 433121532 433221102 433454335 433545142
1270.7 433545142 433389038 433121741 432971835 433026582 433170766 433202058 433026522 432752758 432575345 432605624
1291.1 432605624 432755291 432827801 432689697 432423443 432270139 432348937 432515323 432565242 432449192 432265162
1311.5D32265162q5711O8903J34766L1591k22028m36842m42207k99692k64287m90844
1331.9D30258811q81076j159072j134843r35584q78900j022846j093358p94261j14322
1350.2D22244549O50674J155287J173317Q20935N53817N83350O09517M78864L00735
1368.6D28571045Q375k21014k31266j61380j79231m12315o32763k41131O56724R95815
1389D28152859O01024L00049J56671l4839j31756j17510j2011J11878j9133k15322
1409.4D28791910k33024j16467J4931J72585K28047J3173m3154M8995Q2225P2539r5398
1431.8D28936362k96980j70320J1176n3704j40160l13998m35024l21776k13474l18378
1452.2D26683724l79473k45869k51770n14329m71830j95861j02043l00855l79174j67251
$$ plain form
1311.5 432265162 432179451 432248354 432383120 432414711 432192683 431755841 431313634 431013942 430749655 430258811
1331.9 430258811 429377735 428218663 427083820 426148236 425269336 424246490 423153132 422358871 422244549
1350.2 422244549 422895223 424050510 425223827 426044762 426598579 427181929 427791446 428270310 428571045
1368.6 428571045 428579420 428358406 428127140 427965760 427786529 427374214 426741451 426500320 427157044 428152859
1389 428152859 428753883 429053932 429210603 429175764 429044008 428926498 428914487 429026365 429007232 428791910
1409.4 428791910 428558886 428442419 428457350 428629935 428857982 428871155 428828001 428876996 428959221 429031760 428936362
1431.8 428936362 428639382 428469062 428480238 428426534 428286374 427972376 427537352 427215576 427002102 426683724
1452.2 426683724 426304251 426058382 425806612 425292283 424820453 424624592 424522549 424221694 423842520 423675269
1472.6D23675269k533n7191k16395l77804n79446p35969p03960m87179m18484o45846
1493D19450462p62135p69555p53642q44270r36716r61006q78811q24034q71390r84639
1513.4D10864264j138389j239032j360774j452714j456350j355022j493425j680553
1529.7C99688005j874059k199829k269595k244294k586246k855420k780616k982378
1546C79895568l140062l425181l669411m001111m255414n155414o208569n094945n305499
1564.4C39639962o182492p111788q298308q099615q576423j1078775j1285901j0808378
1580.7B68198282j1978984j3030932j3810143j4620646j5379653j5851795j6207383
1595A67318746j6127258j5603587j4961437j4016509j2571886j1038564r518705p738799
$$ plain form
1472.6 423675269 423672736 423615545 423399150 423021346 422441900 421705931 421001971 420514792 420096308 419450462
1493 419450462 418688327 417918772 417165130 416320860 415384144 414423138 413544327 412720293 411848903 410864264
1513.4 410864264 409725875 408486843 407126069 405673355 404217005 402861983 401368558 399688005
1529.7 399688005 397813946 395614117 393344522 391100228 388513982 385658562 382877946 379895568
1546 379895568 376755506 373330325 369660914 365659803 361404389 356248975 350040406 344945461 339639962
1564.4 339639962 333457470 326345682 318047374 309947759 301371336 290292561 279006660 268198282
1580.7 268198282 256219298 243188366 229378223 214757577 199377924 183526129 167318746
1595 167318746 151191488 135587901 120626464 106609955 94038069 82999505 73480800 65742001
1611.3F5742001n969781m676208l647648k309341j241144k80786M34592J042686J563147
1629.7E0657518J629610K289221M282865M760407L914811M073255M686184O813295
1646H3107166Q072607N881064Q150242J3920605J0049030P807315R433836J1783197
1662.3A58205062J2170851J0256559J1317447J3435900J1574403J1515513J2511223
1676.6B40986958J0392741Q836209R999752J3337314J1060715Q117020Q016110O961822
1692.9C17708641P136673P539690P017612P705539N980999M749536N005420M315733
1709.2C67159843L669382L324121L304750L925681L587663K554893K286136K297283
1725.5C92109752J983821J700282J500815J988113K104819J407445J440584J557976
$$ plain form
1611.3 65742001 59772220 55096012 51448364 49139023 47897879 47617093 48051685 49094371 50657518
1629.7 50657518 52287128 54576349 58859214 63619621 67534432 71607687 76293871 83107166
1646 83107166 91179773 97060837 105211079 119131684 129180714 136988029 146421865 158205062
1662.3 158205062 170375913 180632472 191949919 205385819 216960222 228475735 240986958
1676.6 240986958 251379699 260215908 270215660 283552974 294613689 302730709 310746819 317708641
1692.9 317708641 324845314 332385004 339402616 347108155 353089154 357838690 362844110 367159843
1709.2 367159843 370829225 374153346 377458096 381383777 384971440 387526333 389812469 392109752
1725.5 392109752 394093573 395793855 397294670 399282783 401387602 402795047 404235631 405793607
1741.9D05793607J363874J182884J199394J418203J435310R85801P82430P80464P50690
1760.2D15692657Q58188P38323N04881L52263L15011N71519Q00192N80341L68476L16560
1780.6D21098411L21597L35634K72959J06216J2040J65492K39074J58638Q1122J38819
1801D22930002J59025L5882m4733m3779K6613L2246n2780j40905j72526k01642k04921
1823.4D22322482k20627k74956k58565j66267j64449k55615l26574m24474n01961m56154
1843.8D19272840l12418l23146m11302m41611n02229n81026n85019n50151n95212p09862
1864.2D14260864q00788p27117n71609n53220o52254p58827q12739q08686p88063q16464
1884.6D06971097q78006r38386r10521q45640q62390r11355r28700r43870r71257r90808
$$ plain form
1741.9 405793607 407157481 408340365 409539759 410957962 412393272 413379073 414161503 414941967 415692657
1760.2 415692657 416550845 417289168 417794049 418146312 418461323 419032842 419833034 420413375 420781851 421098411
1780.6 421098411 421420008 421755642 422028601 422134817 422146857 422312349 422551423 422710061 422791183 422930002
1801 422930002 423089027 423124909 423080176 423036397 423063010 423095256 423042476 422901571 422729045 422527403 422322482
1823.4 422322482 422101855 421826899 421568334 421402067 421237618 420982003 420655429 420230955 419728994 419272840
1843.8 419272840 418960422 418637276 418225974 417784363 417282134 416701108 416116089 415565938 414970726 414260864
1864.2 414260864 413460076 412732959 412161350 411608130 410955876 410197049 409384310 408575624 407787561 406971097
1884.6 406971097 406093091 405154705 404244184 403398544 402536154 401624799 400696099 399752229 398780972 397790164
1905C97790164r99809r79065r67116j037955j128226j101435j023918j036882j053960
1923.4C88461798r87738r84251j073003j095176j065910j074254j101315j120150j133025
1941.7C78826976j087874j018286j030326j107126j171351j171023j103192j066476
1958.1C70071322j114786j190513j233518j212597j196236j231432j272112j312762
1974.4C60307366j369775j411616j442165j502782j607567j730889j825511j902759
1990.7C47514302k009333k164244k363116k591580k852380l179670l549516l951669
2007C24852794m441648n001694n529464o009936o476939o872087p196159p469594p677734
2025.4B68177539p911175q342624r115741j0268926j1774630j3599559j5720055j7993957
$$ plain form
1905 397790164 396790355 395811290 394844174 393806219 392677993 391576558 390552640 389515758 388461798
1923.4 388461798 387474060 386489809 385416806 384321630 383255720 382181466 381080151 379960001 378826976
1941.7 378826976 377739102 376720816 375690490 374583364 373412013 372240990 371137798 370071322
1958.1 370071322 368956536 367766023 366532505 365319908 364123672 362892240 361620128 360307366
1974.4 360307366 358937591 357525975 356083810 354581028 352973461 351242572 349417061 347514302
1990.7 347514302 345504969 343340725 340977609 338386029 335533649 332353979 328804463 324852794
2007 324852794 320411146 315409452 309879988 303870052 297393113 290521026 283324867 275855273 268177539
2025.4 268177539 260266364 251923740 242807999 232539073 220764443 207164884 191444829 173450872
2041.7A73450872k0062342k1649271k2506260k2282511k0835064j8301591j4997825
2056C2816008j1405729q042818n278052l245027j879331j040261n24775k08564O053
2074.3A197504K16370N38496J113515K092533L759969O497735J0511274J5590577K1020286
2092.7F2538259K5808766K8990403K9949211K8802186K6169047K2766307J9257739
2106.9B44281918J6087323J3355911J1040360R181380P747710O604135N656004M886180
2123.3C18840921M283160L769398L312796K953529K678961K454728K223432K002597
2139.6C42519522J837581J691401J560897J457602J345098J235276J141667J026839
2155.9C53815883R23992Q51661P63475O59496N66423N54532P33554R71973J037747
$$ plain form
2041.7 173450872 153388530 131739259 109232999 86950488 66115424 47813833 32816008
2056 32816008 21410279 13367461 8089409 4844382 2965051 1924790 1400015 1191451 1197504
2074.3 1197504 1413874 1952370 3065885 5158418 8918387 15416122 25927396 41517973 62538259
2092.7 62538259 88347025 117337428 147286639 176088825 202257872 225024179 244281918
2106.9 244281918 260369241 273725152 284765512 293946892 301694602 308298737 313954741 318840921
2123.3 318840921 323124081 326893479 330206275 333159804 335838765 338293493 340516925 342519522
2139.6 342519522 344357103 346048504 347609401 349067003 350412101 351647377 352789044 353815883
2155.9 353815883 354739875 355591536 356355011 357014507 357580930 358135462 358869016 359840989 360878736
2174.3C60878736R78976R09031Q37415P72178P23094O71595O12647N59717N26399N26458
2194.6C67996246N29497M99100M63247M75467N11348M88370M31985M41432M82798M40031
2215C72759521L65943L75747L97146L79831L95119M05818L60191L39866L55571L41535
2235.4C76476288L34740L47673L45976L52263L63678L44038L09914L00467K83539K61009
2255.8C79719585L03000L35992L02553K89112K76923K48462K64794K58327J87248J49279
2276.2C82335275J55896J74553K22534K64257K53677K44707K73049L00258L24995L22729
2296.6C84871930K95251K80172K86907L35187L91960M30524M30733L37184K94089M61042
2317C88414979O40392O31631N04136L65406L01421L49760L13997J27524J07587K20000
$$ plain form
2174.3 360878736 361857712 362766743 363604158 364376336 365099430 365771025 366383672 366943389 367469788 367996246
2194.6 367996246 368525743 369024843 369488090 369963557 370474905 370963275 371395260 371836692 372319490 372759521
2215 372759521 373125464 373501211 373898357 374278188 374673307 375079125 375439316 375779182 376134753 376476288
2235.4 376476288 376811028 377158701 377504677 377856940 378220618 378564656 378874570 379175037 379458576 379719585
2255.8 379719585 380022585 380358577 380661130 380950242 381227165 381475627 381740421 381998748 382185996 382335275
2276.2 382335275 382491171 382665724 382888258 383152515 383406192 383650899 383923948 384224206 384549201 384871930
2296.6 384871930 385167181 385447353 385734260 386069447 386461407 386891931 387322664 387659848 387953937 388414979
2317 388414979 389055371 389687002 390191138 390556544 390857965 391207725 391521722 391649246 391756833 391976833
2337.4C91976833J88232R9629n6505o18488r22978k66313P30544J244903J103162Q05319
2357.8C94284338N39183J56492l39597o63042p71195q73715r67562r33975q47846q17478
2378.2C88765603q19474p57903n51611k97219j32084n5730m9740o6221o1810m4405
2398.6C85929406j0848q196m7505o3866n1379m7207m9085m6104n5552o8396o4850n6714
2423.1C85359704p3671p5519l9488n9962j08004q7798l9994k3216m9293q8573j05917
2445.5C84608269j08481j04934j15990j40190j42187j49221j92225k24500k15412k13593
2465.9C83001536l12269m76420n47587n49168n66244n36948m58628m12733l85910k86341
2486.3C78469288r3221R2357J96695K54482K85775L01421K98589K40445J79708J62274
$$ plain form
2337.4 391976833 392165065 392264694 392208189 391589701 390666723 390400410 391130954 392375857 393479019 394284338
2357.8 394284338 394823521 394980013 394640416 393977374 393206179 392332464 391364902 390430927 389583081 388765603
2378.2 388765603 387946129 387188226 386636615 386339396 386207312 386151582 386101842 386035621 385973811 385929406
2398.6 385929406 385918558 385910362 385862857 385798991 385747612 385700405 385651320 385605216 385549664 385481268 385416418 385359704
2423.1 385359704 385286033 385210514 385171026 385111064 385003060 384915262 384875268 384852052 384802759 384714186 384608269
2445.5 384608269 384499788 384394854 384278864 384138674 383996487 383847266 383655041 383430541 383215129 383001536
2465.9 383001536 382689267 382212847 381665260 381116092 380549848 380012900 379554272 379141539 378755629 378469288
2486.3 378469288 378376067 378468424 378665119 378919601 379205376 379506797 379805386 380045831 380225539 380387813
2506.7C80387813J30832P8112K6882k9058m4793j1265n066m2588q7499j24872j19805
2529.1C80158693p2629n5998r3252j26451j18285j03176j23858j46866j37300j37508
2549.5C79043370j67042j64240j18584j34646j98216k04473j82957j83493j93804k06113
2569.9C77289802k16842k29299k54869k72125k52009k30938k40356k70813l23683l68417
2590.3C74630451l88682m07099m26382m94957o50972q37386r84311j114488j296460
2608.7C68029714j550943j860917k174824k437800k627164k765865k851814k798557
2625C48961830k536416k081305j463473p25686K7388P44015J416952J969993K355277
2643.4C48668575K575964K619773K530247K359331K104282J807183J529515J270533
$$ plain form
2506.7 380387813 380518645 380596757 380623639 380594581 380549788 380538523 380533457 380490869 380403370 380278498 380158693
2529.1 380158693 380086064 380030066 379936814 379810363 379692078 379588902 379465044 379318178 379180878 379043370
2549.5 379043370 378876328 378712088 378593504 378458858 378260642 378056169 377873212 377689719 377495915 377289802
2569.9 377289802 377072960 376843661 376588792 376316667 376064658 375833720 375593364 375322551 374998868 374630451
2590.3 374630451 374241769 373834670 373408288 372913331 372262359 371424973 370440662 369326174 368029714
2608.7 368029714 366478771 364617854 362443030 360005230 357378066 354612201 351760387 348961830
2625 348961830 346425414 344344109 342880636 342154950 342182338 342926353 344343305 346313298 348668575
2643.4 348668575 351244539 353864312 356394559 358753890 360858172 362665355 364194870 365465403
2659.7C65465403J009881P72655O00845M82201L78877K88397K19494J47075N9724P719
2680.1C69432271J013q226l1590p2420j22279j38551j12593q8096j08122j44989j42544
2702.5C68463874j31369j39534j44035j55985j87457k02894j75715j42574j47760j73777
2722.9C66862774j77175j87963k21372k01464j41859j29580j53810j74671j91003j80036
2743.3C65103841j22100q0228j46628k36809k19762j69128j68413j78933j74493j91391
2763.7C63415956k38150k56657k38479k24977k21342k29836k51144k68936k65539k65568
2784.1C60955328k80231k68221k66374k97427l05235k92420l02226l35276l44008k93642
2804.5C57970268k41817k47418k73735k86370k91527k79247k44469k47210k97248l11166
$$ plain form
2659.7 365465403 366475284 367247939 367848784 368330985 368709862 368998259 369217753 369364828 369424552 369432271
2680.1 369432271 369433284 369425058 369393468 369321048 369198769 369060218 368947625 368859529 368751407 368606418 368463874
2702.5 368463874 368332505 368192971 368048936 367892951 367705494 367502600 367326885 367184311 367036551 366862774
2722.9 366862774 366685599 366497636 366276264 366074800 365932941 365803361 365649551 365474880 365283877 365103841
2743.3 365103841 364981741 364901513 364754885 364518076 364298314 364129186 363960773 363781840 363607347 363415956
2763.7 363415956 363177806 362921149 362682670 362457693 362236351 362006515 361755371 361486435 361220896 360955328
2784.1 360955328 360675097 360406876 360140502 359843075 359537840 359245420 358943194 358607918 358263910 357970268
2804.5 357970268 357728451 357481033 357207298 356920928 356629401 356350154 356105685 355858475 355561227 355250061
2824.9C55250061k79338k66194k90573l16679l39300l71754m24415n31584o64681p82013
2845.3C50983530q66323q16703o07431l79950k35766j52469j12593j45495k13772k62529
2865.7C47190499l17067l98337m23789l78609l70383m00007m18574m48525n05298n49138
2886.1C42980772n61774n53190n24193n05060n18352n39720n58347n78075n99116o48469
2906.5C37394476o83218p21425q76755j005470r49949q29697p47740o71327n42641
2924.8C30366254l70622k77519l15338l63857l31730k45362j83284k16693l16769m17233
2945.2C27327847n39422o68346p06286o84291o98447p03722o63579o38336o12527n80102
2965.6C20832789o02961o32584o12974o22064o62625o45697o56038p50155p98255q28832
$$ plain form
2824.9 355250061 354970723 354704529 354413956 354097277 353757977 353386223 352961808 352430224 351765543 350983530
2845.3 350983530 350117207 349300504 348693073 348313123 348077357 347924888 347812295 347666800 347453028 347190499
2865.7 347190499 346873432 346475095 346051306 345672697 345302314 344902307 344483733 344035208 343529910 342980772
2886.1 342980772 342418998 341865808 341341615 340836555 340318203 339778483 339220136 338642061 338042945 337394476
2906.5 337394476 336711258 335989833 335113078 334107608 333157659 332327962 331580222 330908895 330366254
2924.8 330366254 329995632 329718113 329402775 329038918 328707188 328461826 328278542 328061849 327745080 327327847
2945.2 327327847 326788425 326120079 325413793 324729502 324031055 323327333 322663754 322025418 321412891 320832789
2965.6 320832789 320229828 319597244 318984270 318362206 317699581 317053884 316397846 315647691 314849436 314020604
2986C14020604q80241q36492p90626q46594q86471r17166r59188r60350r88453j018078
3006.4C04936945r76830r31502r66459j072526j147211j148224j118600j105994j172721
3024.7B95296878j263798j239687j134693j117319j247108j351923j289368j224994
3041.1B85427988j310558j429528j432269j364589j393706j481533j475900j456052
3057.4B74083853j519025j559168j521378j499475j553773j659304j718909j682967
3073.7B61369854j629591j613408j666874j783252j867353j886011j866981j860410
3090B47195974j924366j989767j999765j993925k015367k066404k083987k110004k171889
3108.4B28840500k230510k254725k206310k203494k320856k451480k490580k469763
$$ plain form
2986 314020604 313140363 312303871 311513245 310666651 309780180 308863014 307903826 306943476 305955023 304936945
3006.4 304936945 303960115 303028613 302062154 300989628 299842417 298694193 297575593 296469599 295296878
3024.7 295296878 294033080 292793393 291658700 290541381 289294273 287942350 286652982 285427988
3041.1 285427988 284117430 282687902 281255633 279891044 278497338 277015805 275539905 274083853
3057.4 274083853 272564828 271005660 269484282 267984807 266431034 264771730 263052821 261369854
3073.7 261369854 259740263 258126855 256459981 254676729 252809376 250923365 249056384 247195974
3090 247195974 245271608 243281841 241282076 239288151 237272784 235206380 233122393 231012389 228840500
3108.4 228840500 226609990 224355265 222148955 219945461 217624605 215173125 212682545 210212782
3124.7B10212782k490535k549544k585590k566874k565876k616629k677232k785772
3141A89374730k853647k834916k843305k833441k827391k911449l007367l058136l065452
3159.4A63139626l041297l028869l053084l078446l068298l068030l102452l128052
3175.7A38571098l127068l055096k977803k989262l017500l001012k940715k906590
3192A14556052k876319k767459k668336k643369k602622k506018k419345k376154k329543
3210.3I1366887k208479k090238k065859k013885j899913j859248j842804j731425
3226.7G5655036j628377j618504j601205j512922j403853j355149j372084j335509
3243F3827433j251161j224302j211509j170308j128446j098156j071949j061987j064412
$$ plain form
3124.7 210212782 207722247 205172703 202587113 200020239 197454363 194837734 192160502 189374730
3141 189374730 186521083 183686167 180842862 178009421 175182030 172270581 169263214 166205078 163139626
3159.4 163139626 160098329 157069460 154016376 150937930 147869632 144801602 141699150 138571098
3175.7 138571098 135444030 132388934 129411131 126421869 123404369 120403357 117462642 114556052
3192 114556052 111679733 108912274 106243938 103600569 100997947 98491929 96072584 93696430 91366887
3210.3 91366887 89158408 87068170 85002311 82988426 81088513 79229265 77386461 75655036
3226.7 75655036 74026659 72408155 70806950 69294028 67890175 66535026 65162942 63827433
3243 63827433 62576272 61351970 60140461 58970153 57841707 56743551 55671602 54609615 53545203
3261.3E3545203j046106j044553j051031j024071j013987j038924j060374j067374
3277.7D5198783j062553j052212j053412j055829j047760j054008j079633j108867
3294C6684509j137089j144845j107610j047191j030007j078598j131276j125215j063628
3312.3B6819050j019105j045005j080638j043014r56297r27698r76265r59916q60814
3330.7A7950298q27068q55129q30961p87524p86147p68443p38876o69891n67430n69446
3351.1A0549383o33399o41892n77333m61986l94913m28329m14951l12374l10935m46777
3371.5E926494m80364l64169k95470k90408k89657k62171k17535j38355m7655r6767
3391.9C443943k46724k81885j49507m3669j13696k69222k94888j86167o6957K3378
$$ plain form
3261.3 53545203 52499097 51454544 50403513 49379442 48365455 47326531 46266157 45198783
3277.7 45198783 44136230 43084018 42030606 40974777 39927017 38873009 37793376 36684509
3294 36684509 35547420 34402575 33294965 32247774 31217767 30139169 29007893 27882678 26819050
3312.3 26819050 25799945 24754940 23674302 22631288 21674991 20747293 19771028 18811112 17950298
3330.7 17950298 17123230 16268101 15437140 14649616 13863469 13095026 12356150 11686259 11118829 10549383
3351.1 10549383 9915984 9274092 8696759 8234773 7839860 7411531 6996580 6684206 6373271 5926494
3371.5 5926494 5446130 5081961 4786491 4496083 4206426 3944255 3726720 3588365 3540710 3443943
3391.9 3443943 3197219 2915334 2765827 2722158 2608462 2339240 2044352 1858185 1791228 1814606
3412.3A814606L846j27312j81642j15270r2876q3091L8697J13169J4417l2003J1559
3434.7A364100n1887j45906j43676j06692m8733m82n6358q5215M276R7237J15133N3770
3459.2I95567n2505q2887N8195K05618J15668j18455j86237o3777P0716J06085N192
3481.6A053180o3492K5937Q0985J8528J6873O6264Q4017N7680N1381Q7885K2100q1528
3506.1A419810o6444J9360Q8856O6368k768N352J09418J99547J25078M946K4858J06735
3530.6B101116J08310Q8156R9052N1566P1503K14048K40484Q1694p306M6157R4350
3553C189130J26191J86806J94394Q3068o885P4123K93670L85782K98881K26937K02782
3575.4E254879K54927M07172M90318M39297M00930M44443M42734M00952N63719Q08125
$$ plain form
3412.3 1814606 1818452 1691140 1509498 1394228 1301352 1218261 1256958 1370127 1384544 1352541 1364100
3434.7 1364100 1312213 1166307 1022631 915939 867206 866724 810366 725151 729427 826664 941797 995567
3459.2 995567 943062 860175 918370 1123988 1239656 1121201 934964 871187 941903 1047988 1053180
3481.6 1053180 989688 1015625 1096610 1115138 1132011 1198275 1282292 1339972 1391353 1479238 1501338 1419810
3506.1 1419810 1353366 1372726 1461582 1527950 1525182 1530534 1639952 1839499 1964577 1969523 1994381 2101116
3530.6 2101116 2209426 2297582 2396634 2448200 2519703 2733751 2974235 3055929 3048623 3094780 3189130
3553 3189130 3315321 3502127 3696521 3779589 3772704 3846827 4140497 4526279 4825160 5052097 5254879
3575.4 5254879 5509806 5916978 6407296 6846593 7247523 7691966 8134700 8535652 9099371 9907496
3595.8I907496R12677R12571Q84847Q77197R93541J308247J556216J695735J789128
3614.2B0837655J886428K470405L078796K766395K362175K841957M464854N107734
3630.5D5816399M245773M406940M945021N261809N530559N453884N291254O187602
3646.8H7139241Q439333Q638471O353274O099358P413924P161818O380186O161243
3663.1A43786848N729600N586610O520807O489680N301982O172985O275862M582956
3679.4A90447330L945172L707171L537342M070282M633680L917560K991303K625391
3695.8B19875231K433747K424419K631307K349556J751288J565442J964375K378702
3712.1B37374067J905784J278267J187622J382768J463607J362026J127645P93651
$$ plain form
3595.8 9907496 10820173 11732744 12617591 13494788 14488329 15796576 17352792 19048527 20837655
3614.2 20837655 22724083 25194488 28273284 31039679 33401854 36243811 40708665 45816399
3630.5 45816399 50062172 54469112 59414133 64675942 70206501 75660385 80951639 87139241
3646.8 87139241 95578574 104217045 110570319 116669677 124083601 131245419 137625605 143786848
3663.1 143786848 149516448 155103058 161623865 168113545 173415527 179588512 185864374 190447330
3679.4 190447330 194392502 198099673 201637015 205707297 210340977 214258537 217249840 219875231
3695.8 219875231 222308978 224733397 227364704 229714260 231465548 233030990 234995365 237374067
3712.1 237374067 239279851 240558118 241745740 243128508 244592115 245954141 247081786 247875437
3728.4B47875437O60435J002699J472115J390666P02411J88261M24922R11891O32286
3746.7B55261123M59999R23902Q69751M38124M17322O24537O29842M32969L17364L32207
3767.1B60707140N32001O28352L87222J71989K38687L65555L31760L03477L52323L32057
3787.5B64350563K53856J51456M4554L9399O5535K25365M26054K75165J57267J88857
3807.9B66178071Q137j22309J1205J16170O9499J34021K31773J24603K09o4761j04099
3830.4B66582519j35631q5592J48893K50607R4563K1994m3332k15918l35962k37196
3850.8B66044945K53736M94421n8472l39538k04623k5779n1617r3192L7014R1613m0472
3873.2B66108036j39564j67668j08928k3424j5438M6164L4928m8577N155k9474j72764
$$ plain form
3728.4 247875437 248535872 249538571 251010686 252401352 253103763 253292024 253716946 254628837 255261123
3746.7 255261123 255721122 256645024 257514775 257952899 258370221 258994758 259624600 260057569 260374933 260707140
3767.1 260707140 261239141 261867493 262254715 262426704 262665391 263030946 263362706 263666183 264018506 264350563
3787.5 264350563 264604419 264755875 264800429 264839828 264905363 265130728 265556782 265831947 265989214 266178071
3807.9 266178071 266186208 266063899 266075104 266191274 266260773 266394794 266626567 266751170 266751379 266686618 266582519
3830.4 266582519 266446888 266361296 266510189 266760796 266855359 266877353 266834021 266618103 266282141 266044945
3850.8 266044945 266298681 266793102 266734630 266395092 266190469 266164690 266113073 266019881 266056895 266148508 266108036
3873.2 266108036 265968472 265800804 265691876 265668452 265653014 265699178 265734106 265685529 265690684 265661210 265488446
3895.6B65488446j55330N841J60724K05964R9838k5511m3273K474O0349J22846J28835
3918.1B66051203O9052M1425J15633J54793M9264K9474J01239Q7768N0634O2853J79976
3940.5B66993314K51621J05768L0548J70499K40833J31666N7995J00673J46687J81377
3960.9B68410981K30401K29031J69039J41651J65164J82927J65730J21206J19865J64271
3981.3B70100266J69605J40369J57743K17200K05725J52916J94877K33352
3997.6B71572053
$$ plain form
3895.6 265488446 265333116 265338957 265499681 265705645 265805483 265779972 265736699 265739173 265799522 265922368 266051203
3918.1 266051203 266120255 266161680 266277313 266432106 266481370 266510844 266612083 266699851 266750485 266813338 266993314
3940.5 266993314 267244935 267350703 267381251 267551750 267792583 267924249 267982244 268082917 268229604 268410981
3960.9 268410981 268641382 268870413 269039452 269181103 269346267 269529194 269694924 269816130 269935995 270100266
3981.3 270100266 270269871 270410240 270567983 270785183 270990908 271143824 271338701 271572053
3997.6 271572053
##END=$$ End of the data block
