##TITLE=KOOOCH3 $$ Begin of the data block
##JCAMP-DX=5.00 $$ ACD/SpecManager v 10.08
##SPECTROMETER/DATA SYSTEM=Alpha
##DATE=08 Jun 2015 09:26:56
##DATA TYPE=INFRARED SPECTRUM
##DATA CLASS=XYDATA
##ORIGIN=
##OWNER=
##NPOINTS=1765
##FIRSTX=399.76428223
##LASTX=3997.64306641
##MAXX=3997.64306641
##MINX=399.76428223
##MAXY=1.00065899
##MINY=0.45346206
##XFACTOR=1.0000000000
##YFACTOR=0.000000010000000
##FIRSTY=1.00000000
##DELTAX=2.03961372
##XUNITS=1/CM
##YUNITS=ARBITRARY UNITS
##XYDATA=(X++(Y..Y))
399.8A00000000Tm31359j41364L41642j65850q13133n73593m30691j166576j199842
$$ 100000000 100000000 99568641 99427277 99768919 99603069 98789936 98216343 97785652 96619076 95419234
420.2I5419234k2215p0023j208335j291418m2R52142J041937J259154J509941R27883
$$ 95419234 95397019 95326996 94118661 92827243 92827201 93779343 94821280 96080434 97590375 98518258
440.6I8518258N4854J33926O26767K45017l58767m3565M02570r8568n60230J4150L26121
$$ 98518258 98573112 98707038 99333805 99578822 99220055 99176490 99579060 99480492 98920262 98934412 99260533
463I9260533l35080p72196l69316k37274o13523j78659Q70073R34088M5205k07764
$$ 99260533 98925453 98153257 97783941 97546667 96933144 96754485 97624558 98558646 98603851 98396087
483.4I8396087K15828j73968j271993j453709k73192P66950P81012O69205P11757J17552
$$ 98396087 98611915 98437947 97165954 95712245 95439053 96206003 96987015 97656220 98367977 98485529
503.8I8485529n62846l59029j35797q60488j532424j247591j094007j627225j162690
$$ 98485529 97922683 97563654 97427857 96567369 95034945 93787354 92693347 91066122 89903432
522.1H9903432M89736J053858J17385p0185J177544K105003J579237Q25525P93034
$$ 89903432 90393168 91447026 91564411 91494226 92671770 94776773 96356010 97181535 97974569
540.5I7974569N61881j71358l70639n3960m64875j365894r40758P32762J357519N77402
$$ 97974569 98536450 98365092 97994453 97940493 97475618 96109724 95168966 95901728 97259247 97836649
560.9I7836649J69230L76058J36065l23343p2652M09257J72633k85333n7567L40116
$$ 97836649 98005879 98381937 98518002 98194659 98122007 98531264 98703897 98418564 98360997 98701113
581.3I8701113P1842l11017k9898L16900N102l19415L0023L47567j7703l09622P1060
$$ 98701113 98772955 98461938 98432040 98748940 98754042 98434627 98464650 98812217 98794514 98484892 98555952
603.7I8555952L31736n9587k97302J05435K95484j83666m35597J9068K99621l5674
$$ 98555952 98887688 98828101 98530799 98636234 98931718 98748052 98312455 98331523 98631144 98595470
624.1I8595470j90031J44291R7376n08046o39451o2060L8576p54863j119650l23397
$$ 98595470 98405439 98549730 98647106 98139060 97499609 97437549 97476125 96721262 95601612 95278215
644.5I5278215N95707Q91233J009345J091337O60711l6472q8811L29024K32136k09588
$$ 95278215 95873922 96765155 97774500 98865837 99526548 99490076 99401265 99730289 99962425 99752837
664.9I9752837j78915L03680J19585k96653j20246L02988J16724l03149j14948K64728
$$ 99752837 99573922 99877602 99997187 99700534 99580288 99883276 100000000 99696851 99581903 99846631
685.3I9846631O670m17227k34103k1249n00047q20434k8741Q62157O36703O5493J61839
$$ 99846631 99853301 99436074 99201971 99180722 98680675 97860241 97831500 98693657 99330360 99395853 99557692
707.7I9557692L65710Q398l03644j1396K15107j66219m84562k95174l64191q75568
$$ 99557692 99923402 99931800 99628156 99616760 99831867 99665648 99181086 98885912 98521721 97646153
728.1I7646153n66453O84792J102972K60466l88091k59352j27059k72698l4642O00344
$$ 97646153 97079700 97764492 98867464 99127930 98739839 98480487 98353428 98080730 98046088 98646432
748.5I8646432P21890J93828p5072J84173K23213j65004k67565O0171R6709k82920
$$ 98646432 99368322 99562150 99487078 99671251 99894464 99729460 99461895 99522066 99618775 99335855
768.9I9335855l91632j62071k61808o05887l97175K07674K21533l59881o59382o68073
$$ 99335855 98944223 98782152 98520344 97914457 97517282 97724956 97946489 97586608 96927226 96259153
789.3I6259153j317656l237087n467826m408532J273525N787205N063969K295655J75303
$$ 96259153 94941497 91704410 86236584 81828052 83101577 88888782 93952751 96248406 96423709
807.7I6423709j053857o13869J031912J649993Q18187J37377J2070l29703r58484j501805
$$ 96423709 95369852 94755983 95787895 97437888 98256075 98393452 98405522 98075819 97117335 95615530
828.1I5615530k489501m582298o034160l860467K84272K647650L934628M679430L511214
$$ 95615530 93126029 88543731 82509571 78649104 78933376 81581026 85515654 90195084 93706298
846.4I3706298J344120j55663m93920j5050O34926J137573J405007J250517O52099
$$ 93706298 95050418 94894755 94400835 94385785 95020711 96158284 97563291 98813808 99465907
864.8I9465907J24931J17463K55471L6228k20811q3775J09804o5929k73448j24448
$$ 99465907 99590838 99708301 99963772 100000000 99779189 99695414 99805218 99739289 99465841 99341393
885.2I9341393l767l11471o21521m19533M0126K45314J74660J38628R0707j73921l47679
$$ 99341393 99337626 99026155 98404634 97985101 98025227 98270541 98445201 98583829 98674536 98500615 98152936
907.6I8152936j85317q9908l36254n47576n05465o30325j187295j889997k661860l679294
$$ 98152936 97967619 97877711 97541457 96993881 96488416 95858091 94670796 92780799 90118939 86439645
928H6439645m245352l069419j35148K577871L236998K618402K295089J953899J167673
$$ 86439645 82194293 79124874 78989726 81567597 84804595 87422997 89718086 91671985 92839658
946.4I2839658Q91257J266020J302374Q58265M37510K22075K9307k17038k35224O259
$$ 92839658 93730915 94996935 96299309 97157574 97595084 97817159 97846466 97629428 97394204 97400463
966.8I7400463P8916j92070m35632m55046l61580j70326J6594J4335k52283o71863
$$ 97400463 97479379 97287309 96851677 96396631 96035051 95864725 95881319 95895654 95643371 94971508
987.2I4971508r03589p32612l87317l14069o23143j055383j546222j893133j354725
$$ 94971508 94067919 93335307 92947990 92633921 92010778 90955395 89409173 87516040 86161315
1005.5H6161315M2063O38909p08849k805489l505510k113086j87153J210624K401847
$$ 86161315 86203378 86842287 86133438 83327949 79822439 77709353 77522200 78732824 81134671
1023.9H1134671K466613R32056m20267k75510R02086J998067K338094K031004J449359
$$ 81134671 83601284 84533340 84113073 83837563 84739649 86737716 89075810 91106814 92556173
1042.2I2556173Q79949N63353M74864L49844J50502R0426J62262J19495l4881n7590
$$ 92556173 93436122 93999475 94474339 94824183 94974685 95065111 95227373 95346868 95311987 95254397
1062.6I5254397L6228J0574j15454j20026k7204n1945j65820j60140p2312j08576k26045
$$ 95254397 95290625 95301199 95185745 95065719 95038515 94986570 94820750 94660610 94588298 94479722 94253677
1085.1I4253677k23464j44702j86401l05754l13354k63816l46857m98271n43255n67895
$$ 94253677 94030213 93885511 93699110 93393356 93080002 92816186 92469329 91971058 91427803 90859908
1105.5I0859908p18641p66749l90172Q9831M7475m86607j086741j525796j408022l88331
$$ 90859908 90141267 89374518 88984346 89074177 89121652 88635045 87548304 86022508 84614486 84226155
1125.9H4226155Q14247J158876P20900J81758j55711l89367o67447r53716j132810
$$ 84226155 85040402 86199278 86920178 87101936 86946225 86556858 85889411 84935695 83802885
1144.2H3802885j222563j348019j568889j901913k423531l086036l556937l542757
$$ 83802885 82580322 81232303 79663414 77761501 75337970 72251934 68694997 65152240
1160.5F5152240l262729l367644m081130m504892l482005j107634J556501L829727
$$ 65152240 61889511 58521867 54440737 49935845 46453840 45346206 46902707 50732434
1176.9E0732434N600863O820339P353890O958300N409384K961671K46013k318895m468423
$$ 50732434 56333297 63153636 70507526 77465826 82875210 85836881 86082894 83763999 79295576
1195.2G9295576n558998m822087k576989k46781J281702K253861L049093L531045L425610
$$ 79295576 73736578 68914491 66337502 66090721 67372423 69626284 72675377 76206422 79632032
1213.6G9632032K860725K210891J613486R90033L59511j90579p18838j213152j257693
$$ 79632032 82492757 84703648 86317134 87307167 87666678 87476099 86757261 85544109 84286416
1231.9H4286416m91721O50895J296049J132107N62918L2455m09657q89784j404536
$$ 84286416 83794695 84445590 85741639 86873746 87436664 87469119 87059462 86169678 84765142
1250.3H4765142j872438k283669k659493k945507l045010l033632l020913k695238
$$ 84765142 82892704 80609035 77949542 75004035 71959025 68925393 65904480 63209242
1266.6F3209242j812733o78151M49889J292062R81945q66419k822208l009940j364863
$$ 63209242 61396509 60718358 61168247 62460309 63442254 62575835 59753627 56743687 55378824
1285E5378824P68799K386534L304988L750110L932935L941798L796977L489828K972245
$$ 55378824 56147623 58534157 61839145 65589255 69522190 73463988 77260965 80750793 83723038
1303.3H3723038K226448J330716K76053r27502j266706K99895K053076J844340M31961
$$ 83723038 85949486 87280202 87556255 86628753 85362047 85661942 87715018 89559358 89991319
1321.7H9991319o50239j032680q07023j92624N52445J189232J526779J568919J445610
$$ 89991319 89341080 88308400 87501377 87308753 87861198 89050430 90577209 92146128 93591738
1340I3591738J180655Q43095N52792L66759K58249J27667n4598k37143m09883o32220
$$ 93591738 94772393 95615488 96168280 96535039 96793288 96920955 96866357 96629214 96219331 95587111
1360.4I5587111q53742r32049j009173j321625j765079k374482l259122l954452l778303
$$ 95587111 94733369 93801320 92792147 91470522 89705443 87330961 84071839 80117387 76339084
1378.8G6339084j954687N84924Q80492j157725k150040j158673M19789K592385M258722
$$ 76339084 74384397 74969321 75849813 74692088 72542048 71383375 71803164 74395549 78654271
1397.1G8654271M521013L770357K716285J982057J344323P87241M02933J53458l1060
$$ 78654271 83175284 86945641 89661926 91643983 92988306 93775547 94178480 94331938 94300878
1415.5I4300878l04192p52551j258009k043248l042465l368258k009744R74095L056353
$$ 94300878 93996686 93244135 91986126 89942878 86900413 83532155 81522411 82496506 85552859
1433.9H5552859L454459K700555J352167M75073K39981N27012Q57365O56849P2563
$$ 85552859 89007318 91707873 93060040 93535113 93775094 94302106 95159471 95816320 95888883
1452.2I5888883m86028j094491j289695n98747k557M61412P33733N99575M15194M19837
$$ 95888883 95402855 94308364 93018669 92419922 92417365 92878777 93612510 94212085 94627279 95047116
1472.6I5047116M57573L82382L23242L23969K91038J15489j49524l88121n21750n59413
$$ 95047116 95504689 95887071 96210313 96534282 96825320 96940809 96791285 96403164 95881414 95322001
1493I5322001o52939p67511q27360j017052j382423k527171m576361m281986k785361
$$ 95322001 94669062 93901551 93074191 92057139 90674716 88147545 83571184 79289198 76503837
1511.4G6503837j103121K068567N299884N606515L930771J866806M32866j00922k59608
$$ 76503837 75400716 77469283 82769167 88375682 92306453 94173259 94606125 94505203 94245595
1529.7I4245595m70102p65914p84576q34793j271325j387000j219541j336872j580465
$$ 94245595 93775493 93009579 92225003 91390210 90118885 88731885 87512344 86175472 84595007
1548.1H4595007j934815k131939k184367k177495k865356l426915k242351j423317
$$ 84595007 82660192 80528253 78343886 76166391 73301035 69874120 67631769 66208452
1564.4F6208452o30075l72970j607632k553124k074045k93529J806128K783752L284889
$$ 66208452 65578377 65205407 63597775 61044651 58970606 58677077 60483205 63266957 66551846
1582.8F6551846L451932L431922L286350K908843K301181J629507R44621K54142l38650
$$ 66551846 70003778 73435700 76722050 79630893 81932074 83561581 84506202 84760344 84421694
1601.1H4421694o30718m26120K35081J160032J847577J840484J450377J098216P12234
$$ 84421694 83790976 83364856 83599937 84759969 86607546 88448030 89898407 90996623 91708857
1619.5I1708857M32432L07345K24215J60509J18673P5030J5879N9563J79821J85496
$$ 91708857 92141289 92448634 92672849 92833358 92952031 93027061 93042940 93102503 93282324 93467820
1639.9I3467820J46615J17791R4145J26774J17522L8838J70917L06850K46072J52296
$$ 93467820 93614435 93732226 93826371 93953145 94070667 94109505 94280422 94587272 94833344 94985640
1660.3I4985640O0242j3929q1211j79983k53564l09777n40930p64382q35824q93837
$$ 94985640 95045882 95031953 94950742 94770759 94517195 94207418 93666488 92902106 92066282 91172445
1680.7I1172445r71145r67961p21008p61443j069361j279736j721626k138716k513558
$$ 91172445 90201300 89233339 88512331 87750888 86681527 85401791 83680165 81541449 79027891
1699G9027891l498900l734714m497289n687899n329042l933084k001477K7442K255321
$$ 79027891 75528991 71794277 67296988 61609089 56280047 52346963 50345486 50372928 52628249
1717.4E2628249L813535L924012L938305L778869L287036K815520K309037K053064
$$ 52628249 56441784 60365796 64304101 68082970 71370006 74185526 76494563 78547627
1733.7G8547627J620483O92082k29657r63146j051604n09203J50192O59692J084942
$$ 78547627 80168110 80860192 80630535 79667389 78615785 78106582 78256774 78916466 80001408
1752H0001408J437187J887012K224177K142703J973081J603079J173240R08690O58805
$$ 80001408 81438595 83325607 85549784 87692487 89665568 91268647 92441887 93350577 94009382
1770.4I4009382N11550M37510L19124K14314J88804K13897K20871K20078K28519K72023
$$ 94009382 94520932 94958442 95277566 95491880 95680684 95894581 96115452 96335530 96564049 96836072
1790.8I6836072L52270L52525K75129K20257J91594J72466J54221J33395R9176Q0156
$$ 96836072 97188342 97540867 97815996 98036253 98227847 98400313 98554534 98687929 98787105 98867261
1811.2I8867261J10078J33401J07432O3115M8614N2809N8860N4926P2324J28752J16128
$$ 98867261 98977339 99110740 99218172 99281287 99329901 99382710 99441570 99496496 99568820 99697572 99813700
1833.6I9813700M4638K5856M3339p93n7393n347O3598M3899l362j4859l111j5748l7128
$$ 99813700 99858338 99884194 99927533 99926740 99869347 99864000 99927598 99971497 99968135 99953276 99950165 99934417 99897289
1860.2I9897289k1505k408l0404m4692L3700R0844M8888l428K766K5260L690k4343
$$ 99897289 99875784 99873376 99842972 99798280 99831980 99922824 99971712 99968284 99971050 99996310 100000000 99975657
1884.6I9975657k4193j6832j8329k3603j6815j085k7597p2717q2356q7541j04141o4618
$$ 99975657 99951464 99934632 99916303 99892700 99875885 99874800 99847203 99774486 99692130 99604589 99500448 99435830
1909.1I9435830L5250Q2583M8190L4898R0290J08587N5748R174m626j7440m4805m5270
$$ 99435830 99471080 99553663 99601853 99636751 99727041 99835628 99891376 99900550 99895924 99878484 99833679 99788409
1933.6I9788409o79K3115j7703n2965j0043L8993J9777q988R411M2689M4990L5381
$$ 99788409 99787730 99810845 99793142 99740177 99730134 99769127 99788904 99779916 99789327 99832016 99877006 99912387
1958.1I9912387M5437M2176M65l1406m339J7267j7768m5603k5481q673j9878r328L3861
$$ 99912387 99957824 100000000 100000465 99969059 99964720 99981987 99964219 99918616 99893135 99884462 99864584 99855256 99889117
1984.6I9889117M4841K968k4068J067J5521k3884n1319l3099l0964o5166p9048n7482
$$ 99889117 99933958 99936926 99912858 99913925 99929446 99905562 99854243 99821144 99790180 99725014 99645966 99588484
2009I9588484o3897j10423j11354l2192J7714k5957p6372m4381M5496P2974L4350K3532
$$ 99588484 99524587 99414164 99302810 99270618 99288332 99262375 99186003 99141622 99187118 99260092 99294442 99317974
2033.5I9317974J8358j5294k5607J139O544k1165k1237J7666L3182J1558J5932N4568
$$ 99317974 99336332 99321038 99295431 99296570 99303114 99281949 99260712 99278378 99311560 99323118 99339050 99393618
2058I9393618O4546M3160N1731R0330Q9097M2475K2554M2999M0138M458k217K3973
$$ 99393618 99458164 99501324 99553055 99643385 99732482 99774957 99797511 99840510 99880648 99885106 99882889 99906862
2082.5I9906862J9628j6225j7899J6230K3008r24K110L1078K5707j1349j3434J9031
$$ 99906862 99926490 99910265 99892366 99908596 99931604 99930680 99932790 99963868 99989575 99978226 99964792 99983823
2106.9I9983823J7059j7756j7721J3489R435k3710k1684Q720N692k3484j6928J6242
$$ 99983823 100000882 99983126 99965405 99978894 99988329 99964619 99942935 99951655 99957347 99933863 99916935 99933177
2131.4I9933177J1701k0844j2994K4533K0522j1486l69L3253J8961k0344j5723J5795
$$ 99933177 99944878 99924034 99911040 99935573 99956095 99944609 99944240 99977493 99996454 99976110 99960387 99976182
2155.9I9976182P445k6441j9652J1313k521l9327k2525K3270J4567k4569j2636K4819
$$ 99976182 99983627 99957186 99937534 99948847 99946326 99906999 99884474 99907744 99922311 99897742 99885106 99909925
2180.4I9909925J3131j7714K527L8380K0724j5598j002L2968J6659j6093j478L1447
$$ 99909925 99923056 99905342 99907869 99946249 99966973 99951375 99950373 99983341 100000000 99983907 99982429 100013876
2204.8A00013876J6689j3387J431K4938l004m2081k7382P81k0534m5800j5152K2853
$$ 100013876 100030565 100017178 100018609 100043547 100040543 99998462 99971080 99971861 99951327 99905527 99890375 99913228
2229.3I9913228M798k2918L761L9846K3072o711R662K9254o068m5538k8181m899l3039
$$ 99913228 99918026 99895108 99898869 99938715 99961787 99955076 99964738 99993992 99987924 99942386 99914205 99909306 99876267
2255.8I9876267o0159l2431K515r537k6035M691L4499J0801j2446J4997L4505m351
$$ 99876267 99816108 99783677 99786192 99776655 99750620 99755311 99789810 99800611 99788165 99803162 99837667 99833316
2280.3I9833316m1455j8043J4109J13j1599K4950N3293K3359r322R757L0822R23k8818
$$ 99833316 99791861 99773818 99787927 99788040 99776441 99801391 99854684 99878043 99868721 99878478 99909300 99910223 99881405
2306.8I9881405j0199K921k9385m8769j8155R221j1599l4231m870K4330M12j8364K2083
$$ 99881405 99871206 99874127 99844742 99795973 99777818 99787039 99775440 99741209 99736339 99760669 99761081 99742717 99764800
2333.3I9764800N4658K5779l130K4700M5079J1695P558L7729L1132k3478n9605l9524
$$ 99764800 99819458 99845237 99842107 99866807 99911886 99923581 99931139 99968868 100000000 99976522 99916917 99877393
2357.8I9877393k4175n2077o5309j9967J0913j5437j9151K6637M0066j90j7310J6654
$$ 99877393 99853218 99801141 99735832 99715865 99726778 99711341 99692190 99718827 99758893 99758703 99741393 99758047
2382.3I9758047L7825J4031l082J5283J9211j2893j8537K6482N3984K9332P641K1958
$$ 99758047 99795872 99809903 99806821 99822104 99841315 99828422 99809885 99836367 99890351 99919683 99927324 99949282
2406.8I9949282K5732n770k1029M399J4085j8531l4344q810l213l6931m7183j3786
$$ 99949282 99975014 99969244 99948215 99952614 99966699 99948168 99913824 99905014 99901801 99864870 99817687 99803901
2431.2I9803901M714j5181j8340J5962K8723L356k742K1524K2202q046j2189J7452
$$ 99803901 99808615 99793434 99775094 99791056 99819779 99823135 99820393 99841917 99864119 99856073 99843884 99861336
2455.7I9861336J9133j5986k7436j902P356k0701l7229j9610j4120l1674k3699J3542
$$ 99861336 99880469 99864483 99837047 99835145 99842501 99821800 99784571 99764961 99750841 99719167 99695468 99709010
2480.2I9709010K0540j8591m1866k5064j6785k7394j0735L2169M4572J9616R269K6148
$$ 99709010 99729550 99710959 99669093 99644029 99627244 99599850 99589115 99621284 99665856 99685472 99694741 99720889
2504.7I9720889K5243n037j8024j276K432j7059j7261O658N269k7263l6192q876L946
$$ 99720889 99746132 99741095 99723071 99721795 99724227 99707168 99689907 99696565 99701834 99674571 99638379 99629503 99633449
2531.2I9633449n889M745L4618L7432J2362J0824L9679M3088R370k956J6713J2338
$$ 99633449 99627560 99632305 99666923 99704355 99716717 99727541 99767220 99810308 99819678 99816722 99833435 99845773
2555.6I9845773k0349k6089k420l219k9903l0893q077j4132m5198m6402j4747j37p587
$$ 99845773 99825424 99799335 99796915 99793696 99763793 99732900 99724823 99710691 99665493 99619091 99604344 99604207 99596620
2582.2I9596620N495L6037L8445R179n519Q529Q893j1277n764K2322K3514J204J288
$$ 99596620 99602115 99638152 99676597 99685776 99680257 99688786 99697679 99686402 99680638 99702960 99726474 99727678 99728966
2608.7I9728966K0987J3870j8090k8509k0415l1084m2444m751N9426O9368J8269j7095
$$ 99728966 99749953 99763823 99745733 99717224 99696809 99665725 99623281 99618530 99677956 99747324 99765593 99748498
2633.2I9748498j1855j4103l1376j8918K1714L6848K1821K4098M4489L7604M113o759
$$ 99748498 99736643 99722540 99691164 99672246 99693960 99730808 99752629 99776727 99821216 99858820 99862933 99856174
2657.6I9856174Q184L129k2048k2596l338m530j9109j3387R626J3983m142o825P331
$$ 99856174 99864358 99867487 99845439 99822843 99819505 99814975 99795866 99782479 99792105 99806088 99801946 99795121 99802452
2684.1I9802452J109j9324j4579M738l349k7430k9082k1135l5960n6654m9430l3146
$$ 99802452 99803561 99784237 99769658 99774396 99771047 99743617 99714535 99693400 99657440 99600786 99551356 99518210
2708.6I9518210m7064p4285o9851m6152m1848l8875j150M8173O0093M9776O1196P7647
$$ 99518210 99471146 99396861 99327010 99280858 99239010 99200135 99198985 99247158 99307251 99357027 99418223 99495870
2733.1I9495870O7776M6784M0615M1353K6441O801P313J6624J0783J609J0347K0337
$$ 99495870 99563646 99610430 99651045 99692398 99718839 99725640 99732953 99749577 99760360 99761969 99772316 99792653
2757.6I9792653J0532k247O6L695n281j0865M744J9270Q476l904L713J2863N817m780
$$ 99792653 99803185 99800938 99801004 99804699 99799418 99788553 99793297 99812567 99821043 99817139 99820852 99833715 99839532 99834752
2786.1I9834752l046k783j9819l3748k3854j7130l5471n0646m1658l1888m3464o3658
$$ 99834752 99831706 99828923 99809104 99775356 99751502 99734372 99698901 99648255 99606597 99574709 99531245 99467587
2810.6I9467587p0869p1019q2076q2976m7606o026J890j4341k4587l1614n6142r1350
$$ 99467587 99396718 99325699 99243623 99160647 99113041 99107015 99108905 99094564 99069977 99038363 98982221 98890871
2835.1I8890871j20259j64127k37876k99943l00926j93423L0661K60228L58087L09390
$$ 98890871 98770612 98606485 98368609 98068666 97767740 97574317 97604978 97865206 98223293 98532683
2855.5I8532683J98644R8515L3187p778m0960n9718m8727k2882j7786k3705o163J6439
$$ 98532683 98731327 98829842 98863029 98855251 98814291 98754573 98705846 98682964 98665178 98641473 98635310 98651749
2879.9I8651749J5783L296n346j5021l3730m5490m3607n5617q5258r9212r1774q4954
$$ 98651749 98667532 98670828 98665482 98650461 98616731 98571241 98527634 98472017 98386759 98287547 98195773 98110819
2904.4I8110819p2658m1664j3494j8168n6624r4921j06668j05572j01715r0718p1246
$$ 98110819 98038161 97996497 97983003 97964835 97908211 97813290 97706622 97601050 97499335 97408617 97337371
2926.8I7337371n6696o7425q2838q4221j00703j44296j70857j35398l1024J08576K15661
$$ 97337371 97280675 97213250 97130412 97046191 96945488 96801192 96630335 96494937 96463913 96572489 96788150
2949.3I6788150K32148J47081L1823j5510K3383R4229J32704J17952P3558K7776l249
$$ 96788150 97020298 97167379 97199202 97183692 97207075 97301304 97434008 97551960 97625518 97653294 97650045
2971.7I7650045k8461o2859r9981j46514k09904k52896k60848k77627l30287m02343
$$ 97650045 97621584 97558725 97458744 97312230 97102326 96849430 96588582 96310955 95980668 95578325
2992.1I5578325m18717k76261k3222J61755K12580K09474K37000L10862L85291M02784
$$ 95578325 95159608 94883347 94860125 95021880 95234460 95443934 95680934 95991796 96377087 96779871
3012.5I6779871L61645L20024K99203K54995J73044Q5920K4336J1278M8500R7835J00219
$$ 96779871 97141516 97461540 97760743 98015738 98188782 98274702 98299038 98310316 98358816 98456651 98556870
3034.9I8556870N6851L9393O4462P9257O3556M1056L1000K0933J270j7166l8982n8853
$$ 98556870 98613721 98653114 98717576 98796833 98860389 98901445 98932445 98953378 98954648 98937482 98898500 98839647
3059.4I8839647o3694n9497m6206l7581l7914j5831L1733P7880R1004N8174J4562j2589
$$ 98839647 98775953 98716456 98670250 98632669 98594755 98578924 98610657 98688537 98779541 98837715 98852277 98839688
3083.9I8839688l1274l8892m0561n4473p2390q7571j10674j51038j96487k05391j42092
$$ 98839688 98808414 98769522 98728961 98674488 98602098 98514527 98403853 98252815 98056328 97850937 97708845
3106.3I7708845k8783N8931Q8817R0975Q2433N8091K4056L558L058O640J0133K1034
$$ 97708845 97680062 97738993 97827810 97918785 98001218 98059309 98083365 98086923 98089981 98096621 98106754 98127788
3130.8I8127788L3379L5727L3766L5012L0809J5629k27o908j1069k1159l2038l8355
$$ 98127788 98161167 98196894 98230660 98265672 98296481 98312110 98311883 98304975 98293906 98272747 98240709 98202354
3155.3I8202354m0037m2534n0419n5206n1546m9597n4848n4300m7237n1546o2126n9974
$$ 98202354 98162317 98119783 98069364 98014158 97962612 97913015 97858167 97803867 97756630 97705084 97642958 97582984
3179.8I7582984n3638n6976o1417n7864n4306o4385p9578q1414p6312p7301p8899p1770
$$ 97582984 97529346 97472370 97410953 97353089 97298783 97234398 97154820 97073406 96997094 96919793 96840894 96769124
3204.2I6769124o7109p5680q2403p8249p5793q2058q9252q6820q2195r1225j01775
$$ 96769124 96702015 96626335 96543932 96465683 96389890 96307832 96218580 96131760 96049565 95958340 95856565
3226.7I5856565q8644o1691o4557j00649j15156r7901q8799q4447o6615o3777q8286
$$ 95856565 95767921 95706230 95641673 95541024 95425868 95327967 95239168 95154721 95088106 95024329 94936043
3249.1I4936043r5493p2562o1024p5513q2165o5219n3418n2339l4147j3322l8111q5419
$$ 94936043 94840550 94767988 94706964 94631451 94549286 94484067 94430649 94378310 94344163 94330841 94292730 94207311
3273.6I4207311r6947q4019p8237p9906q0657p8118p0006o0921o8891r2078j17534
$$ 94207311 94110364 94026345 93948108 93868202 93787545 93709427 93639421 93578500 93509609 93417531 93299997
3296I3299997j35696j23203q0508n1939p5060j29360j63216j62715j49029j41704j41555
$$ 93299997 93164301 93041098 92960590 92908651 92833591 92704231 92541015 92378300 92229271 92087567 91946012
3318.4I1946012j43844j44822j49530j76686k09856k17306k03824j80406j69718k00921
$$ 91946012 91802168 91657346 91507816 91331130 91121274 90903968 90700144 90519738 90350020 90149099
3338.8I0149099k40279k45338k42967k38859k19071k29520k74235k90543k69979k52891
$$ 90149099 89908820 89663482 89420515 89181656 88962585 88733065 88458830 88168287 87898308 87645417
3359.2H7645417k60615k68161k50328k39086k67500l10146l12853k75976k47746k36184
$$ 87645417 87384802 87116641 86866313 86627227 86359727 86049581 85736728 85460752 85213006 84976822
3379.6H4976822k28363k22755k10052j80871j49744j53238j84143j85006j45555j21766
$$ 84976822 84748459 84525704 84315652 84134781 83985037 83831799 83647656 83462650 83317095 83195329
3400H3195329j44744j68151j52272j29467j29908j36906j31464j19204j14649j09518
$$ 83195329 83050585 82882434 82730162 82600695 82470787 82333881 82202417 82083213 81968564 81859046
3420.4H1859046q5360o0242o2341p8320q2868p9024p7921o6746l8141m226L0780O6132
$$ 81859046 81773686 81713444 81651103 81572783 81489915 81410891 81332970 81266224 81228083 81223857 81254637 81320769
3444.9H1320769R7602J22678J31709J26880J28490J32763J29307J23959J28198J42270
$$ 81320769 81418371 81541049 81672758 81799638 81928128 82060891 82190198 82314157 82442355 82584625
3465.3H2584625J44858J26391J05888J04254J18262J36840J41383J30075J28794J37054
$$ 82584625 82729483 82855874 82961762 83066016 83184278 83321118 83462501 83592576 83721370 83858424
3485.7H3858424J37437J39022J46931J49471J51562J48046J33723J30463J41633J44052
$$ 83858424 83995861 84134883 84281814 84431285 84582847 84730893 84864616 84995079 85136712 85280764
3506.1H5280764J39833J54167J78623J73897J47849J44917J61004J66029J51205J39522
$$ 85280764 85420597 85574764 85753387 85927284 86075133 86220050 86381054 86547083 86698288 86837810
3526.5H6837810J59151J89280J97160J95575J86306J69140J71650J80089J72562J63627
$$ 86837810 86996961 87186241 87383401 87578976 87765282 87934422 88106072 88286161 88458723 88622350
3546.9H8622350J67405J72281J76371J81591J78665J80739J83493J53685J17033J65958
$$ 88622350 88789755 88962036 89138407 89319998 89498663 89679402 89862895 90016580 90133613 90299571
3567.3I0299571K62838K66648K21270K13224K30652K45267K48205K24716J82485J90998
$$ 90299571 90562409 90829057 91050327 91263551 91494203 91739470 91987675 92212391 92394876 92585874
3587.7I2585874K63571K76941K44123K47520K65694K59626K51400K34098J84190J67245
$$ 92585874 92849445 93126386 93370509 93618029 93883723 94143349 94394749 94628847 94813037 94980282
3608.1I4980282K05773K27213K29871K09808J91820K41613K61748J88571Q6683O8677
$$ 94980282 95186055 95413268 95643139 95852947 96044767 96286380 96548128 96736699 96823382 96892059
3628.5I6892059K01452K54607K04599J64640J35296J17535J04224N6094j2326J4961
$$ 96892059 97093511 97348118 97552717 97717357 97852653 97970188 98074412 98130506 98118180 98133141
3648.8I8133141J55461J89036J19674J11556J45644R7841L0249R233l2163p9339k3657
$$ 98133141 98288602 98477638 98597312 98708868 98854512 98952353 98982602 98991835 98959672 98880333 98856676
3671.3I8856676N18k7126P8893J52719J20830Q1122L8451j2809j4192P3946J26511
$$ 98856676 98857194 98830068 98908961 99061680 99182510 99263632 99302083 99289274 99275082 99349028 99475539
3693.7I9475539R5260M0990k015j561L9369L3086k7263p1424j8788Q5509Q7857J7733
$$ 99475539 99570799 99611789 99609774 99608213 99647582 99680668 99653405 99581981 99563193 99648702 99736559 99754292
3718.2I9754292k9832k9433p081K6321L9679j3399q6939p9430L2133J09500M7249q9848
$$ 99754292 99724460 99695027 99687946 99714267 99753946 99740547 99653608 99574178 99606311 99715811 99763060 99673212
3742.7I9673212j16557Q356O283l2646P0685J20014N5850J1575L8397M3065M691j2613
$$ 99673212 99556655 99565011 99571294 99538648 99609333 99729347 99785197 99796772 99835169 99878234 99882925 99870312
3767.1I9870312p117K9016N6660K6131j6135k0868K897M286K980K5487K6351j991l6543
$$ 99870312 99863195 99892211 99948871 99975002 99958867 99937999 99940896 99945182 99948162 99973649 100000000 99998009 99961466
3793.7I9961466n2143l8147n3954m5204L2503K6750K1488P0625M3422m8745q8608m7499
$$ 99961466 99909323 99871176 99817222 99772018 99804521 99831271 99852759 99923384 99966806 99918061 99829453 99781954
3818.1I9781954m5728L624Q7344O6871K1475j2404l0517k9522n5683n2053L0160Q1504
$$ 99781954 99736226 99739850 99827194 99894065 99915540 99903136 99872619 99843097 99787414 99735361 99765521 99847025
3842.6I9847025P9816M4740k7335j33890j99759j2487J61195J02359n335n8651k5874
$$ 99847025 99926841 99971581 99944246 99810356 99610597 99598110 99759305 99861664 99856329 99797678 99771804
3865I9771804J31k7997M53M9049N7417L7462k4355k6452J1861P063K3085J2887j0592
$$ 99771804 99771935 99743938 99744391 99793440 99850857 99888319 99863964 99837512 99849373 99856436 99879521 99892408 99881816
3891.6I9881816K8896K9218m3910q7524n9640M232Q1163J06234N8263M328k6697m0329
$$ 99881816 99910712 99939930 99896020 99808496 99748856 99753088 99834251 99940485 99998748 100003076 99976379 99936050
3916I9936050k2232O789R852J2M131l535k8240j2768L2085L6055M983k2381k3032O265
$$ 99936050 99913818 99920607 99930459 99930471 99934602 99931067 99902827 99890059 99922144 99958199 99963182 99940801 99917769 99924034
3944.6I9924034J9193P647J1295K1279J6552R024K921m828R06J3017R072J645Q834
$$ 99924034 99943227 99950874 99962169 99983448 100000000 100009024 100011945 100007117 100008023 100021040 100030112 100031757 100040591
3971.1A00040591J3649K682o723m566M185J0812N269n13J20n031j1957j2541p617
$$ 100040591 100054240 100056922 100050199 100045633 100049818 100060630 100065899 100065386 100065506 100060475 100048518 100035977 100028360
3997.6A00028360
$$ 100028360
##END=$$ End of the data block
