##TITLE=KOONO2 $$ Begin of the data block
##JCAMP-DX=5.00 $$ ACD/SpecManager v 10.08
##SPECTROMETER/DATA SYSTEM=Alpha
##DATE=08 Jun 2015 09:26:56
##DATA TYPE=INFRARED SPECTRUM
##DATA CLASS=XYDATA
##ORIGIN=
##OWNER=
##NPOINTS=1765
##FIRSTX=399.76428223
##LASTX=3997.64306641
##MAXX=3997.64306641
##MINX=399.76428223
##MAXY=1.00496078
##MINY=0.15197663
##XFACTOR=1.0000000000
##YFACTOR=0.000000010000000
##FIRSTY=1.00000000
##DELTAX=2.03961372
##XUNITS=1/CM
##YUNITS=ARBITRARY UNITS
##XYDATA=(X++(Y..Y))
399.8A00000000k067626j297169N53888J822233J276553k87879q22538j102257r00620
$$ 100000000 97932374 96635205 97189093 99011326 100287879 100000000 99177462 98075205 97174585
418.1I7174585o71089p16549r32705r32432r68992j669836k831751l323347k036828
$$ 97174585 96503496 95786947 94854242 93921810 92952818 91282982 88451231 85127884 83091056
436.5H3091056Q63302L420419M009646K933305J972449J743031J391577N12255l03549
$$ 83091056 83954358 87374777 91384423 94317728 96290177 98033208 99424785 99937040 99633491
454.8I9633491l17204K85113L98600k19685q47173o87092k5207J91337l58111r76068
$$ 99633491 99316287 99601400 100000000 99780315 98933142 98246050 98220843 98412180 98054069 97078001
475.2I7078001q60786o0433N57649L94821o2883j91092l49671j458752l116167k692496
$$ 97078001 96217215 96156782 96714431 97109252 97046369 96855277 96505606 95046854 91930687 89238191
495.6H9238191O07204L377289L152811J145333o22058j355403j124454o67089q48270
$$ 89238191 89845395 93222684 96375495 97520828 96898770 95543367 94418913 93751824 92903554
514I2903554j157897j35774J738626K475172J766706P16412K72530M81028O44540K95103
$$ 92903554 91745657 91609883 93348509 95823681 97590387 98306799 98579329 99060357 99704897 100000000
534.4A00000000j93697l13336O6096L63582J34742l42261m61334j17439J66475k7394
$$ 100000000 99806303 99492967 99559063 99922645 100057387 99715126 99253792 99136353 99302828 99275434
554.8I9275434m36062m32580P5519M93347L35074j54281l55798n8460K96438K37274
$$ 99275434 98839372 98406792 98482311 98975658 99310732 99156451 98800653 98742193 99038631 99275905
575.2I9275905j36572l69442k73436j22803j56653l23534m20225j80751L68672O75303
$$ 99275905 99139333 98769891 98496455 98373652 98216999 97893465 97473240 97292489 97661161 98336464
595.6I8336464L95811l0613o8349J62649J81187j25850m22710l88521j37085n5712
$$ 98336464 98732275 98701662 98633313 98795962 98977149 98851299 98428589 98040068 97902983 97847271
616I7847271l06529o28692p12448p39390j289898k389830k596391j006209N01459J48184
$$ 97847271 97540742 96912050 96199602 95460212 94170314 91780484 89184093 88177884 88679343 88827527
636.4H8827527j030928j388204k76131J870489L371150L054946J679254N74463J10835
$$ 88827527 87796599 86408395 86132264 88002753 91373903 94428849 96108103 96682566 96793401
654.7I6793401n8114k45869m77469p49308j134819k106029k156204M51958J658118
$$ 96793401 96735287 96489418 96011949 95262641 94127822 92021793 89865589 90317547 91975665
673.1I1975665J124328K84660l54165j105350j981830k999556m588455o716937p069791
$$ 91975665 93099993 93384653 93030488 91925138 89943308 86943752 82355297 75638360 68568569
691.4F8568569l167861K045274M203575M542601M906798M244649K666724J349342M62913
$$ 68568569 65400708 67445982 71649557 76192158 81098956 85343605 88010329 89359671 89822584
709.8H9822584l40181j113355j838357k887046m972547q184672j0550725p892734M43745
$$ 89822584 89482403 88369048 86530691 83643645 78671098 70486426 59935701 52042967 52486712
728.1E2486712O270313N006438L092891L272015K389336J172203J647562L110444M024202
$$ 52486712 58757025 63763463 66856354 70128369 72517705 73689908 75337470 78447914 82472116
746.5H2472116L635669K515751J842260J696587J140135n0247j327079k100843j622492
$$ 82472116 86107785 88623536 90465796 92162383 93302518 93252271 91925192 89824349 88201857
764.9H8201857l6186J286423J699453J301986J99783j042658k010959k958215m279667
$$ 88201857 88165671 89452094 91151547 92453533 92653316 91610658 89599699 86641484 82361817
783.2H2361817n734932o405163o245541o401170n037021l15887J671398m7827M020136
$$ 82361817 76626885 70221722 63976181 57575011 52537990 52222103 53893501 53845674 57865810
801.6E7865810J1538226J1978274O771362K352816o0308j587039k853823l802728l700787
$$ 57865810 69404036 81382310 88153672 90506488 90446180 88859141 86005318 82202590 78501803
819.9G8501803k054519J3709J017016J105309J374924K372801L446401L462630K447742
$$ 78501803 76447284 76460993 77478009 78583318 79958242 82331043 85777444 89240074 91687816
838.3I1687816J320631N63329J33461j83928o53821j648015l612864n883062n815494
$$ 91687816 93008447 93571776 93705237 93521309 92867488 91219473 87606609 81723547 75908053
856.6G5908053l109807k134436l919459k583611M217750R600133Q470350M389292J333213
$$ 75908053 72798246 70663810 66744351 64160740 68378490 77978623 86448973 90838265 92171478
875I2171478n82951j102448J38158J164794N59747m85205j057244j045853k49105O88052
$$ 92171478 91588527 90486079 90624237 91789031 92348778 91863573 90806329 89760476 89511371 90199423
895.4I0199423P73412J93393l28785o56599r31108j232237j611250k159691k948362
$$ 90199423 90972835 91166228 90837443 90180844 89249736 88017499 86406249 84246558 81298196
913.7H1298196l806972m165715l963804m235912m616838k365834K475685M848599K027625
$$ 81298196 77491224 73325509 69361705 65125793 60508955 58143121 60618806 65467405 67495030
932.1F7495030k092278k812677J28626L906358O322503O854713N690896L680593K071100
$$ 67495030 65402752 62590075 62718701 66625059 72947562 79802275 85493171 89173764 91244864
950.5I1244864J403928J182282P78139J84452k92116n89699q74662q12566j34158N41222
$$ 91244864 92648792 93831074 94609213 94793665 94501549 93911850 93037188 92224622 92090464 92631686
970.9I2631686Q37922P27224K53171j95557m63641o25974p87705j059896j482218k051956
$$ 92631686 93469608 94196832 94450003 94254446 93790805 93164831 92377126 91317230 89835012 87783056
991.3H7783056k838546l987437n157059m650677j373350K268660L919810L622776J785660
$$ 87783056 84944510 80957073 75800014 71149337 69775987 72044647 75964457 79587233 81372893
1009.6H1372893K37524N72837J258528N57226j045394k610290l977203n146099n853271
$$ 81372893 81610417 82183254 83441782 83999008 82953614 80343324 76366121 71220022 65366751
1028F5366751n598515m132295j717186J564235N080884O408793M659492L110909M110819
$$ 65366751 59768236 55635941 53918755 55482990 60563874 66972667 71632159 74743068 78853887
1046.3G8853887N279506M317200K407473J062065L82680Q8167o1512k16937l81875
$$ 78853887 84133393 88450593 90858066 91920131 92302811 92390978 92329466 92112529 91730654
1064.7I1730654n02074n92100p32082j015467j392084j410157m83030R45777J559144
$$ 91730654 91228580 90636480 89904398 88888931 87496847 86086690 85603660 86549437 88108581
1083H8108581J055324K91276j67572l37285l61490l64512l91603m39161n46795p74396
$$ 88108581 89163905 89455181 89287609 88950324 88588834 88224322 87832719 87393558 86846763 86072367
1103.4H6072367j131230j594412k173484k901244l605437l769058k780736k63965K966088
$$ 86072367 84941137 83346725 81173241 78271997 74666560 70897502 68116766 67852801 70818889
1121.8G0818889M642493L776365J913631N17035l03185q81404j406199j805752j804507
$$ 70818889 75461382 79237747 81151378 81668413 81365228 80483824 79077625 77271873 75467366
1140.1G5467366j312619q13175p69543n74512M96334J365435Q26615l47244j157201
$$ 75467366 74154747 73341572 72572029 71997517 72493851 73859286 74685901 74338657 73181456
1158.5G3181456j599216j784027j663124j301408j042795j062125r75669r47147j636565
$$ 73181456 71582240 69798213 68135089 66833681 65790886 64728761 63753092 62805945 61169380
1176.9F1169380k750307l708256m508221n149460n411091n089107m279334l396517
$$ 61169380 58419073 54710817 50202596 45053136 39642045 34552938 30273604 26877087
1193.2B6877087k786183k329999j460536K68050K502718M277784N159893N348388M633888
$$ 26877087 24090904 21760905 20300369 20568419 23071137 27348921 32508814 37857202 42491090
1211.5D2491090K711100L06591j385674j824721q14477J594573M327399N928248N995869
$$ 42491090 45202190 45508781 44123107 42298386 41483909 43078482 47405881 53334129 59329998
1229.9E9329998N063904L799611K653819J781720J097513M33218l57437j335126k394664
$$ 59329998 64393902 68193513 70847332 72629052 73726565 74159783 73802346 72467220 70072556
1248.2G0072556l375251l928232l120678n84114J734495J618171l74198k429515l907907
$$ 70072556 66697305 62769073 59648395 59064281 60798776 62416947 62042749 59613234 55705327
1266.6E5705327m792583m837164m021779l178477l229991l861272m055387l506226
$$ 55705327 50912744 46075580 42053801 38875324 35645333 31784061 27728674 24222448
1282.9B4222448k608317j678770o89522M47469J719524K974256L938607M449710M588378
$$ 24222448 21614131 19935361 19245839 19693308 21412832 24387088 28325695 32775405 37363783
1301.3C7363783M415577L810090K810550J798537J117355P30622O55037R41103J102847
$$ 37363783 41779360 45589450 48400000 50198537 51315892 52046514 52701551 53642654 54745501
1319.6E4745501N98592m68964j918071l856489o067905p653552p420346n086610k158085
$$ 54745501 55344093 54875129 52957058 49100569 43032664 35379112 27958766 22872156 20714071
1338B0714071o30489q25947j569134j765730p25108J412749L712248N456566O698794
$$ 20714071 20083582 19257635 17688501 15922771 15197663 16610412 20322660 25779226 32478020
1356.4C2478020P479816P728762P419416O184942M539895L351777K401978J350534
$$ 32478020 39957836 47686598 55106014 61290956 65830851 69182628 71584606 72935140
1372.7G2935140l86459l533458o809676o303114j235741J850647j389402n036390j975245
$$ 72935140 72548681 69015223 62205547 55902433 54666692 56517339 55127937 50091547 48116302
1391D8116302L952057P067811O661779N547488M363179L196621K493089J787925J038003
$$ 48116302 52068359 59136170 65797949 71345437 75708616 78905237 81398326 83186251 84224254
1409.4H4224254N10257K08938P7129R5326L34757N55557N26768L13378P134j70845
$$ 84224254 84734511 84943449 85020578 85115904 85450661 86006218 86532986 86846364 86853498 86682653
1429.8H6682653k49064m81206j185435k143174k681530k796620k010065k96414J825350
$$ 86682653 86433589 85952383 84766948 82623774 79942244 77145624 75135559 74839145 76664495
1448.1G6664495L484136L674168K710420J781427J228858O24126R5427l15637n28180
$$ 76664495 80148631 83822799 86533219 88314646 89543504 90167630 90263057 89947420 89419240
1466.5H9419240o40697r28682j247280q75313j36882K95824L04377K6858l28183o53005
$$ 89419240 88778543 87849861 86602581 85727268 85590386 85886210 86190587 86217445 85889262 85236257
1486.9H5236257j057362j517862j665467j906413k566338l266251l700685m188234
$$ 85236257 84178895 82661033 80995566 79089153 76522815 73256564 69555879 65367645
1503.2F5367645o311834j0315344r521001o452018l775057q14557L94684r18568k577316
$$ 65367645 59055811 48740467 39219466 32767448 28992391 28177834 28572518 27653950 25076634
1521.6B5076634j946676m87374K75399R71472K171746M020509M793015N249423P684118
$$ 25076634 23129958 22642584 22917983 23889455 26061201 30081710 34874725 40124148 47808266
1539.9D7808266Q578318P048589O210834N274784M326541L166908J992648J072473
$$ 47808266 56386584 63435173 69646007 74920791 79247332 82414240 84406888 85479361
1556.2H5479361K74235o28537j476324k938300n150420p721448p443964j573378M757482
$$ 85479361 85753596 85125059 83648735 80710435 75560015 67838567 60394603 58821225 63578707
1574.6F3578707Q414125O757313M046524K893746J852101O50001m58289j431751k261007
$$ 63578707 71992832 78750145 82796669 85690415 87542516 88192517 87734228 86302477 84041470
1593H4041470l007590l825838n080241o602424o598181l054183L005659P702315Q161879
$$ 84041470 81033880 77208042 72127801 65525377 58927196 55873013 58878672 66580987 74742866
1611.3G4742866N574077K866262P90388o88214j890552l483599m795522n829930o361759
$$ 74742866 80316943 83183205 83973593 83285379 81394827 77911228 73115706 67285776 60924017
1629.7F0924017n362242l741181j475435J762205M183632N558282N846721N860806
$$ 60924017 55561775 51820594 50345159 52107364 56290996 61849278 67695999 73556805
1646G3556805M969060K835542J879132J779640R43791L64864Q5724j52546l16549m57650
$$ 73556805 78525865 81361407 83240539 85020179 85963970 86328834 86414558 86262012 85945463 85487813
1666.4H5487813p50488j067239j096827j212996j358164j417243j638651k377987l743333
$$ 85487813 84737325 83670086 82573259 81360263 80002099 78584856 76946205 74568218 70824885
1684.7G0824885m048931m326183n343693n723030o438639o317366m125550k008966
$$ 70824885 66775954 62449771 57106078 51383048 44944409 38627043 34501493 32492527
1701.1C2492527Q968J553529K306497K100215J451880Q79398N09509K3785q04898j795816
$$ 32492527 32501495 34055024 36361521 38461736 39913616 40793014 41302523 41326308 40521410 38725594
1721.5C8725594k946073l903943m045311l334121j767536k18461O1352o85955r50452
$$ 38725594 35779521 31875578 27830267 24496146 22728610 22510149 22571501 21885546 20935094
1739.8B0935094P1566J862630L346210M063511M122784L472603K470258J910632J617006
$$ 20935094 21006660 22869290 26215500 30279011 34401795 37874398 40344656 42255288 43872294
1758.2D3872294J146224O65668N2160q16468j447507p58660J438269L493830M451576
$$ 43872294 45018518 45684186 45736346 44919878 43472371 42713711 44151980 47645810 52097386
1776.5E2097386N134952N491656N031455M246312L511769K765792K379805K246207
$$ 52097386 57232338 62723994 67755449 72001761 75513530 78279322 80659127 82905334
1792.8H2905334J832468J380962J182985J081967R89092Q97044Q39847P81232P06232
$$ 82905334 84737802 86118764 87301749 88383716 89372808 90269852 91109699 91890931 92597163
1811.2I2597163O24722N55348N39911N13822M25869K92838J88267R0188K7841K5362
$$ 92597163 93221885 93777233 94317144 94830966 95256835 95549673 95737940 95828128 95855969 95881331
1831.6I5881331Q529k6416o0565j54060l03060k64901J47880N42432N90545M34440
$$ 95881331 95889860 95863444 95802879 95648819 95345759 95080858 95228738 95771170 96361715 96796155
1852I6796155K90489K34735K13236J77759J31780Q6546O9952J30778K35391K26629
$$ 96796155 97086644 97321379 97534615 97712374 97844154 97930700 98000652 98131430 98366821 98593450
1872.4I8593450J31559M6176J9133N0276P6562N9528M3851J05750K03652K16758J54721
$$ 98593450 98725009 98771185 98790318 98840594 98917156 98976684 99020535 99126285 99329937 99546695 99701416
1894.8I9701416J05322P7832O2096M5401J7267r334M053L6931M5371J0705k1493r632
$$ 99701416 99806738 99884570 99946666 99992067 100009334 100000000 100004053 100040984 100086355 100097060 100075567 100065935
1919.3A00065935O43L660J3840k503m1449n1820N596M9311J0836j1301N3442J05655
$$ 100065935 100066578 100070238 100084078 100081575 100040126 99988306 99993902 100043213 100054049 100042748 100096190 100201845
1943.8A00201845P1442J1993j7238k1410k2948m2128q6391j49811k22551k43861j17004
$$ 100201845 100273287 100285280 100268042 100246632 100223684 100181556 100095165 99945354 99722803 99478942 99361938
1966.2I9361938J02258J79511O4349q5401j44553o0272J02216J85352J36882M5800
$$ 99361938 99464196 99643707 99708056 99622655 99478102 99417830 99520046 99705398 99842280 99888080
1986.6I9888080k0426o0803q7124j32459k09052k14094o3413J28376J92935J27274
$$ 99888080 99867654 99806851 99719727 99587268 99378216 99164122 99100709 99229085 99422020 99549294
2007I9549294K5147o0660j24115j66249j36995M279J60086J89645J23077Q0365N1314
$$ 99549294 99574441 99513781 99389666 99223417 99086422 99090701 99250787 99440432 99563509 99643874 99695188
2029.4I9695188J770k2697j7000j5920k4408j5080K7364O8868O8497J9878l7646o9398
$$ 99695188 99696958 99674261 99657261 99641341 99616933 99601853 99629217 99698085 99766582 99786460 99748814 99679416
2053.9I9679416q6361j12772j40762j35255p8338m29M7761O3038P4160R0420J00625
$$ 99679416 99593055 99480283 99339521 99204266 99125928 99125499 99173260 99236298 99310458 99400878 99501503
2076.4I9501503R7459Q3387O9129O4856O7860O5321N0485N1296L5262L3617L3784J4508
$$ 99501503 99598962 99682349 99751478 99816334 99884194 99949515 100000000 100051296 100086558 100120175 100153959 100168467
2100.8A00168467j6928l5739l7479m1235n9181p9149p6312m4692n412J8841K7311K8747
$$ 100168467 100151539 100115800 100078321 100037086 99977905 99898756 99822444 99777752 99772340 99791181 99818492 99847239
2125.3I9847239L1036L5906L2652J1527j6254l0667l0064l1990n0175o9475o5589l8582
$$ 99847239 99878275 99914181 99946833 99958360 99942106 99911439 99881375 99849385 99799210 99729735 99664146 99625564
2149.8I9625564o080K1100L8683N1427O3157O5416N3490L0470J1587J4782K7907K1117
$$ 99625564 99619484 99640584 99679267 99730694 99793851 99859267 99912757 99943227 99954814 99969596 99997503 100018620
2174.3A00018620k086j3959n299K724q34j6577k8055k2763q721p021k0450k9928j9163
$$ 100018620 100016534 100002575 99997276 100000000 99999166 99982589 99954534 99931771 99923050 99916029 99895579 99865651 99846488
2200.8I9846488O652K3818J8907o74j9485l2049m5037o1029p8333r5498j07956j02663
$$ 99846488 99853140 99876958 99895865 99895191 99875706 99843657 99798620 99737591 99659258 99563760 99455804 99353141
2225.2I9353141o8450j5319K6924M5800M8995L6532J5634j598j3041k3764l2384l1405
$$ 99353141 99284691 99269372 99296296 99342096 99391091 99427623 99443257 99441659 99428618 99404854 99372470 99341065
2249.7I9341065j7256M232J6373J0109m404j2017o503M077R501R597Q875J1754J6183
$$ 99341065 99323809 99328041 99344414 99354523 99350119 99338102 99331599 99335676 99345177 99354774 99363649 99375403 99391586
2276.2I9391586J3482n644k7335k4277N78K1362K1154O837k438J496P927j210l1298
$$ 99391586 99405068 99399424 99372089 99347812 99348390 99369752 99390906 99397743 99395305 99396801 99404728 99403518 99372220
2302.7I9372220o7681r2429r3210p8803p4637q7714j06824j17093j04928p0733m5722
$$ 99372220 99304539 99212110 99118900 99040097 98965460 98877746 98770922 98653829 98548901 98478168 98432446
2325.2I8432446m6623m7374l1793k0224k4027k3114q107J2351M8762J11735J17725
$$ 98432446 98385823 98338449 98306656 98286432 98262405 98239291 98231184 98243535 98292297 98404032 98521757
2347.6I8521757L5858n4520r7531r3353o9994m0334j2118J5885L6448L2091K766k6912
$$ 98521757 98557615 98503095 98405564 98312211 98242217 98201883 98189765 98205650 98242098 98274189 98276955 98250043
2372.1I8250043l2657j5676J4263N8681J07157J42730J52868J33019R9391P1019M9233
$$ 98250043 98217386 98201710 98215973 98274654 98381811 98524541 98677409 98810428 98909819 98980838 99030071
2394.5I9030071K9541J0323j1766l7157o7759j05488j43862j68836j53470q2642P254
$$ 99030071 99059612 99069935 99058169 99021012 98953253 98847765 98703903 98535067 98381597 98298955 98306209
2417I8306209O6477Q8549Q4686P0006N7190M3625K9969K5016K9707L7986M2278L4123
$$ 98306209 98372686 98461235 98545921 98615927 98673117 98716742 98746711 98771727 98801434 98839420 98881698 98915821
2441.4I8915821J9861P438n346j4669j8352k3014k6947k6291k5505k7430l0458k8825
$$ 98915821 98935682 98943120 98937774 98923105 98904753 98881739 98854792 98828501 98802996 98775566 98745108 98716283
2465.9I8716283k1583j9771l0172m8721p8195j23471j71268j90878j50800n0515O3086
$$ 98716283 98694700 98674929 98644757 98596036 98517841 98394370 98223102 98032224 97881424 97830909 97893995
2488.3I7893995J39070J63918J48601J12414P4279M1682J2398r722j8489j2827K545
$$ 97893995 98033065 98196983 98345584 98457998 98532277 98573959 98586357 98576635 98558146 98545319 98547864
2510.8I8547864J4204J5175R608L046k181o539j0914j4865j7661k0242k3520k2733
$$ 98547864 98562068 98577243 98586851 98589897 98587716 98581177 98570263 98555398 98537737 98517495 98493975 98471242
2535.3I8471242k0778k4867l0309l6752m4722m9692n3900o1554o5291n7292m1419k4748
$$ 98471242 98450464 98425597 98395288 98358536 98313814 98264122 98210222 98148668 98083377 98026085 97984666 97959918
2559.7I7959918j1903o426r477j2994j3548k3061m0680m7284m1938l9256l8504l7349
$$ 97959918 97948015 97941589 97932112 97919118 97905570 97882509 97841829 97794545 97752607 97713351 97674847 97637498
2584.2I7637498m1848m2957k6196oJ4329J0419r96j2106k3251l6735m5234l9279j7303
$$ 97637498 97595650 97552693 97526497 97526491 97540820 97551239 97550243 97538137 97514886 97478151 97432917 97393638 97376335
2610.7I7376335J2386K9158K2352K241j1963j6606j8703j8824j6117j0138j520P265
$$ 97376335 97388721 97417879 97440231 97442472 97430509 97413903 97395200 97376376 97360259 97350121 97348601 97355866
2635.2I7355866J0610L558n346p147p647k962J7053M3952O0314N2065J8632j7267l2318
$$ 97355866 97366476 97370034 97364688 97357541 97349894 97346932 97363985 97407937 97468251 97520316 97538948 97521681 97489363
2661.7I7489363k4271o878K193N728J0037L964j2421k5887k7728r346K4879N3954O7252
$$ 97489363 97465092 97458214 97460407 97466135 97476172 97480136 97467715 97441828 97414100 97404754 97429633 97483587 97550839
2688.2I7550839O6638O1190O4135O9910N8317L3397J5104O961N43p743j9610l3796
$$ 97550839 97617477 97678667 97742802 97812712 97871029 97904426 97919530 97926491 97927034 97919291 97899681 97865885
2712.7I7865885l7401k7276j6981j8310k4641k8050l3045m2343o3479r4008j17904
$$ 97865885 97828484 97801208 97784227 97765917 97741276 97713226 97680181 97637838 97574359 97480351 97362447
2735.1I7362447j34206j53804j83767k08366j86199j16163m5759R597N7244P8875O8533
$$ 97362447 97228241 97074437 96890670 96682304 96496105 96379942 96334183 96343780 96401024 96479899 96548432
2757.6I6548432M7976K6172P57j9115k1875j8543k3782l1221k7156M59L6550M9030
$$ 96548432 96596408 96622580 96623337 96604222 96582347 96563804 96540022 96508801 96481645 96482104 96518654 96567684
2782I6567684L8231K2477O294q076j9104l6055o0850q3357j01543j21563j47623j72263
$$ 96567684 96605915 96628392 96634686 96626610 96607506 96571451 96510601 96427244 96325701 96204138 96056515 95884252
2806.5I5884252j78636j64079j37407j05178q6457r2435j10340j26385j35708j42914
$$ 95884252 95705616 95541537 95404130 95298952 95212495 95120060 95009720 94883335 94747627 94604713
2826.9I4604713j56957j84173k32565l00759l70914m24874m01765k31272K379J13636
$$ 94604713 94447756 94263583 94031018 93730259 93359345 92934471 92532706 92301434 92303813 92417449
2847.3I2417449N2380o8277j53607j89954j88529j73158j53625j20264q5098p1239
$$ 92417449 92469829 92401552 92247945 92057991 91869462 91696304 91542679 91422415 91337317 91266078
2867.7I1266078o9165n6452m1294k7841k856J4931J2643J1885J3625P874l326j8155
$$ 91266078 91196913 91140461 91099167 91071326 91068470 91083401 91096044 91107929 91121554 91129428 91126102 91107947
2892.2I1107947l5650o0969r6971j33980j60199j60348j12713j8209Q0776J35237J30338
$$ 91107947 91072297 91011328 90914357 90780377 90620178 90459830 90347117 90328908 90409684 90544921 90675259
2914.6I0675259R2864N3900J9533m697j6326k6035o4111j69039l39269n46247p31224
$$ 90675259 90768123 90822023 90841556 90836859 90820533 90794498 90730387 90561348 90222079 89675832 88944608
2937H8944608p34484l99453J37896N51462P32004P67351P05230N53608L73292K30479
$$ 88944608 88210124 87810671 87948567 88500029 89232033 89999384 90704614 91258222 91631514 91861993
2957.4I1861993J23191M0036k8842q8322j11813r7179q2845j03467j59628k40916l83550
$$ 91861993 91985184 92025220 91996378 91908056 91796243 91699064 91616219 91512752 91353124 91112208 90728658
2979.9I0728658o60306j095122j439327j123190l6675J107026J614648J299482M82601
$$ 90728658 90068352 88973230 87533903 86410713 86374038 87481064 89095712 90395194 90877795
2998.2I0877795k93410o97618n38725N3686N14847N64039M26340K78991J16265k1857
$$ 90877795 90584385 89886767 89348042 89401728 89916575 90480614 90906954 91185945 91302210 91280353
3018.6I1280353m9198M077K0278l6508j21480j89322k18875k15161k00891j89424j89209
$$ 91280353 91231155 91235232 91255510 91219002 91097522 90908200 90689325 90474164 90273273 90083849 89894640
3041.1H9894640k35039l63105n39810o22910m63360j11872J78295K33680J51038J39463
$$ 89894640 89659601 89296496 88756686 88133776 87670416 87558544 87736839 87970519 88121557 88261020
3061.5H8261020K37364K92122J94538j7494k33662l32535l13908l13311l56937k94262
$$ 88261020 88498384 88790506 88985044 88967550 88733888 88401353 88087445 87774134 87417197 87122935
3081.9H7122935n2637K35892M30661N03427M62717L12882Q2302j71387l95828n61583
$$ 87122935 87070298 87306190 87736851 88240278 88702995 89015877 89098179 88926792 88530964 87969381
3102.2H7969381o28341m66770O0517Q07053J364356J450765J139736P28459M25869
$$ 87969381 87341040 86874270 86934787 87741840 89106196 90556961 91696697 92425156 92851025
3120.6I2851025K59381J91915J76102J66887J36316R0552N1432J5563l2151o9242n3352
$$ 92851025 93110406 93302321 93478423 93645310 93781626 93872178 93923610 93939173 93907022 93837780 93784428
3143I3784428L0249J59067K80160L23581K58124J56057R9778Q3906P5972O0922L9398
$$ 93784428 93814677 93973744 94253904 94577485 94835609 94991666 95091444 95175350 95251322 95312244 95351642
3165.5I5351642J9592Q905M614k170m77J8567M0680N1254M7070M2594M7016M5192L2884
$$ 95351642 95371234 95380139 95384753 95382583 95382106 95400673 95441353 95492607 95539677 95582271 95629287 95674479 95707363
3192I5707363K1762R226o365j6672j9681j4532n01J6749K5720K1815J3149k670k1065
$$ 95707363 95729125 95738351 95731986 95715314 95695633 95681101 95680600 95697349 95723069 95744884 95758033 95755363 95734298
3218.5I5734298j9771j4776k8938m2134m3100k9469j1712k1494l5292k1290p755k265
$$ 95734298 95714527 95699751 95670813 95628679 95585579 95556110 95544398 95522904 95487612 95466322 95458567 95456302
3243I5456302J2392J4836n675j2290N066J7363J3161K700m131o080j996O85m703q249
$$ 95456302 95468694 95483530 95477855 95465565 95470631 95487994 95501155 95503855 95499724 95493644 95491648 95492333 95487630 95479381
3271.5I5479381j3423k1005j8870k1601l9512n0652n0700m7785m2224m9919o7073p4899
$$ 95479381 95465958 95444953 95426083 95404482 95364970 95314318 95263618 95215833 95173609 95123690 95056617 94981718
3296I4981718q3327q5038n7274k9755n5993j12170j37400j27548j07807r8634j01608
$$ 94981718 94898391 94813353 94756079 94726324 94670331 94558161 94420761 94293213 94185406 94086772 93985164
3318.4I3985164j11168j18179j15853j31971j63984j71346j64908j60145j49572j56296
$$ 93985164 93873996 93755817 93639964 93507993 93344009 93172663 93007755 92847610 92698038 92541742
3338.8I2541742j74606j76811j81859j94759j98459k15614k45589k47699k24489k07335
$$ 92541742 92367136 92190325 92008466 91813707 91615248 91399634 91154045 90906346 90681857 90474522
3359.2I0474522k16830k37578k43509k43550k52676k61843k44707k12080j95610j82378
$$ 90474522 90257692 90020114 89776605 89533055 89280379 89018536 88773829 88561749 88366139 88183761
3379.6H8183761j60760j52612j55657j50359j34224j01041o4904m7040l5226k7311
$$ 88183761 88023001 87870389 87714732 87564373 87430149 87329108 87264204 87217164 87181938 87154627
3400H7154627k4134j7691j9181l2860m3082l4964k5529m6634p3016o4975m4215l6931
$$ 87154627 87130493 87112802 87093621 87060761 87017679 86982715 86957186 86910552 86837536 86772561 86728346 86691415
3424.5H6691415l7312m2576m4614l8671l3337l0786l6526m6891n5527o9446p4577n6958
$$ 86691415 86654103 86611527 86566913 86528242 86494905 86464119 86427593 86380702 86325175 86255729 86181152 86124194
3449H6124194j8734L9560Q7285Q8679N8937L2121L773l4517n1397m3344m0508m8107
$$ 86124194 86105460 86145020 86232305 86320984 86379921 86412042 86415815 86381298 86329901 86286557 86246049 86197942
3473.4H6197942m5889j0991N5480J36930J99520K27529K47848K54750K34229K22665
$$ 86197942 86152053 86141062 86196542 86333472 86532992 86760521 87008369 87263119 87497348 87720013
3493.8H7720013K31915K32417K18814K08360K06864J97751J91545J90491J68263J47713
$$ 87720013 87951928 88184345 88403159 88611519 88818383 89016134 89207679 89398170 89566433 89714146
3514.2H9714146J51336J52516J34063J22458J32400J43069J56527J72997J64473J50281
$$ 89714146 89865482 90017998 90152061 90274519 90406919 90549988 90706515 90879512 91043985 91194266
3534.6I1194266J58137J55527J25324J03230J19137J50788J48028J32799J40638J27726
$$ 91194266 91352403 91507930 91633254 91736484 91855621 92006409 92154437 92287236 92427874 92555600
3555I2555600R8658R6691R6017O1881M9401J47074K30050J81425J33693J40405J56432
$$ 92555600 92654258 92750949 92846966 92908847 92958248 93105322 93335372 93516797 93650490 93790895 93947327
3577.5I3947327J69408J66005J18113Q1992J60641K36570J82057J49894J89119K11471
$$ 93947327 94116735 94282740 94400853 94482845 94643486 94880056 95062113 95212007 95401126 95612597
3597.9I5612597K11031J94859J38539Q9777J16426J60604J67328J59151J11747J25366
$$ 95612597 95823628 96018487 96157026 96246803 96363229 96523833 96691161 96850312 96962059 97087425
3618.3I7087425K22182J87761L5232n6285Q5950K75261J93166J10001J00994Q1366
$$ 97087425 97309607 97497368 97532600 97476315 97562265 97837526 98030692 98140693 98241687 98323053
3638.7I8323053N8824J5050o7723q8668J05626K87670J51348N0020J43486J51480M5150
$$ 98323053 98381877 98396927 98329204 98240536 98346162 98633832 98785180 98835200 98978686 99130166 99175316
3661.1I9175316r107n0855j03778m3827L6859k6548O5053K20573J48195P3129J3065
$$ 99175316 99166209 99115354 99011576 98967749 99004608 98978060 99043113 99263686 99411881 99485010 99498075
3683.5I9498075n7608j4436J16617J36822P8762L1948j5372k8760L8159O2442k7257
$$ 99498075 99440467 99426031 99542648 99679470 99758232 99790180 99774808 99746048 99784207 99846649 99819392
3706I9819392r3544m4739R8324J15651R400m7642n9128n9039l1638J2237k8241j27458
$$ 99819392 99725848 99681109 99779433 99895084 99904484 99856842 99797714 99738675 99707037 99719274 99691033 99563575
3730.4I9563575j43826j3948J55211J10632j07622j75357J3983N3776l8285J20587
$$ 99563575 99419749 99405801 99561012 99671644 99564022 99388665 99402648 99456424 99418139 99538726
3750.8I9538726K37691Q3822k1511L3509Q0979J3334k9916k0969J5641P2175M5884
$$ 99538726 99776417 99860239 99838728 99872237 99953216 99966550 99936634 99915665 99931306 100003481 100049365
3773.3A00049365l0792m1443K2870M1509K634K5213M7862K2817k5332p6866o8867o1101
$$ 100049365 100018573 99977130 100000000 100041509 100044143 100069356 100117218 100140035 100114703 100037837 99968970 99907869
3797.7I9907869p3570K9385N3913J5014R7275O6173q0455j27524k6071m977k4622R8663
$$ 99907869 99834299 99863684 99917597 99932611 100029886 100096059 100015604 99888080 99862009 99857032 99832410 99931073
3822.2I9931073J01257L8754J6690l4237n2905n5260n1731K9648R8729R4819O4373
$$ 99931073 100032330 100071084 100087774 100053537 100000632 99945372 99893641 99923289 100022018 100116837 100181210
3844.6A00181210k6143j65712k45256m1902K72835J45894m3810r0187n7930p808m1473
$$ 100181210 100155067 99989355 99744099 99702197 99975032 100120926 100077116 99986929 99928999 99921191 99879718
3867.1I9879718l0923P4464R2393M8375l5059o5512p069k098K9504L7677k1470L1090
$$ 99879718 99848795 99923259 100015652 100064027 100028968 99963456 99956387 99954289 99983793 100021470 100000000 100031090
3891.6A00031090O1953n4348j36763r0378J317Q9652J43551R9755L6192o199n8818
$$ 100031090 100093043 100038695 99901932 99811554 99812871 99902523 100046074 100145829 100182021 100175822 100117004
3914A00117004o2645O855M3750O687j5199r846l5871l1435L2508M0520k0719n2881
$$ 100117004 100054359 100061214 100104964 100111651 100096452 100086606 100050735 100019300 100051808 100092328 100071609 100018728
3938.5A00018728l8898j08K0278K670K1267O8343P5483N4646L6847K3365J0968R143
$$ 100018728 99979830 99979722 100000000 100002670 100023937 100092280 100167763 100222409 100259256 100282621 100293589 100302732
3962.9A00302732J3649Q691n841p606J3626K6929J3924Q297J7762O830j3589n079J9408
$$ 100302732 100316381 100325072 100319231 100311625 100325251 100352180 100366104 100374401 100392163 100398993 100385404 100380325 100399733
3989.5A00399733L1423K9659K2388J2875
$$ 100399733 100431156 100460815 100483203 100496078
3997.6A00496078
$$ 100496078
##END=$$ End of the data block
