##TITLE=KOON(CH3)2 $$ Begin of the data block
##JCAMP-DX=5.00 $$ ACD/SpecManager v 10.08
##SPECTROMETER/DATA SYSTEM=Alpha
##DATE=08 Jun 2015 09:26:56
##DATA TYPE=INFRARED SPECTRUM
##DATA CLASS=XYDATA
##ORIGIN=
##OWNER=
##NPOINTS=1765
##FIRSTX=399.76428223
##LASTX=3997.64306641
##MAXX=3997.64306641
##MINX=399.76428223
##MAXY=1.00348163
##MINY=0.55965042
##XFACTOR=1.0000000000
##YFACTOR=0.000000010000000
##FIRSTY=1.00000000
##DELTAX=2.03961372
##XUNITS=1/CM
##YUNITS=ARBITRARY UNITS
##XYDATA=(X++(Y..Y))
399.8A00000000o55365k40773l11756n67037n43994o62875o96266j68323L95739N24759
420.2I7074109O43534P10535M53818L14831J65558j79559j67799K4975k6012R66j4973
442.6I8999983l10153l37332J3631L40677N60373N61017J71804j99521j67739j83243
463I9449497k91931j75959j72001l35115l51239m50515o98108o52748k98703k9337
483.4I5993841l5996m16940p06428M6849J112926Q87996l9709o13600j165479j725739
503.8I3337721j702375q46147N16516J069325J67817p26748k2107J612806K329797
522.1I5736605J920676J161933M55266J34731Q8977n1683j36870m5580o7788j58059
542.5I9038208r2501o7878j58041j62536k14041m47034n01657j07890L47083M26335
$$ y = [100000000, 99344635, 99103862, 98792106, 98225069, 97681075, 97018200, 96321934, 96153611, 96549350, 97074109, 97717643, 98428178, 98881996, 99196827, 99362385, 99182826, 99015027, 99040002, 99013990, 99014956, 98999983, 98689830, 98352498, 98366129, 98706806, 99267179, 99828196, 100000000, 99800479, 99632740, 99449497, 99157566, 98981607, 98809606, 98474491, 98123252, 97672737, 96974629, 96321881, 96023178, 95993841, 95957845, 95540905, 94834477, 94881326, 95994252, 96882248, 96842539, 96228939, 95063460, 93337721, 91635346, 90789199, 91305715, 92375040, 92542857, 91816109, 91794002, 93406808, 95736605, 97657281, 98819214, 99274480, 99409211, 99498188, 99446505, 99309635, 99264055, 99196267, 99038208, 98945707, 98877829, 98719788, 98557252, 98343211, 97896177, 97394520, 97286630, 97633713, 98060048]
562.9I8060048K32172Q177p5817k9224o3056j12867n0724m3922j14668r4932j08701
585.4I7606486k65855m11838o27094q33989m80127L14522P29692O09374L79580J53971
605.8I7174722l892J7267J3709q0615p7438p2545j42044o3926P4983M327j23680k11537
630.2I6509331m12094m95482l74573n85866r35751k61599J229924J848131J279843
648.6I7801864N29480N9700n6463R41p7623j27065k4670j3280q8042o5911o9249j13207
673.1I7756475l0988P254j02610q4364j1772j01972j23357m2159j14685j86384j17540
695.5I6847898j66703k92927l11273n03623q99452p27982K13105P91991N49918K93165
715.9I5794117K11043M3034k06768p08020j284498j220375m64732J07187K94340O36935
$$ y = [98060048, 98292220, 98300397, 98224580, 98195356, 98132300, 98019433, 97968709, 97924787, 97810119, 97715187, 97606486, 97340631, 96928793, 96301699, 95467710, 94987583, 95302105, 96031797, 96641171, 97020751, 97174722, 97170830, 97188097, 97201806, 97121191, 97043753, 96971208, 96829164, 96765238, 96840221, 96844548, 96720868, 96509331, 96097237, 95601755, 95227182, 94641316, 93705565, 93443966, 94673890, 96522021, 97801864, 98331344, 98391044, 98334581, 98335522, 98257899, 98130834, 98106164, 98092884, 98004842, 97938931, 97869682, 97756475, 97725487, 97732741, 97630131, 97545767, 97533995, 97432023, 97308666, 97266507, 97151822, 96965438, 96847898, 96681195, 96388268, 96076995, 95573372, 94673920, 93945938, 94159043, 94951034, 95500952, 95794117, 96005160, 96048194, 95841426, 95133406, 93848908, 92628533, 92163801, 92270988, 92565328, 93202263]
736.3I3202263Q63934N91463J16211l28857n79172p27016j079595j266927m82958J186144
756.7I1495490K388573K135563R83023M5401k29484k56210l96991m24379l59380n02664
777.1I4878942o75488p60519j121497j893998k500581j708889J25146N93477J17755
795.4H7054348J164615K581602K107585N84471l94779r00281j581889k299535k775658
813.8H5540479l243500k725792L07578L847003M520333K979988J516598O29169K37209
832.2I3609065J97667J46860J24925K15757J47718l403J5819m208j25653p9912n185
854.6I4239450r5290r9409j7595q6224j35744o2180j14047k03914j36888j40804k41691
877I2905664k02059j80525l14176l61001l99256o65629q06767k15977Q03822J102018
$$ y = [93202263, 94066197, 94657660, 94773871, 94445014, 93865842, 93138826, 92059231, 90792304, 90309346, 91495490, 93884063, 96019626, 97002649, 97048050, 96818566, 96562356, 96165365, 95740986, 95381606, 94878942, 94203454, 93442935, 92321438, 90427440, 87926859, 86217970, 86343116, 86936593, 87054348, 88218963, 90800565, 92908150, 93492621, 93097842, 92197561, 90615672, 88316137, 85540479, 82296979, 79571187, 79878765, 83725768, 88246101, 91226089, 92742687, 93371856, 93609065, 93806732, 93953592, 94078517, 94294274, 94441992, 94438589, 94454408, 94450200, 94324547, 94244635, 94239450, 94144160, 94044751, 94027156, 93940932, 93805188, 93743008, 93628961, 93425047, 93288159, 93147355, 92905664, 92703605, 92523080, 92208904, 91847903, 91448647, 90783018, 89976251, 89760274, 90564096, 91666114]
897.4I1666114N12958j09488l38989k70909k35528l38710l41457l24571m56911n38463
917.8H9224046n47117p09539r31627j145822j583290k137470k292144j553661L7193
936.2G8360569J273960J297170J569540K967292L500312K242941Q58533K63351m6038
954.5I2287630k71070k93386l21549m38679m47571m25571m26626l08287l26562p27022
974.9H8301307q25083J7291Q22550N91689l707l32123n07540n66852o83087j019174
995.3H5795271j165956m33838N27012K95591m31323l11315K16771L49479k133m50868
1015.7H4388691o70886q04549r71985r71031p11674k67887L50338R80145J309925J240778
1036.1H3871865Q95602M01342k5851k00492k72840l78841l98112l71742m53025n18000
$$ y = [91666114, 92179072, 92069584, 91730595, 91459686, 91224158, 90885448, 90543991, 90219420, 89762509, 89224046, 88676929, 87967390, 87035763, 85889941, 84306651, 82169181, 79877037, 78323376, 78360569, 79634529, 80931699, 82501239, 85468531, 88968843, 91211784, 92070317, 92333668, 92287630, 92016560, 91723174, 91401625, 90962946, 90515375, 90089804, 89663178, 89354891, 89028329, 88301307, 87476224, 87493515, 88316065, 88907754, 88904047, 88571924, 88064384, 87497532, 86814445, 85795271, 84629315, 84195477, 84722489, 85018080, 84586757, 84275442, 84492213, 84841692, 84839559, 84388691, 83717805, 82913256, 81941271, 80970240, 80258566, 79990679, 80341017, 81321162, 82631087, 83871865, 84767467, 85168809, 85142958, 84942466, 84669626, 84290785, 83892673, 83520931, 83067906, 82549906]
1056.5H2549906m75759m37778l58408j75292n8293o2478n8847q6964j93846k48241
1076.9H0394000k65312l57139m22586m18710m70114n30219n06431m87643m77541l81029
1097.3G6077276l05014l44086l84694m18383n22626o11222o62857q10373j021617j165837
1117.7F9830567j246554j273483j239538j204360j046425m35090N97739J448173J723730
1136.1F7154759J815373K138698K248245J388938k91455j793057k521550k753646k847713
1154.4F4538592k768469k430302j890707j177936l06136O15114J455814K097773K409292
1172.8F2543035K355265J971132J273346M89461J07402L84533J116949J955414K583999
1191.1G4780536K756673K502262K080101J662940J298010R19050L58701k27934l41755
$$ y = [82549906, 82074147, 81636369, 81277961, 81102669, 81044376, 80981898, 80923051, 80836087, 80642241, 80394000, 80128688, 79771549, 79348963, 78930253, 78460139, 77929920, 77423489, 76935846, 76458305, 76077276, 75772262, 75428176, 75043482, 74625099, 74102473, 73491251, 72828394, 72018021, 70996404, 69830567, 68584013, 67310530, 66070992, 64866632, 63820207, 63385117, 63982856, 65431029, 67154759, 68970132, 71108830, 73357075, 74746013, 74454558, 72661501, 70139951, 67386305, 64538592, 61770123, 59339821, 57449114, 56271178, 55965042, 56580156, 58035970, 60133743, 62543035, 64898300, 66869432, 68142778, 68632239, 68739641, 69124174, 70241123, 72196537, 74780536, 77537209, 80039471, 82119572, 83782512, 85080522, 85999572, 86358273, 86130339, 85788584]
1209.5H5788584r364J81508K83456P62039J164055Q11869m5890q15230j072258p40922
1229.9H6307847l75020m80646q20297r55474p02232o5673N74529P58106O14607M93521
1250.3H5349268K72464k49791q99678j411355j438230n62656P70110J340038Q40455
1268.6H4010625n019p21675j211739j519000j883036k369803k765906k915865k629352
1287F7989230j546258L32910K361995L857136M551691M436594L679323K586645J387078
1305.4H9636344L11732l72738p06368q51387p30586m49562l52961m78870p90769j430499
1325.8H3784336k121133k006227p46220O03944R06289L35949l00174m47363k32256
1344.1G9777145j82670m21530p37315j062602j388025j635981j832098k115452k526832
$$ y = [85788584, 85779220, 85960728, 86244184, 87006223, 88170278, 88982147, 88936257, 88121027, 87048769, 86307847, 85932827, 85452181, 84631884, 83676410, 82974178, 82908505, 83483034, 84241140, 84855747, 85349268, 85621732, 85371941, 84472263, 83060908, 81622678, 81060022, 81830132, 83170170, 84010625, 84005606, 83283931, 82072192, 80553192, 78670156, 76300353, 73534447, 70618582, 67989230, 66442972, 66775882, 69137877, 72995013, 77546704, 81983298, 85662621, 88249266, 89636344, 89948076, 89575338, 88868970, 88017583, 87286997, 86837435, 86484474, 86005604, 85214835, 83784336, 81663203, 79656976, 78910756, 79514700, 80420989, 80756938, 80456764, 80009401, 79777145, 79594475, 79172945, 78435630, 77373028, 75985003, 74349022, 72516924, 70401472, 67874640]
1362.5F7874640k766245k666754k322286j466626k10798P08014P51447Q70157K032739
1380.8F2804288L511518M221201L886735K285403J55825j456321k170836j655049p44599
1399.2G0838165K9642J010167K194572K698266J647795l00336o02413J392246L191799
1417.5H2099903L204703J877218Q73095K87837k28304p66289j311797j552951j651138
1435.9H2832277j359850k57862R27657J552331J298529M51750l47692o04910l28248
1454.3H4163982L32147Q12166O51378M88943K21681k98214n51480o35743j087028j569008
1474.7H2528824j647383j641983j673365j672333j595670j637113j936669k243334
1491F8480974k024275j712614j716494j730007j527089j056582l96520L73280Q79169
$$ y = [67874640, 65108395, 62441641, 60119355, 58652729, 58441931, 59149945, 59901392, 60771549, 62804288, 66315806, 70537007, 74423742, 76709145, 76864970, 75408649, 73237813, 71582764, 70838165, 70867807, 71877974, 74072546, 76770812, 78418607, 78118271, 77515858, 78908104, 82099903, 85304606, 87181824, 88054919, 88342756, 88114452, 87348163, 86036366, 84483415, 82832277, 81472427, 81214565, 82142222, 83694553, 84993082, 85444832, 85097140, 84492230, 84163982, 84496129, 85308295, 85959673, 86448616, 86670297, 86372083, 85820603, 85184860, 84097832, 82528824, 80881441, 79239458, 77566093, 75893760, 74298090, 72660977, 70724308, 68480974, 66456699, 64744085, 63027591, 61297584, 59770495, 58713913, 58317393, 58690673, 59569842]
1509.3E9569842J250732J641702J970947K128106K036649K031213J716024J287609
1525.6G3632824J058662P60597L95447l02052r61727j053828p76219J36560R28873
1544G3819137J101648R74322Q20035P61646J055687J735813K880752K891141J394528
1562.4H7434709R62865Q91585P64525N94770M00365M20326K69162k59315o38956j005322
1582.8H9834714j570487k201009k600652k618086k359128k081156j919186j795536
1599.1G2689474j607830j388067j153892p99572j89394N83905J363855K480954L704107
1617.4G5683540L532726L046375K812934K023023J287735Q81028O30248N74553L43710
1635.8I0815872k32256l81052j32155J62172J92666j44172k50935k96849r01717j045776
$$ y = [59569842, 60820574, 62462276, 64433223, 66561329, 68597978, 70629191, 72345215, 73632824, 74691486, 75452083, 75847530, 75545478, 74583751, 73529923, 72753704, 72890264, 73819137, 74920785, 75895107, 76715142, 77476788, 78532475, 80268288, 83149040, 86040181, 87434709, 88397574, 89289159, 90053684, 90648454, 91048819, 91469145, 91738307, 91478992, 90840036, 89834714, 88264227, 86063218, 83462566, 80844480, 78485352, 76404196, 74485010, 72689474, 71081644, 69693577, 68539685, 67740113, 67550719, 68134624, 69498479, 71979433, 75683540, 79216266, 82262641, 85075575, 87098598, 88386333, 89267361, 89897609, 90472162, 90815872, 90583616, 90202564, 90070409, 90232581, 90425247, 90281075, 90030140, 89733291, 88831574, 87785798]
1656.2H7785798p27749m75210k14719n603J52957J83267o8772l09837m77368p09134
1676.6H5133630p35885n76067o40076j395667j969236k195400k647507k617806k280254
1694.9G0075732j499170n4407J273525J879841K496869L048378K980542K762997K441460
1713.3H5405767K002406J337624L81326k38311m62633m34608O116O39719J085662J283408
1733.7I1006476J041740P77161Q23653P64310O09237N77241O04558N83548M07970L08758
1754.1I7504652L71974L64852K98000K46274J74153J93095K94662L40342K07806k8163
1774.5I9967647o9809j6761k8253n5074o5709n2911O3753J82975P4142n1385j8132
1796.9I9930483L2300l147m9168l9119J8537Q0276N4419j6487m530K3938m137J5092
$$ y = [87785798, 87058049, 86582839, 86368120, 86362517, 86515474, 86698741, 86629969, 86320132, 85842764, 85133630, 84397745, 83821678, 83181602, 81785935, 79816699, 77621299, 74973792, 72355986, 70075732, 68576562, 68522155, 69795680, 71675521, 74172390, 77220768, 80201310, 82964307, 85405767, 87408173, 88745797, 89127123, 88888812, 88426179, 87991571, 87997687, 88637406, 89723068, 91006476, 92048216, 92825377, 93649030, 94413340, 95022577, 95599818, 96204376, 96787924, 97195894, 97504652, 97876626, 98241478, 98539478, 98785752, 98959905, 99153000, 99447662, 99788004, 99995810, 99967647, 99897838, 99881077, 99852824, 99797750, 99732041, 99679130, 99742883, 99925858, 100000000, 99948615, 99930483, 99962783, 99959636, 99910468, 99871349, 99889886, 99970162, 100024581, 100008094, 100003564, 100027502, 100023365, 100038457]
1821.4A00038457P2825M3619R477J549r1707j19144l7003q922p093O6369O5369j01167
1845.9I9932629j64151j09679q8566p8500n0324m8995o5857m2564N508M7052K4223
1868.3I9360776r8157j69551j27143q3315r4372r8920o4147l7062R280Q5903P9739
1890.7I8763031K5707K0403M071l6609l7128j5599k7698m4673n1934q6200r1011r888
1915.2I8412472L8528o848j3483o115n7131p2760n5974q2100j10012r1630n6517P748
1939.7I7906178Q4085O0415k2704m2706l2348l5411r018L2192J8853j4561j6934k0122
1964.2I7907919l4863l6073l6037m0239k1332q59j3446j9253r703k7878m1353k2269
1988.7I7604614l0344q2857j10691j11372j04308m7225J3060J1670J8072N6035N0103
$$ y = [100038457, 100111282, 100154901, 100164378, 100165927, 100074220, 99955076, 99918073, 99909151, 99902058, 99968427, 100033796, 99932629, 99768478, 99658799, 99570233, 99491733, 99441409, 99392414, 99326557, 99283993, 99289501, 99336553, 99360776, 99262619, 99093068, 98965925, 98882610, 98788238, 98689318, 98625171, 98588109, 98597389, 98683292, 98763031, 98788738, 98809141, 98813212, 98776603, 98739475, 98723876, 98696178, 98651505, 98599571, 98513371, 98422360, 98412472, 98451000, 98444152, 98430669, 98424554, 98367423, 98294663, 98238689, 98156589, 98046577, 97954947, 97898430, 97906178, 97990263, 98050678, 98027974, 97985268, 97952920, 97917509, 97908491, 97940683, 97959536, 97944975, 97928041, 97907919, 97873056, 97836983, 97800946, 97760707, 97739375, 97738516, 97725070, 97705817, 97696114, 97668236, 97626883, 97604614, 97574270, 97491413, 97380722, 97269350, 97165042, 97117817, 97130877, 97142547, 97160619, 97216654, 97266757]
2011.1I7266757J7578O056k7830p9846q6093r1428q9538Q393Q3047L5608m357O288
2035.6I7044635J120o932J02j4878l9070l3230k3103k4324o062J9377K2853K9772M2153
2062.1I7012413K5165M35k438j0300k2065j2309j0609k6769k4402j5932k5684k3812
2086.6I6863693r203j7798k6548j5122j6421k1076m613J585p331N07O818n543n293
2113.1I6743655L284q845j8275j1164j8042k8610j7053q953j2904n365q9p290j484
2139.6I6608865Q148k140p945K21n800j6504j2368j3978k1994j6731j4806k4145k1524
2166.1I6459299q130M745K3055L4445K1857L952k152p712j1242j412O836L475M411
2192.6I6531427J0431Q779P576R877M834q41J061J049l844o497q947j4025j6987j8090
$$ y = [97266757, 97284335, 97290391, 97262561, 97182715, 97096622, 97005194, 96915656, 96924049, 97007096, 97042704, 97038347, 97044635, 97045755, 97038823, 97038925, 97024047, 96984977, 96951747, 96928644, 96904320, 96898258, 96917635, 96940488, 96970260, 97012413, 97037578, 97038013, 97035575, 97025275, 97003210, 96990901, 96980292, 96953523, 96929121, 96913189, 96887505, 96863693, 96854490, 96836692, 96810144, 96795022, 96778601, 96757525, 96752912, 96754497, 96747166, 96747673, 96754491, 96748948, 96743655, 96746939, 96738094, 96719819, 96708655, 96690613, 96662003, 96644950, 96635997, 96623093, 96617728, 96617639, 96610349, 96608865, 96617013, 96614873, 96606928, 96607149, 96601349, 96584845, 96572477, 96558499, 96536505, 96519774, 96504968, 96480823, 96459299, 96451169, 96455914, 96478969, 96513414, 96535271, 96539223, 96537071, 96529359, 96518117, 96516705, 96523541, 96527016, 96531427, 96541858, 96550637, 96558213, 96568090, 96572924, 96572083, 96573144, 96574193, 96570349, 96563852, 96554905, 96540880, 96523893, 96505803]
2221.2I6505803k4200k9909k9451l0213l0751k7209k3663j7566k884J4394K5034K7597
2245.6I6356982K0546N406o527j1480j4937j7500j6892j2928r775r310k480J4001K4629
2272.2I6319735K3735K2417J9389J0950L415k128q398r191n424o896o742L16P99n049
2300.7I6356928l683l648j4073j9937j9378k4569k1452o127m959j1903m101K80p450
2327.2I6215928j038Q816L183O008J3578R203P129l010l0417k0969J9783L3206J3006
2353.7I6274406K682N639j1254k8014k3258k0098k0266j9372l2353l8206k3038j9502
2378.2I6047366k1518l433J0771L254k879n334k1518l0934k5648l5525m5979k8413
2402.7I5840210j1933j0234N030K2167K6244M5669O7002N4014L7336L5262J3429r358
$$ y = [96505803, 96481603, 96451694, 96422243, 96392030, 96361279, 96334070, 96310407, 96292841, 96289957, 96304351, 96329385, 96356982, 96377528, 96382934, 96376407, 96364927, 96349990, 96332490, 96315598, 96302670, 96292895, 96283585, 96281105, 96295106, 96319735, 96343470, 96365887, 96385276, 96396226, 96399641, 96397513, 96389115, 96379924, 96374500, 96367604, 96360862, 96361178, 96361977, 96356928, 96353245, 96349597, 96335524, 96315587, 96296209, 96271640, 96250188, 96244061, 96239102, 96227199, 96223098, 96223378, 96215928, 96214890, 96223706, 96226889, 96232897, 96246475, 96255678, 96262807, 96259797, 96229380, 96208411, 96228194, 96261400, 96274406, 96277088, 96282727, 96271473, 96243459, 96220201, 96200103, 96179837, 96160465, 96128112, 96089906, 96066868, 96047366, 96025848, 96022415, 96033186, 96036440, 96033561, 96028227, 96006709, 95975775, 95950127, 95914602, 95868623, 95840210, 95828277, 95818043, 95823073, 95845240, 95871484, 95917153, 95984155, 96038169, 96075505, 96110767, 96124196, 96114838]
2427.2I6114838k515n865k5428k0361j3697l1805l5459k3049l0559l3867k0159k4640
2451.6I5847434l1668j3364l445j1468o14J2392K963N751J9324J0377M626J7047J3238
2478.1I5872593O032K0766K1273ol40O521r018j4687p409k0700k7508j4668k2561l3843
2506.7I5776445j8633j6975l3820k0087J806n549o723O73j5330k1094j562m989j5187
2533.2I5618975N758J6123N245J5050K7937J5402J0920K0056R329M780K1750J5640
2557.7I5786965N4J2165J4824m423o26Q398q142j0305M887l129j0210M285N263L52
2586.2I5800358J5110K1559J1968J7113K0176k509j5480j0120j8198k4283j3959k1029
2610.7I5780706l6883l0309l0738m8023m2791k8497l7109l9733k7078k8581k8455n788
$$ y = [96114838, 96112323, 96106458, 96081030, 96060669, 96046972, 96015167, 95979708, 95956659, 95926100, 95892233, 95872074, 95847434, 95815766, 95802402, 95798957, 95787489, 95786875, 95799267, 95802230, 95807981, 95827305, 95837682, 95842308, 95859355, 95872593, 95878625, 95899391, 95920664, 95920658, 95920318, 95926839, 95917821, 95903134, 95895725, 95875025, 95847517, 95832849, 95810288, 95776445, 95757812, 95740837, 95707017, 95686930, 95688736, 95683187, 95676464, 95677137, 95661807, 95640713, 95639151, 95634162, 95618975, 95624733, 95640856, 95646101, 95661151, 95689088, 95704490, 95715410, 95735466, 95744795, 95749575, 95771325, 95786965, 95787019, 95799184, 95814008, 95809585, 95808959, 95817357, 95809215, 95798910, 95803797, 95800668, 95790458, 95794743, 95800006, 95800358, 95815468, 95837027, 95848995, 95866108, 95886284, 95883775, 95868295, 95858175, 95839977, 95815694, 95801735, 95780706, 95743823, 95713514, 95682776, 95634753, 95591962, 95563465, 95526356, 95486623, 95459545, 95430964, 95402509, 95396721]
2635.2I5396721Q965J0204K3586K8169J4812J4901To926k1488j9609k8515m1557m3058
2661.7I5351106n1159o0302m4769k1875n769K2167M4286L4565K1469K0629J2172P534
2686.2I5330054J7505J6165P165J8632L2163K7132K7823L2342J3202j3375k9022n1623
2710.7I5428163p0590n6475l6282l6674l9208m2415m9472m1824l0780l5709k7878M954
2735.1I4965810K3830K1952K7841L2419K6041L0518M0704L9417L8939L8970K0188P248
2759.6I5313877K6363M1854L1078J4353q094l8564n4384n6135n8133m8464l0715l6227
2784.1I5096809o1828q0633j01847j30009j38450j32799j35666j32704j16015r7435
2804.5I3969423o8927k9689j3662l2335n0688n3912n7596n5647l7277j6624N663M3541
$$ y = [95396721, 95405686, 95415890, 95439476, 95467645, 95482457, 95497358, 95512259, 95505333, 95483845, 95464236, 95435721, 95394164, 95351106, 95299947, 95239645, 95194876, 95173001, 95167232, 95189399, 95233685, 95268250, 95289719, 95310348, 95322520, 95330054, 95347559, 95363724, 95370889, 95389521, 95421684, 95448816, 95476639, 95508981, 95522183, 95508808, 95479786, 95428163, 95357573, 95301098, 95264816, 95228142, 95188934, 95146519, 95097047, 95055223, 95024443, 94988734, 94960856, 94965810, 94989640, 95011592, 95039433, 95071852, 95097893, 95128411, 95169115, 95208532, 95247471, 95286441, 95306629, 95313877, 95340240, 95382094, 95413172, 95427525, 95419431, 95380867, 95326483, 95270348, 95212215, 95163751, 95133036, 95096809, 95034981, 94954348, 94852501, 94722492, 94584042, 94451243, 94315577, 94182873, 94066858, 93969423, 93900496, 93870807, 93857145, 93824810, 93774122, 93720210, 93662614, 93606967, 93569690, 93553066, 93558729, 93602270]
2828.9I3602270P9477R4050Q9937O1643M727n4014q3649r5385j08796j19251j16456
2851.4I3354553r0069m5847q822J2922L3921N1481M8447L4713K5100O163k8223n1188
2875.9I3343151m7964l6502k8193l1018n1839o6977o8593p7886q2618p7945q5026q2212
2900.3I2606378n7906m6939m7159k9135r185j0699j4561j2583j8406j3375J5884L7313
2924.8I2399627M8912O0194M2618K7322P5448J49363J78391J62101J16837M0740j0604
2947.2I3290949K7764J11043J64300J81300J63936J25713J09976J00416O3670L5506
2967.6I4374573K7395n538p4345j66767k33180r7084K94221N86599M78005J68967j9312
2990.1I5333534j6629P1662J02425M0525j4174J6213Q2975J04052P5764J4448o2388
$$ y = [93602270, 93681747, 93775797, 93865734, 93927377, 93932104, 93878090, 93794441, 93699056, 93590260, 93471009, 93354553, 93264484, 93218637, 93209815, 93222737, 93256658, 93308139, 93356586, 93391299, 93416399, 93422562, 93394339, 93343151, 93295187, 93258685, 93230492, 93199474, 93147635, 93080658, 93012065, 92934179, 92851561, 92773616, 92688590, 92606378, 92548472, 92501533, 92454374, 92425239, 92416054, 92405355, 92390794, 92378211, 92359805, 92346430, 92362314, 92399627, 92448539, 92508733, 92551351, 92578673, 92654121, 92803484, 92981875, 93143976, 93260813, 93301553, 93290949, 93318713, 93429756, 93594056, 93775356, 93939292, 94065005, 94174981, 94275397, 94339067, 94374573, 94401968, 94396430, 94322085, 94155318, 93922138, 93825054, 94119275, 94705874, 95183879, 95352846, 95333534, 95316905, 95388567, 95490992, 95531517, 95517343, 95533556, 95616531, 95720583, 95796347, 95810795, 95748407]
3012.5I5748407j01066p8994p790R4854J55414J21188N8156L0261O688k5755l1972
3034.9I5969391k0480r287J4472L0971J2690m334K81j2869l0941k4849k9099m3058
3059.4I5852888l2950k4444l8832m7439n0909o6685o6489m1646l0518k8509p897L141
3083.9I5419711o950J699K1356L2717O8039J15716J22708R4652N9200K7597K9015O2603
3108.4I6048063P2724O0260O5970N1141k229m1097n8765o8485n3436k5225k7245m5264
3132.8I5976412l2144j0783j7416l4309m7344n7644m6616j5712l946k7591n0866n4104
3157.3I5577937m8935l7164l7324m8196m1634l8439n6637o0284m6652n1612o2042n7471
3181.8I4991547o1077p1692o5625o0982o8134o4051n9742p5107q3876p1216o6077o9452
$$ y = [95748407, 95647341, 95568347, 95560557, 95655411, 95810825, 95932013, 95990169, 96020430, 96027118, 96001363, 95969391, 95948911, 95939624, 95954096, 95985067, 95997757, 95993423, 95993704, 95980835, 95949894, 95925045, 95895946, 95852888, 95819938, 95795494, 95756662, 95709223, 95658314, 95591629, 95525140, 95483494, 95452976, 95424467, 95416570, 95419711, 95412761, 95414460, 95435816, 95468533, 95536572, 95652288, 95774996, 95869648, 95928848, 95956445, 95985460, 96048063, 96120787, 96181047, 96247017, 96298158, 96295929, 96254832, 96196067, 96127582, 96074146, 96048921, 96021676, 95976412, 95944268, 95933485, 95916069, 95881760, 95834416, 95776772, 95730156, 95714444, 95710498, 95682907, 95632041, 95577937, 95529002, 95491838, 95454514, 95406318, 95364684, 95326245, 95269608, 95209324, 95162672, 95111060, 95049018, 94991547, 94930470, 94858778, 94793153, 94732171, 94664037, 94599986, 94540244, 94465137, 94381261, 94310045, 94243968, 94174516]
3206.3I4174516o4474o9332q2481q0198p7993q4746p8010p1293q4800r1982q5157q7267
3230.7I3216783r0385q9824r9081j04117r3710q2320p7826p7433q4275q7106o7747
3253.2I2262959n4609p4768q6433o6888n5558n6964l8224j3429k7907o2883p7522q2254
3277.7I1565520p7379o5118o5452o6859n7667n1266o1417q0937j01489j23423j22643
3300.1I0691870r3078p3731q8185j28597j68479j78206j62780j54865j58250j54549
3320.5H9331150j47605j52308j72448j97273k10214k05427j90610j83737k01041k24948
3340.9H7445539k36988k48539k42979k20030k33722k71046k76101k63279k62386k71791
3361.3H4918678k77120k65032k55090k76935l11947l11726k78646k52688k35379k17002
$$ y = [94174516, 94110042, 94040710, 93958229, 93878031, 93800038, 93715292, 93637282, 93565989, 93481189, 93389207, 93304050, 93216783, 93126398, 93036574, 92937493, 92833376, 92739666, 92657346, 92579520, 92502087, 92417812, 92330706, 92262959, 92208350, 92133582, 92047149, 91980261, 91924703, 91867739, 91829515, 91816086, 91788179, 91725296, 91647774, 91565520, 91488141, 91423023, 91357571, 91290712, 91233045, 91181779, 91120362, 91039425, 90937936, 90814513, 90691870, 90598792, 90525061, 90436876, 90308279, 90139800, 89961594, 89798814, 89643949, 89485699, 89331150, 89183545, 89031237, 88858789, 88661516, 88451302, 88245875, 88055265, 87871528, 87670487, 87445539, 87208551, 86960012, 86717033, 86497003, 86263281, 85992235, 85716134, 85452855, 85190469, 84918678, 84641558, 84376526, 84121436, 83844501, 83532554, 83220828, 82942182, 82689494, 82454115, 82237113]
3381.7H2237113k04599j96326j81145j61999j65624j89602j93405j74063j61475j75566
3402.1H0433309j99753j89519j48296j12504q8543p1412o0469n2929n5885o4939n9528
3424.5G9329532l6293r984k044L660K2119J3727j2654j717L8254P0143P6312O0767
3449G9551822N9289P9918J01238J18876J30331J23322J13928J35798J59096J26225
3469.4H0699843P4178Q0019J18548J46639J57142J30528J08868J31971J39367J16504
3489.8H1903607J21790J49768J60045J54185J71042J88905J38872R1970J24038J64222
3510.2H3368444J77175J75506J62214J63633J97178K34443K14314J63359J49667J55091
3530.6H5161024J74308K19250K25633J88130K07699K65562K52229J67454J30903J63925
$$ y = [82237113, 82032514, 81836188, 81655043, 81493044, 81327420, 81137818, 80944413, 80770350, 80608875, 80433309, 80233556, 80044037, 79895741, 79783237, 79694694, 79623282, 79562813, 79509884, 79453999, 79389060, 79329532, 79293239, 79283255, 79281211, 79284871, 79306990, 79320717, 79308063, 79306346, 79344600, 79414743, 79491055, 79551822, 79611111, 79691029, 79792267, 79911143, 80041474, 80164796, 80278724, 80414522, 80573618, 80699843, 80774021, 80854040, 80972588, 81119227, 81276369, 81406897, 81515765, 81647736, 81787103, 81903607, 82025397, 82175165, 82335210, 82489395, 82660437, 82849342, 82988214, 83080184, 83204222, 83368444, 83545619, 83721125, 83883339, 84046972, 84244150, 84478593, 84692907, 84856266, 85005933, 85161024, 85335332, 85554582, 85780215, 85968345, 86176044, 86441606, 86693835, 86861289, 86992192, 87156117]
3551H7156117J73968J67006J87934K20489K50727K79510K96271K46161J39010J08439
3571.3H9225632J70428K37101K56401K63143K95353L39704L53659K75260J77443K00337
3591.7I1794461K66773K76488K62391K53987K44093K63954L06886L13264K70266K40528
3612.1I4493091K38466K43581K36112J72293J20610J78504K92063K93648J10614K6500
3632.5I6405482P5114J02133J09773J33265J79350K70283L60435K60687m6926j36942
3652.9I7712654j0854M4906J4544J2600K9546Q8459J87689J93763R0063P5441L2062
3675.4I8470873j34319j47099m4781N9837J82879K65921J26600j05214j14060j5539
3695.8I8545098N1666Q7452N5044p605M5788J66542J69724p427j23364o1667K6387
$$ y = [87156117, 87330085, 87497091, 87685025, 87905514, 88156241, 88435751, 88732022, 88978183, 89117193, 89225632, 89396060, 89633161, 89889562, 90152705, 90448058, 90787762, 91141421, 91416681, 91594124, 91794461, 92061234, 92337722, 92600113, 92854100, 93098193, 93362147, 93669033, 93982297, 94252563, 94493091, 94731557, 94975138, 95211250, 95383543, 95504153, 95682657, 95974720, 96268368, 96378982, 96405482, 96480596, 96582729, 96692502, 96825767, 97005117, 97275400, 97635835, 97896522, 97849596, 97712654, 97701800, 97746706, 97761250, 97773850, 97803396, 97891855, 98079544, 98273307, 98363370, 98438811, 98470873, 98336554, 98189455, 98144674, 98204511, 98387390, 98653311, 98779911, 98674697, 98560637, 98545098, 98596764, 98684216, 98739260, 98731655, 98777443, 98943985, 99113709, 99106282, 98982918, 98921251, 98947638]
3718.2I8947638P4142O9130J8036j6087K5201J19662J90413J30952m6784j13791q721
3740.6I9389791R3896O8181K3896N2005k3937j52064j08194j1277k718m2755j9919
3763.1I9266905L7014N4199Q881p3761p8535J0699Q7529O4534k0438m4078k8986k1553
3787.5I9262410o753K0385O8820J02555R9027R3842L0696n4347n9641p8117p3678K4492
3812I9429691J19245J15019Q3798N8627p1931j34611o1011J025M2218Q6278J25313
3834.4I9793661J05118p355r3055j05840r2524j9330J08499K04807J16998j51497j91587
3856.9I9667895n3001O1614Q1688L1841L5590M8786j7130p2134p7164k6631M7326M9096
3881.4I9777776K1434r668m4549r131P051l2449O927J04677J30832M7100o0117j22869
$$ y = [98947638, 99021780, 99090910, 99108946, 99092859, 99118060, 99237722, 99428135, 99559087, 99512303, 99398512, 99389791, 99483687, 99551868, 99575764, 99627769, 99603832, 99451768, 99343574, 99332297, 99329579, 99286824, 99266905, 99303919, 99358118, 99366999, 99293238, 99214703, 99225402, 99312931, 99377465, 99357027, 99312949, 99283963, 99262410, 99255657, 99276042, 99344862, 99447417, 99546444, 99640286, 99670982, 99616635, 99556994, 99478877, 99405199, 99429691, 99548936, 99663955, 99747753, 99806380, 99734449, 99599838, 99538827, 99539852, 99582070, 99668348, 99793661, 99898779, 99891424, 99798369, 99692529, 99600005, 99580675, 99689174, 99893981, 100010979, 99859482, 99667895, 99614894, 99676508, 99758196, 99790037, 99825627, 99874413, 99857283, 99785149, 99707985, 99681354, 99728680, 99777776, 99799210, 99789542, 99744993, 99735862, 99742913, 99710464, 99717391, 99822068, 99952900, 100000000, 99939883, 99817014]
3905.8I9817014j03891m4495J8650O9136P5757L2437j770L546J0050O562J7607L0041
3930.3I9930644N734l1781k7549J7023N5778M0525R626K0766K3401k575o544M220P975
3956.8A00047243J6629K1077J1396J1623K5630L0529K1530J2743J0777J2505J9657
3979.3A00241339K3854J4257L350P284J7500J8656J2314M900M709
3997.6A00348163
$$ y = [99817014, 99713123, 99668628, 99687278, 99756414, 99832171, 99864608, 99862838, 99866384, 99876434, 99882996, 99900603, 99930644, 99936378, 99904597, 99877048, 99894071, 99949849, 99990374, 100000000, 100020766, 100044167, 100041592, 100035048, 100039268, 100047243, 100063872, 100084949, 100096345, 100107968, 100133598, 100164127, 100185657, 100198400, 100209177, 100221682, 100241339, 100265193, 100279450, 100282800, 100290084, 100307584, 100326240, 100338554, 100343454, 100348163]
##END=$$ End of the data block
