##TITLE=KOOCl $$ Begin of the data block
##JCAMP-DX=5.00 $$ ACD/SpecManager v 10.08
##SPECTROMETER/DATA SYSTEM=Alpha
##DATE=08 Jun 2015 09:26:56
##DATA TYPE=INFRARED SPECTRUM
##DATA CLASS=XYDATA
##ORIGIN=
##OWNER=
##NPOINTS=1765
##FIRSTX=399.76428223
##LASTX=3997.64306641
##MAXX=3997.64306641
##MINX=399.76428223
##MAXY=1.00216305
##MINY=0.26735181
##XFACTOR=1.0000000000
##YFACTOR=0.000000010000000
##FIRSTY=1.00000000
##DELTAX=2.03961372
##XUNITS=1/CM
##YUNITS=ARBITRARY UNITS
##XYDATA=(X++(Y..Y))
$$ plain form
399.8 100000000 99896079 100089812 100216305 99872148 99625283 99909377 100000000 99452251 98964256 99303222
420.2 99303222 99478871 99126142 99135715 99404681 99052382 98329270 97973710 97536367 96192616 94045091
440.6 94045091 91323680 88281512 86269349 86554998 88173622 89409560 90465546 92678684 95653570
458.9 95653570 97449070 97913885 98099667 98110068 97451508 96744084 97134143 98162359 98607677 98597091
479.3 98597091 98756546 98729616 98002714 97015393 96228486 95679188 95807636 96948522 98362756 98975402
499.7 98975402 98785633 98686093 98789912 98409092 97655857 97394663 97646135 97559786 97104335 96951538
520.1 96951538 96742815 95810467 95026058 95495307 96274930 95881331 93929785 89945006 84192389
538.5 84192389 80975640 84241861 90904516 95628279 97365135 97846520 97975022 97056139 94924116
$$ packed form
399.8A00000000j03921J93733J26493l44157k46865K84094R0623n47749m87995L38966
420.2I9303222J75649l52729R573K68966l52299p23112l55560m37343j343751k147525
440.6I4045091k721411l042168k012163K85649J618624J235938J055986K213138K974886
458.9I5653570J795500M64815J85782J0401o58560p07424L90059J028216M45318j0586
479.3I8597091J59455k6930p26902r87321p86907n49298J28448J140886J414234O12646
499.7I8975402j89769r9540J03819l80820p53235k61194K51472q6349m55451j52797
520.1I6951538k08723r32348p84409M69249P79623l93599j951546l984779n752617
538.5H4192389l216749L266221O662655M723763J736856M81385J28502r18883k132023
$$ plain form
556.8 94924116 93716419 95098346 97306281 98377728 98833257 99272251 99280894 98957527 98988110 99277878
577.2 99277878 99166828 98824412 98828077 98853302 98274004 97361261 96719766 96236223 95721668 95944023
597.6 95944023 97295010 98597288 98945850 98954314 99222672 99350256 99026716 98732048 98736060 98538822
618 98538822 97815657 96851480 95842117 95037150 95086461 96050543 96940857 96802628 95704997 94277143
638.4 94277143 92758232 91566074 91883516 94066119 96659297 98220915 98878086 99424863 99907446
656.8 99907446 99944246 99773538 99880064 100037003 99752140 99459177 99778187 100000000 99727505 99329805
677.2 99329805 99128789 98754859 97844976 96527052 95026433 93946272 94288731 95897961 97194326
695.5 97194326 96958822 95675546 95250911 96580493 98303336 99218214 99674499 100022912 99973339 99605089
$$ packed form
556.8I4924116j207697J381927K207935J071447M55529M38994Q643l23367L0583K89768
577.2I9277878j11050l42416L665K5225n79298r12743o41495m83543n14555K22355
597.6I5944023J350987J302278L48562Q464K68358J27584l23540k94668M012j97238
618I8538822p23165r64177j009363q04967M9311R64082Q90314j38229j097631j427854
638.4I4277143j518911j192158L17442K182603K593178J561618O57171N46777M82583
656.8I9907446L6800j70708J06526J56939k84863k92963L19010K21813k72495l97700
677.2I9329805k01016l73930r09883j317924j500619j080161L42459J609230J296365
695.5I7194326k35504j283276m24635J329582J722843R14878M56285L48413m9573l68250
$$ plain form
715.9 99605089 99444759 99448705 99027008 97981292 96185338 92777181 87957412 85289371 87840980
734.3 87840980 93128347 96917111 98561662 99418169 99951029 100000000 99858397 99883610 99846739 99471664
754.7 99471664 99098366 99020571 98821741 98042136 96798551 95356005 94024146 93536484 94428241 96155691
775.1 96155691 97619903 98399800 98909456 99422193 99667853 99555856 99462092 99507546 99327481 98795336
795.4 98795336 98211014 97746253 97269922 96547550 95421529 93681604 90709555 85765368 80020314
813.8 80020314 77721184 81553805 88465881 93906575 96340960 96056330 93809241 91369355 90488392
832.2 90488392 90951389 92011821 93797660 95776421 96835488 96902865 96643668 96161038 95046669
850.5 95046669 92867869 88759780 83679998 82648444 87777632 93919796 96715593 96623570 95200825
$$ packed form
715.9I9605089j60330L946m21697j045716j795954l408157m819769k668041K551609
734.3H7840980N287367L788764J644551Q56507N32860M8971j41603K5213l6871l75075
754.7I9471664l73298p7795j98830p79605j243585j442546j331859m87662Q91757J727450
775.1I6155691J464212P79897N09656N12737K45660j11997r3764M5454j80065n32145
795.4I8795336n84322m64761m76331p22372j126021j739925k972049m944187n745054
813.8H0020314k299130L832621O912076N440694K434385k84630k247089k439886q80963
832.2I0488392M62997J060432J785839J978761J059067O7377k59197m82630j114369
850.5I5046669k178800m108089n079782j031554N129188O142164K795797r2023j422745
$$ plain form
868.9 95200825 92783815 88591099 83932233 83572775 88872075 94861573 97870135 98622876 98348612
887.2 98348612 97000360 94075590 89987177 87268823 88317966 91391271 92782497 91551363 89644819
905.6 89644819 88779145 87719071 85105014 83700919 85795856 88771540 90673834 92766213 95285809
923.9 95285809 97137070 97962123 97984290 97670925 97559792 97686476 97756445 97795093 97975880 98110360
944.3 98110360 97903788 97431749 96985251 96664625 96331960 95826602 95025742 93786919 92020696 89650148
964.7 89650148 86471957 82763171 80056077 80038571 82492936 85669726 88418376 90603393 92143029
983.1 92143029 92811805 92677224 92092896 91228300 89881110 87920159 85778844 84130013 82872671
1001.4 82872671 81053042 78099972 74501491 71155745 68424183 66338915 65147334 64592582 64135075
$$ packed form
868.9I5200825k417010m192716m658866l59458N299300N989498L008562P52741k74264
887.2I8348612j348252k924770m088413k718354J049143L073305J391226j231134j906544
905.6H9644819q65674j060074k614057j404095K094937K975684J902294K092379K519596
923.9I5285809J851261Q25053K2167l13365j11133J26684O9969L8648J80787J34480
944.3I8110360k06572m72039m46498l20626l32665n05358q00860j238823j766223k370548
964.7H9650148l178191l708786k707094j7506K454365L176790K748650K185017J539636
983.1I2143029O68776j34581n84328q64596j347190j960951k141315j648831j257342
1001.4H2872671j819629k953070l598481l345746k731562k085268j191581n54752m57507
$$ plain form
1019.8 64135075 64993089 68738371 74078077 79343462 84463382 88691598 91197664 92359918 92807174
1038.2 92807174 92795581 92276728 91153568 89345378 86684048 83349878 80629683 80147284 81643605
1056.5 81643605 82853878 82101172 79692239 77074426 75635946 75528693 75390202 74429965 74273115
1074.9 74273115 76770532 81100082 85087103 87869138 89863783 91492814 92747319 93455267 93587178
1093.2 93587178 93185842 92187947 90579015 88636810 86782002 85131747 83478284 82104158 82034039
1111.6 82034039 83661515 85799980 86675209 85427338 83054513 82044226 83856672 87280345 90299386
1129.9 90299386 92202085 93311024 93981129 94327384 94431037 94412011 94277805 93945885 93442887 92883986
1150.3 92883986 92280620 91553313 90697873 89755732 88674027 87363654 85814571 83963913 81538755
$$ packed form
1019.8F4135075Q58014L745282N339706N265385N119920M228216K506066J162254M47256
1038.2I2807174j1593n18853j123160j808190k661330l334170k720195m82399J496321
1056.5H1643605J210273p52706k408933k617813j438480j07253j38491r60237j56850
1074.9G4273115K497417M329550L987021K782035J994645J629031J254505P07948J31911
1093.2I3587178m01336r97895j608932j942205j854808j650255j653463j374126p0119
1111.6H2034039J627476K138465Q75229j247871k372825j010287J812446L423673L019041
1129.9I0299386J902699J108939O70105L46255J03653j9026j34206l31920n02998n58901
1150.3I2883986o03366p27307q55440r42141j081705j310373j549083j850658k425158
$$ plain form
1168.7 81538755 78377330 75110900 72877693 71735913 70513350 68426555 65808547 64074415
1185 64074415 64385754 65548533 65388501 63493371 60501599 56739765 52851641 49994677 48946580
1203.4 48946580 49902001 52776128 56967503 61379039 65226144 68467587 71268672 73446137 74586689
1221.7 74586689 74349016 72679579 70178854 68211800 68109751 69964939 72491395 74310809 75116521
1240.1 75116521 75567675 76379788 77443099 77859545 76965737 75105572 73351264 72300428 71157295
1258.4 71157295 68578660 64579219 61415267 61995667 66648215 72442096 76244378 77112222 75844252
1276.8 75844252 73665261 71401453 69176698 66888005 64727587 62922031 61351961 59651333
1293.1 59651333 57462084 54587680 51039284 46985176 42670834 38401765 34604633 31728786
$$ packed form
1168.7H1538755l161425l266430k233207j141780j222563k086795k618008j734132
1185F4074415L11339J162779j60032j895130k991772l761834l888124k856964j048097
1203.4D8946580R55421K874127M191375M411536L847105L241443K801085K177465J140552
1221.7G4586689k37673j669437k500725j967054j02049J855188K526456J819414Q05712
1240.1G5116521M51154Q12113J063311M16446q93808j860165j754308j050836j143133
1258.4G1157295k578635l999441l163952N80400M652548N793881L802282Q67844j267970
1276.8G5844252k178991k263808k224755k288693k160418j805556j570070j700628
1293.1E9651333k189249k874404l548396m054108m314342m269069l797132k875847
$$ plain form
1309.4 31728786 30017090 29487517 30140796 32157233 35732099 40525860 45768896 50820291 55210531
1327.8 55210531 58465540 60400015 61791587 63820970 66661656 69503433 71736294 73509067
1344.1 73509067 75187957 76898336 78609717 80267066 81771898 82964659 83647490 83542216 82438135
1362.5 82438135 80846596 79844964 80055243 81229901 82521886 83070046 81822199 77950627 71938330
1380.8 71938330 65887558 62781048 64618498 68798602 70161647 68024063 66297978 68895638
1397.1 68895638 74807715 80411917 84039158 86367309 88039339 89266473 90127635 90627456 90784675
1415.5 90784675 90673608 90516895 90441227 90379816 90357947 90275455 90035772 89819062 89753479 89967990 90547848
1437.9 90547848 91033632 91225427 91347867 91580969 91979909 92354494 92366159 91921806 91231191 90902078
$$ packed form
1309.4C1728786j711696n29573O53279K016437L574866M793761N243036N051395M390240
1327.8E5210531L255009J934475J391572K029383K840686K841777K232861J772773
1344.1G3509067J678890J710379J711381J657349J504832J192761O82831j05274j104081
1362.5H2438135j591539j001632K10279J174658J291985N48160j247847l871572o012297
1380.8G1938330o050772l106510J837450M180104J363045k137584j726085K597660
1397.1F8895638N912077N604202L627241K328151J672030J227134Q61162M99821J57219
1415.5I0784675j11067j56713p5668o1411k1869q2492k39683k16710o5583K14511N79858
1437.9I0547848M85784J91795J22440K33102L98940L74585J1665m44353o90615l29113
$$ plain form
1458.3 90902078 90834540 90475899 90215409 90848678 92001337 92962736 93809855 94717264 95473337 96001959
1478.7 96001959 96387172 96678275 96778369 96661812 96579033 96766251 96947128 96837741 96671462 96760845
1499.1 96760845 96894324 96735281 96103865 95361412 94975585 94182265 92441094 90188086 88753480
1517.5 88753480 89117020 91205579 93827778 95736927 96962720 97647822 97853380 97897607 97972131
1535.8 97972131 97755837 97321290 97385448 97843462 98273975 98461080 98431575 98355067 98195970 97750962
1556.2 97750962 97122377 97298759 97894984 98104799 98030168 97921425 98015213 98107934 97833788 97455579
1576.6 97455579 97309053 97064918 96681595 96457326 96406317 96319664 96116370 95831060 95418388 94803661
1597 94803661 94181991 93999511 94387197 94895589 95155841 95208585 95100731 94726551 94154489 93915731
$$ packed form
1458.3I0902078o7538l58641k60490O33269J152659R61399Q47119R07409P56073N28622
1478.7I6001959L85213K91103J00094j16557q2779J87218J80877j09387j66279Q9383
1499.1I6760845J33479j59043o31416p42453l85827p93320j741171k253008j434606
1517.5H8753480L63540K088559K622199J909149J225793O85102K05558M4227P4524
1535.8I7972131k16294m34547O4158M58014M30513J87105k9505p6508j59097m45008
1556.2I7750962o28585J76382N96225K09815p4631j08743R3788R2721k74146l78209
1576.6I7455579j46526k44135l83323k24269n1009q6653k03294k85310m12672o14727
1597I4803661o21670j82480L87686N08392K60252N2744j07854l74180n72062k38758
$$ plain form
1617.4 93915731 94132453 94244069 94199657 94230068 94262946 94235420 94105554 93806964 93619496 93870252
1637.8 93870252 94193995 94328469 94194245 93874735 93885261 94083524 94049877 94392818 95184875 95715797
1658.2 95715797 95893180 95896715 95979184 96014899 95803398 95632976 95665902 95707679 95743626 95653605 95249730
1680.7 95249730 94488442 93698061 93294197 92887968 92277390 91471851 90257657 88926858 87786442
1699 87786442 86748421 85914785 84948575 83759242 82415867 80697322 78526461 75890225 72761530
1717.4 72761530 69892067 67539543 64864933 61238319 56329203 50086260 43108833 35471857
1733.7 35471857 29449436 26852483 26735181 29161918 33874503 39921778 46381414 52486300 57083076
1752 57083076 59635109 61117804 62553942 64042878 65103525 65014309 63445777 60440624 56412041
$$ packed form
1617.4I3915731K16722J11616m4412L0411L2878k7526j29866k98590j87468K50756
1637.8I3870252L23743J34474j34224l19510J0526J98263l3647L42941P92057N30922
1658.2I5715797J77383L535Q2469L5715k11501j70422L2926M1777L5947r0021m03875
1680.7I5249730p61288p90381m03864m06229o10578q05539j214194j330799j140416
1699H7786442j038021q33636r66210j189333j343375j718545k170861k636236l128695
1717.4G2761530k869463k352524k674610l626614m909116o242943o977427p636976
1733.7C5471857o022421k596953j17302K426737M712585O047275O459636O104886M596776
1752E7083076K552033J482695J436138J488936J060647q9216j568532l005153m028583
$$ plain form
1770.4 56412041 52235198 50054228 50827545 53571635 56798756 58699715 58295804 55990213 53258926
1788.8 53258926 51908159 53487641 57252902 61301732 65214491 69211864 73102885 76363331
1805.1 76363331 78829056 80674946 82214934 83573687 84712082 85709423 86672384 87546223 88246572
1823.4 88246572 88864350 89438194 90004385 90613258 91151071 91571903 91930753 92184061 92294109 92444158
1843.8 92444158 92797917 93181139 93492240 93793052 94058961 94253200 94421124 94623041 94805759 94869649
1864.2 94869649 94826984 94856757 95086986 95335525 95493084 95635778 95776707 95869148 95951277 96061176
1884.6 96061176 96122712 96102250 96116072 96162337 96116793 96025002 96027243 96176553 96385419 96555835 96689731
1907.1 96689731 96819067 96926630 96981150 96992362 96997672 97019374 97025651 97084373 97244430 97372669 97418809
$$ packed form
1770.4E6412041m176843k180970P73317K744090L227121J900959m03911k305591k731287
1788.8E3258926j350767J579482L765261M048830L912759L997373L891021L260446
1805.1G6363331K465725J845890J539988J358753J138395R97341R62961Q73839P00349
1823.4H8246572O17778N73844N66191O08873N37813M20832L58850K53308J10048J50049
1843.8I2444158L53759L83222L11101L00812K65909J94239J67924K01917J82718O3890
1864.2I4869649m2665K9773K30229K48539J57559J42694J40929R2441Q2129J09899
1884.6I6061176O1536k0462J3822M6265m5544r1791K241J49310K08866J70416J33896
1907.1I6689731J29336J07563N4520J1212N310K1702O277N8722J60057J28239M6140
$$ plain form
1929.5 97418809 97476834 97575939 97651517 97680336 97688049 97702789 97755641 97848696 97974288 98107964 98189431
1951.9 98189431 98232818 98310059 98403567 98440367 98438138 98456579 98484480 98504251 98537332 98603648 98674744 98704326
1976.4 98704326 98720962 98778546 98844886 98858225 98849422 98873675 98903626 98924756 98980331 99065715 99128020 99140418
2000.9 99140418 99146754 99191749 99234557 99235964 99239314 99270844 99272984 99226928 99198747 99207580 99182731 99118245 99128193
2027.4 99128193 99224019 99282658 99274421 99277401 99317616 99338949 99329275 99347150 99398214 99419743 99400175 99398875
2051.9 99398875 99427944 99427527 99382919 99353456 99353582 99332988 99293435 99286032 99302256 99289829 99253684 99246734 99267387
2078.4 99267387 99264747 99244791 99259108 99301928 99322069 99327338 99364805 99417531 99434906 99433482 99462032 99503821
2102.9 99503821 99511987 99498934 99505687 99513125 99479961 99427491 99399078 99375916 99319553 99258757 99245888 99275470
$$ packed form
1929.5I7418809N8025R9105P5578K8819P713J4740N2852R3055J25592J33676Q1467
1951.9I8189431M3387P7241R3508L6800k229J8441K7901J9771L3081O6316P1096K9582
1976.4I8704326J6636N7584O6340J3339q803K4253K9951K1130N5575Q5384O2305J2398
2000.9I9140418O336M4995M2808J407L350L1530K140m6056k8181Q833k4849o4486R948
2027.4I9128193R5826N8639q237K980M0215K1333r674J7875N1064K1529j9568j300
2051.9I9398875K9069m17m4608k9463J26k0594l9553p403J6224j2427l6145o950K0653
2078.4I9267387k640j9956J4317M2820K0141N269L7467N2726J7375j424K8550M1789
2102.9I9503821Q166j3053O753P438l3164n2470k8413k3162n6363o0796j2869K9582
$$ plain form
2127.3 99275470 99312913 99366963 99453849 99536043 99574274 99594134 99631006 99661654 99659687 99658227 99694979 99743468
2151.8 99743468 99769038 99791026 99833304 99869341 99875200 99879342 99901617 99914241 99906331 99913573 99946320 99966735
2176.3 99966735 99954456 99940473 99945402 99941581 99915099 99900937 99919510 99934429 99923664 99920690 99944121 99958718
2200.8 99958718 99946505 99941325 99955827 99951500 99916208 99890238 99886680 99871397 99834466 99809116 99803889 99785829
2225.2 99785829 99749291 99731082 99739575 99741602 99730700 99736822 99762380 99773747 99768740 99778056 99793816 99777377 99737477
2251.8 99737477 99713570 99699718 99664766 99622113 99608678 99613047 99598765 99575806 99578863 99594533 99586248 99563587
2276.2 99563587 99558014 99558902 99535686 99500501 99481010 99467236 99439514 99413729 99412394 99417508 99396080 99353832 99312878
2302.7 99312878 99259275 99172169 99067330 98971784 98887777 98803383 98723859 98662364 98612821 98573923 98558682
$$ packed form
2127.3I9275470L7443N4050Q6886Q2194L8231J9860L6872L0648j967j460L6752M8489
2151.8I9743468K5570K1988M2278L6037N859M142K2275J2624p910P242L2747K0415
2176.3I9966735j2279j3983M929l821k6482j4162J8573J4919j0765k974K3431J4597
2200.8I9958718j2213n180J4502m327l5292k5970l558j5283l6931k5350n227j8060
2225.2I9785829l6538j8209Q493K027j0902O122K5558J1367n007R316J5760j6439l9900
2251.8I9737477k3907j3852l4952m2653j3435M369j4282k2959L057J5670q285k2661
2276.2I9563587n573Q88k3216l5185j9491j3774k7722k5785j335N114k1428m2248m0954
2302.7I9312878n3603q7106j04839r5546q4007q4394p9524o1495m9543l8898j5241
$$ plain form
2325.2 98558682 98554260 98538035 98520976 98525399 98534679 98519439 98497617 98515737 98603356 98777205 98951811 98983061
2349.7 98983061 98838151 98591328 98340905 98161507 98083240 98066050 98084378 98166943 98310292 98461878
2370.1 98461878 98600852 98745167 98899704 99050987 99195838 99343896 99487531 99597853 99670678 99734741
2390.4 99734741 99801743 99855578 99895340 99938780 99981445 100000560 99997693 99996924 100000000 99988216 99960601 99941278
2414.9 99941278 99934936 99921072 99896026 99877924 99867725 99847215 99822402 99813539 99814457 99804950 99787128 99784106 99797761
2441.4 99797761 99805528 99807018 99820453 99839085 99844098 99842840 99855000 99875587 99885446 99885535 99891019 99900168 99899185 99895161
2470 99895161 99903071 99910963 99899006 99876875 99864382 99855953 99833715 99807572 99802226 99809861 99809647 99807256 99819142 99835724
2498.5 99835724 99837482 99832964 99838746 99845272 99837118 99821353 99812216 99806350 99792838 99780697 99784160 99792355 99792218 99796516
$$ packed form
2325.2I8558682m422j6225j7059M423R280j5240k1822J8120Q7619J73849J74606L1250
2349.7I8983061j44910k46823k50423j79398p8267j7190J8328Q2565J43349J51586
2370.1I8461878J38974J44315J54537J51283J44851J48058J43635J10322P2825O4063
2390.4I9734741O7002N3835L9762M3440M2665J9115k867p69L076j1784k7615j9323
2414.9I9941278o342j3864k5046j8102j0199k0510k4813q863R18r507j7822l022J3655
2441.4I9797761P767J490J3435J8632N013j258J2160K0587R859Q9N484R149r83m024
2470I9895161P910P892j1957k2131j2493q429k2238k6143n346P635k14k391J1886J6582
2498.5I9835724J758m518N782O526q154j5765r137n866j3512j2141L463Q195j37M298
$$ plain form
2527.1 99796516 99812770 99820662 99808568 99794978 99795026 99794126 99781650 99777681 99794698 99811500 99816412 99828690 99854618
2553.6 99854618 99876344 99885422 99890578 99894565 99886173 99864542 99850154 99850482 99845427 99828303 99818802 99824363 99825126 99812925
2582.2 99812925 99808615 99818128 99820340 99812233 99813664 99823815 99823350 99815869 99821633 99839127 99850684 99855936 99867094 99879086
2610.7 99879086 99878216 99873304 99881595 99895436 99896121 99886292 99880272 99874604 99856406 99830377 99811244 99799353 99786949
2637.2 99786949 99777961 99778283 99781257 99779558 99778813 99791044 99813575 99831134 99843431 99857706 99871254 99882066 99897611
2663.7 99897611 99921429 99940437 99946648 99951255 99964327 99979103 99986345 99991030 99998087 100000000 99993855 99984586 99977154
2690.3 99977154 99963915 99940562 99914944 99897486 99890018 99887806 99889135 99893528 99894887 99889612 99885714 99888331 99887252
2716.8 99887252 99877638 99871671 99874735 99875432 99862868 99841797 99819279 99778426 99696589 99579853 99474823 99434012
$$ packed form
2527.1I9796516J6254P892j2094j3590M8r00j2476l969J7017J6802M912J2278K5928
2553.6I9854618K1726R078N156L987q392k1631j4388L28n055j7124r501N561P63j2201
2582.2I9812925m310R513K212q107J431J0151m65p481N764J7494J1557N252J1158J1992
2610.7I9879086q70m912Q291J3841O85r829o020n668j8198k6029j9133j1891j2404
2637.2I9786949q988L22K974j699p45J2231K2531J7559J2297J4275J3548J0812J5545
2663.7I9897611K3818J9008O211M607J3072J4776P242M685P057J913o145r269p432
2690.3I9977154j3239k3353k5618j7458p468k212J329M393J359n275l898K617j079
2716.8I9887252r614n967L064O97j2564k1071k2518m0853q1837j16736j05030m0811
$$ plain form
2741.2 99434012 99452299 99480313 99480814 99443638 99393249 99384153 99446976 99551594 99649143 99724799 99786144 99832749
2765.7 99832749 99862647 99880946 99889100 99880755 99854565 99825323 99806064 99790877 99776328 99770409 99769193 99759287 99737108
2792.2 99737108 99708724 99678105 99642283 99598855 99555671 99517369 99473786 99419528 99357337 99290842 99224848 99160647
2816.7 99160647 99099743 99041426 98979264 98912883 98851109 98796523 98740727 98680919 98624057 98564118 98473459 98336911
2841.2 98336911 98166990 97962242 97689307 97305483 96760601 95952666 94660181 92497671 89094120
2859.5 89094120 84767532 81118810 80143183 82195920 85649079 88829762 91223818 92942721 94140393
2877.9 94140393 94937617 95451295 95784354 95991778 96092647 96105540 96046835 95908391 95656663 95259362
2898.3 95259362 94712687 94015062 93147624 92161900 91186863 90272844 89435238 88908184 89032316 89794976
$$ packed form
2741.2I9434012J8287K8014N01l7176n0389r096O2823J04618R7549P5656O1345M6605
2765.7I9832749K9898J8299Q154q345k6190k9242j9259j5187j4549n919j216r906k2179
2792.2I9737108k8384l0619l5822m3428m3184l8302m3583n4258o2191o6495o5994o4201
2816.7I9160647o0904n8317o2162o6381o1774n4586n5796n9808n6862n9939r0659j36548
2841.2I8336911j69921k04748k72935l83824n44882q07935j292485k162510l403551
2859.5H9094120m326588l648722r75627K052737L453159L180683K394056J718903J197672
2877.9I4140393P97224N13678L33059K07424J00869J2893n8705j38444k51728l97301
2898.3I5259362n46675o97625q67438r85724r75037r14019q37606n27054J24132P62660
$$ plain form
2918.7 89794976 90797085 91695374 92407686 92986131 93485188 93910557 94233578 94410115 94371355 94041854
2939.1 94041854 93408710 92606056 91934329 91666770 91775906 92004806 92216903 92526513 93068171 93777692
2959.5 93777692 94480246 95075160 95560873 95952165 96248960 96465117 96618432 96711248 96756244 96767032
2979.9 96767032 96725428 96611285 96430194 96170622 95721149 94851923 93505299 92157108 91364110 91086572
3000.3 91086572 91078752 91350394 91854155 92372394 92756045 93002361 93239993 93611479 94090170 94551772
3020.7 94551772 94977534 95412320 95823258 96131325 96292681 96320367 96269453 96225649 96281934 96460962
3041.1 96460962 96713555 96979016 97208095 97368699 97435397 97397912 97279853 97120321 96966940 96879596
3061.5 96879596 96904892 97049820 97264636 97481877 97671717 97835124 97982275 98109573 98195159 98236555
$$ packed form
2918.7H9794976J002109Q98289P12312N78445M99057M25369L23021J76537l8760l29501
2939.1I4041854o33144q02654o71727k67559J09136K28900K12097L09610N41658P09521
2959.5I3777692P02554N94914M85713L91292K96795K16157J53315R2816M4996J0788
2979.9I6767032m1604j14143j81091k59572m49473q69226j346624j348191p92998k77538
3000.3I1086572p820K71642N03761N18239L83651K46316K37632L71486M78691M61602
3020.7I4551772M25762M34786M10938L08067J61356K7686n0914m3804N6285J79028
3041.1I6460962K52593K65461K29079J60604O6698l7485j18059j59532j53381q7344
3061.5I6879596K5296J44928K14816K17241J89840J63407J47151J27298Q5586M1396
$$ plain form
3081.9 98236555 98255581 98263359 98267531 98265868 98237908 98190391 98151278 98123193 98088789 98049581 98035491 98073912
3106.3 98073912 98151004 98223335 98283720 98349273 98404098 98424190 98397887 98336381 98281169 98253649 98234576 98193258
3130.8 98193258 98134285 98095495 98087555 98083454 98064113 98042959 98028803 98014796 98011148 98020643 98006201 97953206
3155.3 97953206 97900170 97865576 97833848 97795027 97754687 97720885 97686124 97643214 97598326 97551018 97497416 97443825
3179.8 97443825 97390240 97329628 97262114 97193074 97123975 97048813 96960485 96864504 96780843 96721935 96676838 96629322
3204.2 96629322 96576190 96515322 96444607 96371424 96303636 96236271 96160042 96081048 96009898 95938593 95855916 95774269
3228.7 95774269 95716596 95671839 95596123 95487946 95385528 95292360 95197207 95116991 95055568 94985962 94906968
3251.1 94906968 94845414 94805396 94761705 94706351 94659269 94627571 94602823 94586688 94581646 94559425 94500959 94428736
$$ packed form
3081.9I8236555J9026P778M172j663k7960m7517l9113k8085l4404l9208j4090L8421
3106.3I8073912P7092P2331O0385O5553N4825K0092k6303o1506n5212k7520j9073m1318
3130.8I8193258n8973l8790p940m101j9341k1154j4156j4007l648R495j4442n2995
3155.3I7953206n3036l4594l1728l8821m0340l3802l4761m2910m4888m7308n3602n3591
3179.8I7443825n3585o0612o7514o9040o9099p5162q8328r5981q3661n8908m5097m7516
3204.2I6629322n3132o0868p0715p3183o7788o7365p6229p8994p1150p1305q2677q1647
3228.7I5774269n7673m4757p5716j08177j02418r3168r5153q0216o1423o9606p8994
3251.1I4906968o1554m0018m3691n5354m7082l1698k4748j6135n042k2221n8466p2223
$$ plain form
3275.6 94428736 94362038 94303811 94248438 94188583 94124579 94064087 94017613 93971950 93900895 93801284 93681759
3298 93681759 93560064 93461823 93384975 93284035 93128949 92947179 92775840 92626852 92489159 92352760
3318.4 92352760 92216736 92079324 91939336 91782337 91598916 91402507 91205680 91021663 90856791 90678191
3338.8 90678191 90463150 90232921 89997053 89763457 89551294 89328390 89055055 88764220 88500804 88258117
3359.2 88258117 88005114 87740010 87495565 87273210 87025630 86730772 86430711 86164558 85918963 85674769
3379.6 85674769 85433924 85205352 84998351 84821248 84673202 84525621 84355271 84189117 84066260 83966845
3400 83966845 83832282 83663994 83516884 83405340 83301252 83189869 83074653 82958812 82849056 82756144
3420.4 82756144 82685649 82634020 82595557 82564890 82532144 82499170 82474262 82450831 82422620 82400322 82390791 82380658
$$ packed form
3275.6I4428736o6698n8227n5373n9855o4004o0492m6474m5663p1055r9611j19525
3298I3681759j21695r8241p6848j00940j55086j81770j71339j48988j37693j36399
3318.4I2352760j36024j37412j39988j56999j83421j96409j96827j84017j64872j78600
3338.8I0678191k15041k30229k35868k33596k12163k22904k73335k90835k63416k42687
3359.2H8258117k53003k65104k44445k22355k47580k94858l00061k66153k45595k44194
3379.6H5674769k40845k28572k07001j77103j48046j47581j70350j66154j22857r9415
3400H3966845j34563j68288j47110j11544j04088j11383j15216j15841j09756r2912
3420.4H2756144p0495n1629l8463l0667l2746l2974k4908k3431k8211k2298r531j0133
$$ plain form
3444.9 82380658 82376683 82399845 82434005 82459843 82482129 82506078 82532078 82562119 82598543 82634902 82685691 82793611
3469.4 82793611 82970154 83182454 83392006 83572549 83716613 83846271 83969009 84065217 84139955 84204680
3489.8 84204680 84248024 84265548 84280241 84313071 84354711 84410751 84525347 84682631 84829813 84981310 85156399
3512.2 85156399 85332608 85502768 85676587 85845023 86012560 86202925 86413848 86642683 86893350 87129956
3532.6 87129956 87327027 87518889 87725437 87907118 88038081 88171393 88381726 88633603 88846731 89045995
3553 89045995 89255202 89425915 89548308 89647806 89696896 89694881 89831042 90206283 90602243 90897566 91157204
3575.4 91157204 91424775 91687584 91918617 92065799 92147249 92350280 92726743 93045175 93251550 93472350
3595.8 93472350 93730932 93989611 94256461 94472170 94573784 94672239 94872922 95111728 95348269 95539707
$$ packed form
3444.9H2380658l975K3162L4160K5838K2286K3949K6000L0041L6424L6359N0789J07920
3469.4H2793611J76543K12300K09552J80543J44064J29658J22738R6208P4738O4725
3489.8H4204680M3344J7524J4693L2830M1640N6040J14596J57284J47182J51497J75089
3512.2H5156399J76209J70160J73819J68436J67537J90365K10923K28835K50667K36606
3532.6H7129956J97071J91862K06548J81681J30963J33312K10333K51877K13128J99264
3553H9045995K09207J70713J22393R9498M9090k015J36161L75241L95960K95323K59638
3575.4I1157204K67571K62809K31033J47182Q1450K03031L76463L18432K06375K20800
3595.8I3472350K58582K58679K66850K15709J01614R8455K00683K38806K36541J91438
$$ plain form
3616.2 95539707 95709145 96026689 96409518 96596855 96521878 96459663 96763277 97178119 97473580 97686315
3636.6 97686315 97835517 97938275 97977728 97847474 97531652 97375792 97713095 98138660 98337543 98496872
3657 98496872 98726571 98883939 98932809 98875797 98659104 98403209 98318875 98232651 98153168 98394030 98749715
3679.4 98749715 98990756 99089330 99003428 98791647 98731101 98971629 99272537 99444336 99468154 99397266 99377114
3701.9 99377114 99477881 99510020 99340272 99111867 99140769 99413562 99597728 99589843 99482816 99387461 99364293
3724.3 99364293 99427730 99481827 99357480 99052966 98841012 98979986 99266332 99314809 99068344 98875523
3744.7 98875523 98917425 98884577 98876315 99157399 99441338 99518728 99541175 99655789 99737149 99702013 99634653
3767.1 99634653 99615079 99709725 99846303 99870545 99776912 99712777 99760699 99823868 99876344 99948984 100000000
$$ packed form
3616.2I5539707J69438L17544L82829J87337p4977o2215L03614M14842K95461K12735
3636.6I7686315J49202J02758L9453j30254l15822j55860L37303M25565J98883J59329
3657I8496872K29699J57368M8870n7012k16693k55895q4334q6224p9483K40862L55685
3679.4I8749715K41041R8574q5902k11781o0546K40528L00908J71799K3818p0888k0152
3701.9I9377114J00767L2139j69748k28405K8902K72793J84166p885j07027r5355k3168
3724.3I9364293O3437N4097j24347l04514k11954J38974K86346M8477k46465j92821
3744.7I8875523M1902l2848q262K81084K83939P7390K2447J14614Q1360l5136o7360
3767.1I9634653j9574R4646J36578K4242r3633o4135M7922O3169N2476P2640N1016
$$ plain form
3789.6 100000000 99987286 99880230 99721164 99571049 99396193 99330944 99448311 99543905 99675256 99855256
3810 99855256 99864078 99658674 99438798 99310946 99216652 99324745 99559402 99676496 99701285 99657625 99552810
3832.4 99552810 99415845 99241745 99152100 99261862 99472874 99685115 99792963 99660504 99246871 98849386
3852.8 98849386 99026161 99448276 99632066 99573874 99439704 99396193 99366128 99271905 99280781 99420887 99575925
3875.2 99575925 99626029 99526256 99459219 99472982 99508053 99588239 99601591 99587417 99682242 99729127 99578953
3897.7 99578953 99344164 99223608 99310529 99563229 99806315 99921733 99926186 99848109 99728769 99671197 99700814
3920.1 99700814 99725854 99723852 99738872 99729937 99672854 99667192 99745297 99801534 99778497 99706358 99655080 99663627
3944.6 99663627 99675149 99676073 99718684 99778897 99804789 99804825 99805331 99815559 99846113 99883306 99898195 99899256 99903196
$$ packed form
3789.6A00000000j2714j07056j59066j50115j74856o5249J17367R5594J31351J80000
3810I9855256Q822k05404k19876j27852r4294J08093K34657J17094K4789m3660j04815
3832.4I9552810j36965j74100q9645J09762K11012K12241J07848j32459m13633l97485
3852.8I8849386J76775M22115J83790n8192j34170m3511l0065r4223Q876J40106J55038
3875.2I9575925N0104r9773o7037J3763L5071Q0186J3352j4174R4825M6885j50174
3897.7I9578953k34789j20556Q6921K52700K43086J15418M453p8077j19340n7572K9617
3920.1I9700814K5040k002J5020q935n7083n662P8105N6237k3037p2139n1278Q547
3944.6I9663627J1522R24M2611O0213K5892L6N06J0228L0554L7193J4889J061L940
$$ plain form
3971.1 99903196 99912459 99932790 99955559 99965984 99976921 99995559 100000000 99984002 99964178 99949485 99940169 99938506
3995.6 99938506 99940813
3997.6 99940813
$$ packed form
3971.1I9903196R263K0331K2769J0425J0937J8638M441j5998j9824j4693r316j663
3995.6I9938506K307
3997.6I9940813
##END=$$ End of the data block
