##TITLE=KOOBenz $$ Begin of the data block
##JCAMP-DX=5.00 $$ ACD/SpecManager v 10.08
##SPECTROMETER/DATA SYSTEM=Alpha
##DATE=08 Jun 2015 09:26:56
##DATA TYPE=INFRARED SPECTRUM
##DATA CLASS=XYDATA
##ORIGIN=
##OWNER=
##NPOINTS=1765
##FIRSTX=399.76428223
##LASTX=3997.64306641
##MAXX=3997.64306641
##MINX=399.76428223
##MAXY=1.00063646
##MINY=0.51312113
##XFACTOR=1.0000000000
##YFACTOR=0.000000010000000
##FIRSTY=1.00000000
##DELTAX=2.03961372
##XUNITS=1/CM
##YUNITS=ARBITRARY UNITS
##XYDATA=(X++(Y..Y))
399.8A00000000j9681L5059M8268q7845R894J4305j19686j01960j82998k09570L2842
422.2I9418628o6042k66492k36672k63101j07932K86692L27158J83892J55420j20L16
444.6I9431747J58334K0468n2511M0102q6254p1162J33800K8432n413P0209p8577n5289
469.1I9533886M3666q4925j0883P8541r8497q0627Q166j06872m1472J7154j30189p7522
493.6I9050426m4715k05719j50818r9850k06017j11765q0854k17628j38152r6088k16085
516I7482735j17952p2473k12061j80924j87803l17239k81424l21823n21243n42032
536.4I4727761n71859o70177n59133m91155n63579m83567l79383k17426L42554R92614
556.8I2126650J378733J547372J325804Q39633N75530L73387J31983J30844J07551
$$ plain form
399.8 100000000 99980319 100015378 100063646 99975801 99985695 100000000 99880314 99778354 99595356 99385786 99418628
422.2 99418628 99352586 99086094 98849422 98586321 98478389 98765081 99092239 99276131 99431551 99431431 99431747
444.6 99431747 99590081 99610549 99558038 99598140 99511886 99440724 99574524 99602956 99597543 99667752 99589175 99533886
469.1 99533886 99577552 99492627 99481744 99560285 99461788 99381161 99389327 99282455 99240983 99258137 99127948 99050426
493.6 99050426 99005711 98799992 98649174 98549324 98343307 98231542 98150688 97933060 97794908 97698820 97482735
516 97482735 97364783 97292310 97080249 96899325 96711522 96394283 96112859 95791036 95269793 94727761
536.4 94727761 94155902 93485725 92926592 92435437 91871858 91388291 91008908 90791482 91134036 92126650
556.8 92126650 93505383 95052755 96378559 97218192 97793722 98167109 98299092 98429936 98537487
575.2I8537487j6058N1081O4153n0420M1372O8903n0706K3175N0896n5665J4246M4691
599.6I8723155m3392M9543M8316p6884l928j8013k12872j45804P6180J38116J60778
622.1I8695195P7527m0692K7472J9968j16670p6259j28406l91495o26737j059026j637053
644.5I4743824j378530K46113J611650J317007L14468l15714o50180j362997k774215
662.9I1751426l930789l770202Q15099N598367M789817J986635k77228j809465l276521
681.2I1877139k809287L71862K874935K302754M36210r72336j935679l107673m911768
699.6H4126157p448757r827161r082097l708589L201997Q098436R967023Q856028N988562
717.9I0171599L531737K124935J216531P38686N18423K52027J27786J05727l7396q8126
$$ plain form
575.2 98537487 98521429 98572510 98636663 98586243 98627615 98696518 98645812 98668987 98719883 98664218 98678464 98723155
599.6 98723155 98679763 98729306 98777622 98700738 98696810 98678797 98465925 98320121 98396301 98534417 98695195
622.1 98695195 98772722 98732030 98759502 98779470 98662800 98586541 98458135 98066640 97439903 96380877 94743824
644.5 94743824 93365294 93611407 95223057 96540064 96854532 96538818 95888638 94525641 91751426
662.9 91751426 87820637 84050435 84865534 90463901 95253718 97240353 96963125 95153660 91877139
681.2 91877139 89067852 89439714 92314649 94617403 95053613 94081277 92145598 89037925 84126157
699.6 84126157 76677400 66850239 57768142 54059553 57261550 65359986 75327009 84183037 90171599
717.9 90171599 93703336 95828271 97044802 97783488 98301911 98553938 98681724 98787451 98750055 98661929
738.3I8661929m9883j58912j87128j23686j70469j07116L8648o223l8600P206q4531
760.8I7781235j32090j05178j96934k20561j29002j50240j41316n6804q7124j3572
781.2I6548414K36458L40342L08037K55543N9223j44756k90662o04754r65619j124370
801.6I4617856j009047n64671k79355l53712M06122J713950J784044J096302Q04866
819.9I8216355O00183L26907K04450R2578R275J03676J54549R8974J12456Q0597n54
842.4I9999446P862o605q5944r3025j22243j37734L7950J62315P4280J8287j2458q9472
866.8I9752659p5901o4611j26201j06615r4825j59747j41209j26791k03091k11394
887.2I8442274k07597k85208l00431l05420l97706m42130m73487n87803o59639p06869
$$ plain form
738.3 98661929 98612046 98453134 98266006 98142320 97971851 97864735 97903383 97897160 97858560 97865766 97781235
760.8 97781235 97649145 97543967 97347033 97126472 96997470 96847230 96705914 96649110 96561986 96548414
781.2 96548414 96784872 97125214 97433251 97688794 97748017 97603261 97312599 96707845 95742226 94617856
801.6 94617856 93608809 93044138 92764783 92411071 92817193 94531143 96315187 97411489 98216355
819.9 98216355 98816538 99143445 99347895 99440473 99449748 99553424 99707973 99806947 99919403 100000000 99999446
842.4 99999446 100007308 100000703 99914759 99821734 99699491 99561757 99599707 99762022 99836302 99854589 99842131 99752659
866.8 99752659 99676758 99612147 99485946 99379331 99284506 99124759 98983550 98856759 98653668 98442274
887.2 98442274 98234677 97949469 97649038 97343618 96945912 96503782 96030295 95442492 94782853 94075984
907.6I4075984q21865q82745q96889r51540r37402q59589q42231q32683q66085j037151
928H5147804j156986j027590n76508L11744J271421J436401R36073P24315R35012J196438
948.4H9198124J371462J384431J293468J183248R81861P63440O29199M88758L63284
966.8I7657275L21168K31713R6393O3008R3126J22195J37526O6108m1026k4665J0801
989.2I8733622p7450k17164l30025n49370n92929J49202Q49354O24025J46640n9432
1009.6I8676473q9729j22738k24399k96545n04762j199621k287841k247811L15589
1028I2018616K813989K383334Q18169J51354L3849k8157m3631l5393o8378o1828l9500
1050.4I7942424o6310q2994r1785j75691k94089m72218q36986j319987j696866j621819
$$ plain form
907.6 94075984 93254119 92371374 91474485 90522945 89585543 88725954 87883723 87051040 86184955 85147804
928 85147804 83990818 82963228 82386720 82698464 83969885 85406286 86342359 87066674 88001686 89198124
948.4 89198124 90569586 91954017 93247485 94430733 95412594 96176034 96805233 97293991 97657275
966.8 97657275 97978443 98210156 98306549 98369557 98462683 98584878 98722404 98788512 98747486 98722821 98733622
989.2 98733622 98656172 98439008 98108983 97559613 96966684 97115886 97965240 98589265 98735905 98676473
1009.6 98676473 98586744 98464006 98239607 97943062 97438300 96238679 93950838 91703027 92018616
1028 92018616 94832605 97215939 98034108 98185462 98219311 98191154 98147523 98112130 98043752 97981924 97942424
1050.4 97942424 97876114 97793120 97701335 97525644 97231555 96759337 95922351 94602364 92905498 91283679
1070.8I1283679m99392J519096K666468K055740R44322K99901L4470q5110j97714l07179
1091.2I7714281l91543n06985o07204m79359o169M48018M24654L3700l33750n00667
1111.6I5794976n13989m69196m86469o40649q49950j088959j212507m84288J179850
1129.9I1228819K301049K031106J207501O00862K60383R9581K7734j7017k3251k8682
1150.3I7688085q8030j64414k17521k48694k56723l10624m73291o58917q24791j133156
1170.7I3311924j580131j837826j607382p17324L94392O54763K37381P15971K108800
1189.1I1680568K652240J867759Q21275J69146j50299l46506n11598o51860q02887
1207.5I4727838r27001r38875q86094q49748q02958p06452n66334m37915m42606o33717
$$ plain form
1070.8 91283679 90784287 92303383 94969851 97025591 97969913 98269814 98304284 98219174 98021460 97714281
1091.2 97714281 97322738 96815753 96208549 95729190 95723021 96171039 96595693 96629393 96295643 95794976
1111.6 95794976 95280987 94811791 94325322 93684673 92834723 91745764 90533257 90048969 91228819
1129.9 91228819 93529868 95560974 96768475 97369337 97629720 97729301 97757035 97740018 97716767 97688085
1150.3 97688085 97600055 97435641 97218120 96969426 96712703 96402079 95928788 95269871 94445080 93311924
1170.7 93311924 91731793 89893967 88286585 87569261 87963653 88618416 88855797 89571768 91680568
1189.1 91680568 94332808 96200567 97021842 97190988 97040689 96694183 96182585 95530725 94727838
1207.5 94727838 93800837 92861962 91975868 91126120 90323162 89616710 89050376 88612461 88169855 87536138
1227.9H7536138q14211n18054N27233J670605J923376J319439O16449J66469r2285
1246.2I2335159k15167k73293l27373l52132l75355m61024n91969p70867j028043j334244
1266.6H6605692j669908j938909j881981j428777r34404q34399j272959k008063k655869
1285G1980423k976984k740181j761055k24351J348781K401298K639354K347713K359748
1303.3G5374746L161687L966129L531825J871163l833j421612k609962m047472m959279
1321.7G4863392m151809j848012J116305L963024N538296N302138M054874K803236
1338I1641444J890141J256644P98548M83870L08299K23077K02274K33334J87636R399
1358.4I7234666j83391l33894m33737n28609o63936p53862p39110o55192n69373n79620
$$ plain form
1227.9 87536138 86721927 86203873 86731106 88401711 90325087 91644526 92260975 92427444 92335159
1246.2 92335159 92119992 91846699 91519326 91167194 90791839 90330815 89738846 88967979 87939936 86605692
1266.6 86605692 84935784 82996875 81114894 79686117 78751713 77917314 76644355 74636292 71980423
1285 71980423 69003439 66263258 64502203 64277852 65626633 68027931 70667285 73014998 75374746
1303.3 75374746 78536433 82502562 86034387 87905550 87901717 86480105 83870143 79822671 74863392
1321.7 74863392 70711583 68863571 69979876 73942900 79481196 84783334 88838208 91641444
1338 91641444 93531585 94788229 95586777 96070647 96378946 96602023 96804297 97037631 97225267 97234666
1358.4 97234666 97051275 96717381 96283644 95755035 95091099 94337237 93598127 92942935 92373562 91793942
1378.8I1793942o82151p09528m63742K5970M06981M20254K76595K19173K33674J88046
1399.2I1709214M7851j73205m64821q17537j205504j607669j926672k081114k181739
1417.5H1298804k058512j286757m53990J96969R71836K096474L101629L340298L377777
1435.9I0584528K942491J673216O06030l63439j823509m010123n648482m733455p77364
1454.3G8449893M826790O955934L660220J575124J202690J118672P68364L98755K66421
1472.6I9222863K82573K41304J73950P9310k8807j49417l54636o62958r54932j057083
1493I6792167q70430Q6617J262629J229519N38337J2386j03670R1791O7645j05601
1513.4I9001390k40469k87777k96724k58673r5564N484N8162O0189m8232p8935m3123
$$ plain form
1378.8 91793942 91111791 90402263 89938521 89964491 90371472 90791726 91068321 91287494 91521168 91709214
1399.2 91709214 91757065 91583860 91119039 90301502 89095998 87488329 85561657 83480543 81298804
1417.5 81298804 79240292 77953535 77499545 77696514 78668350 80764824 83866453 87206751 90584528
1435.9 90584528 93527019 95200235 95806265 95442826 93619317 89609194 83960712 79227257 78449893
1454.3 78449893 83276683 90232617 93892837 95467961 96670651 97789323 98557687 98956442 99222863
1472.6 99222863 99505436 99746740 99920690 100000000 99971193 99821776 99467140 98804182 97849250 96792167
1493 96792167 95921737 96008354 97270983 98500502 99038839 99051225 98947555 99039346 99106991 99001390
1513.4 99001390 98760921 98473144 98176420 97917747 97822183 97827667 97885829 97946018 97897786 97818851 97775728
1535.8I7775728j69033k93368j14674O092l0512j03068j64759j60331j72406k66886
1556.2I6306783l57032j30069j7852k02769l56149m59361n12440n33562q53986j424235
1576.6I1459328j671350j941037j860601L9923K852720L572130J776720k67411j454067
1595I2506355k085620k344710k037525q84032Q83788K214735K253932J285917K30372
1613.4I2023212n56612q24178k72774J55794J46431l081j08582j85716k67756l91651
1633.7H9715087m59045l06916k41733l40098m83244o44786o33847n13381p49970r49740
1654.1H4392327o41292o69360r31299j263303j517993j698989k273100k872014k754730
1672.5F9770247k911717l138179k780062k575087k685493k664233j446706k56657M21470
$$ plain form
1535.8 97775728 97606695 97313327 97198653 97204745 97174233 97071165 96906406 96746075 96573669 96306783
1556.2 96306783 95949751 95819682 95801830 95599061 95242912 94783551 94271111 93737549 92883563 91459328
1576.6 91459328 89787978 87846941 85986340 86026263 88878983 92451113 94227833 93960422 92506355
1595 92506355 90420735 88076025 86038500 85154468 86038256 88252991 90506923 91792840 92023212
1613.4 92023212 91466600 90642422 90369648 90525442 90671873 90668792 90560210 90374494 90106738 89715087
1633.7 89715087 89256042 88949126 88707393 88367295 87884051 87239265 86605418 86092037 85342067 84392327
1654.1 84392327 83751035 83081675 82150376 80887073 79369080 77670091 75396991 72524977 69770247
1672.5 69770247 66858530 63720351 60940289 58365202 55679709 53015476 51568770 51312113 51733583
1690.9E1733583Q19499J079785J099855O63209K53850P3004O26838K274192L700226
1709.2F2324041L658635K749216K075541K083159K120345K031202K443879K901346
1725.5H2387364K845567K453453J920229J709551J496315R60451O88541N60826L71849
1743.9I5394146K52021K05862K66683L81113L75449L07352K62957K02263J53464J25515
1764.3I7926825L7933m4388p8183k8348N2881L4726l9292r4491j18566j25449r6769
1786.7I7426879p6097m0579P8565J79780J66142J31798J52224J95974J75261J04773
1807.1I8494720O9184P3725P7271M8256L743l9428o0529m3458K3675R4045J44517J97387
1831.6I9083108J78146J17141P7534M8709k772j5551O7175J16998Q7005M5961K2524
$$ plain form
1690.9 51733583 52553082 53632867 54732722 55395931 55649781 55722785 56349623 58623815 62324041
1709.2 62324041 65982676 68731892 70807433 72890592 75010937 77042139 79486018 82387364
1725.5 82387364 85232931 87686384 89606613 91316164 92812479 93772930 94461471 95022297 95394146
1743.9 95394146 95646167 95852029 96118712 96499825 96875274 97182626 97445583 97647846 97801310 97926825
1764.3 97926825 97964758 97920370 97842187 97813839 97866720 97901446 97862154 97767663 97649097 97523648 97426879
1786.7 97426879 97350782 97310203 97388768 97568548 97734690 97866488 98018712 98214686 98389947 98494720
1807.1 98494720 98563904 98637629 98714900 98763156 98766899 98727471 98666942 98623484 98647159 98741204 98885721 99083108
1831.6 99083108 99261254 99378395 99455929 99504638 99501866 99486315 99553490 99670488 99757493 99803454 99825978
1854I9825978k128k1165k5213l3498n9670r0599q3143o675M1449J2672j8484k3549
1878.5I9515975k3902k7543k2727l1370m5252k0868n472k4539k6423k6208m7469o4850
1903I9149352q9526j38181j88625k13939j98382j17809J5676J19657J36226J32698
1923.4I8607147J33878R8687M1396k826K0856J09249J64825J44076J09131R5993P3677
1945.8I9596089L9065M506j3250p21J6075K2364K8348N728o5392j47021j92470j45256
1970.3I9148065M136J27757J33121R2948N1897m017n8448j01531j02925j8281R8133
1992.7I9370855J45877J31505J01280O0428L1435J6743l546n222N639n496j8340j9908
2017.2I9811250l2783l9327m4620l8230M6909J17880P8583L3938L0339J3644J901J2320
$$ plain form
1854 99825978 99823850 99802685 99777472 99743974 99684304 99593705 99510562 99503887 99545336 99558008 99539524 99515975
1878.5 99515975 99492073 99464530 99441803 99410433 99365181 99344313 99338841 99314302 99287879 99261671 99214202 99149352
1903 99149352 99059826 98921645 98733020 98519081 98320699 98202890 98218566 98338223 98474449 98607147
1923.4 98607147 98741025 98839712 98881108 98878282 98899138 99008387 99173212 99317288 99426419 99522412 99596089
1945.8 99596089 99635154 99639660 99626410 99625689 99641764 99664128 99692476 99698204 99632812 99485791 99293321 99148065
1970.3 99148065 99152201 99279958 99413079 99506027 99557924 99553907 99495459 99393928 99291003 99272722 99370855
1992.7 99370855 99516732 99648237 99749517 99809945 99841380 99858123 99854577 99849355 99854994 99849498 99831158 99811250
2017.2 99811250 99778467 99739140 99694520 99656290 99703199 99821079 99899662 99933600 99963939 99977583 99979484 99991804
2041.7I9991804Q196J633N329p665j3560j449j0288k2751j8549k9999m5979m3392n2482
2068.2I9760848o7252o7955q5580j11097j12099j12253j12093q7458o1857l1668K6566
2090.6I8938102P4505R2501J05226R6214O3389M5353L2634J5116J8376K6881J7256
2113.1I9525553R757O116M518K0236K7608J6076K1839L3712K4879J9729J5814l6l82
2139.6I9725419N555l773n835p480k7341l5357k8336l0041k8384k4861l5346l8445
2164.1I9465775l5983m5663l7068j1760j0848k1309k1767k3950j7857k831j633o86
2188.5I9234420J0502R984N222Q696R89j1623j1110j4269k2131k0606k4724k9021j9872
2215I9116457j4878j1784m965j2976k5838k7389l3182m2349m3481m7910n4717n2846
$$ plain form
2041.7 99991804 100000000 100001633 100006962 99999297 99985737 99984288 99974000 99951249 99932700 99902701 99856722 99813330 99760848
2068.2 99760848 99693596 99625641 99540061 99428964 99316865 99204612 99092519 99005061 98943204 98911536 98938102
2090.6 98938102 99012607 99105108 99210334 99306548 99369937 99415290 99447924 99463040 99481416 99508297 99525553
2113.1 99525553 99535310 99541426 99545944 99566180 99593788 99609864 99631703 99665415 99690294 99710023 99725837 99725801 99725419
2139.6 99725419 99730974 99727201 99721366 99713886 99686545 99651188 99622852 99592811 99564427 99539566 99504220 99465775
2164.1 99465775 99429792 99384129 99347061 99335301 99324453 99303144 99281377 99257427 99239570 99236739 99235106 99234420
2188.5 99234420 99244922 99254906 99260128 99268824 99269813 99258190 99247080 99232811 99210680 99190074 99165350 99136329 99116457
2215 99116457 99101579 99089795 99084830 99071854 99046016 99018627 98985445 98943096 98899615 98851705 98796988 98744142
2239.5I8744142n3608n6881m6808l1697k0379q059l576r227r346m524j299K265j401
2266I8499602j2076j7208k4569l8749m4185m4095m6402m4859m1324m0382l5697k6435
2290.5I8083621k2524k8199l7045l8647l3909k9844k6846k4164k4301k9617l5918m0394
2315I7712213m5443n0664n4121n5289n9074o3986n4544l7062l3641m1133m7863n0389
2339.5I7119004n2351n2709l7300j7399j1235q524o401j6010l0357m1282n1612n2213
2363.9I6741611m9043m6354l2175k1392l2509m8679n4663n7125n9134o1458o6358o7622
2388.4I6145099o5356o7109o6996o2400o1333o3777o7514p1508p2574p3058p3302o9999
2412.9I5330173o5041o0451n6976n6130n8889o4391o8891o8855o5369o1863o1685o6406
$$ plain form
2239.5 98744142 98690534 98633653 98586845 98555148 98534769 98526710 98523134 98513907 98504561 98500037 98498738 98501003 98499602
2266 98499602 98487526 98470318 98445749 98407000 98362815 98318720 98272318 98227459 98186135 98145753 98110056 98083621
2290.5 98083621 98061097 98032898 97995853 97957206 97923297 97893453 97866607 97842443 97818142 97788525 97752607 97712213
2315 97712213 97666770 97616106 97561985 97506696 97447622 97383636 97329092 97292030 97258389 97217256 97169393 97119004
2339.5 97119004 97066653 97013944 96976644 96959245 96948010 96939486 96933085 96917075 96886718 96845436 96793824 96741611
2363.9 96741611 96692568 96646214 96614039 96592647 96560138 96511459 96456796 96399671 96340537 96279079 96212721 96145099
2388.4 96145099 96079743 96012634 95945638 95883238 95821905 95758128 95690614 95619106 95546532 95473474 95400172 95330173
2412.9 95330173 95265132 95204681 95147705 95091575 95032686 94968295 94899404 94830549 94765180 94703317 94641632 94575226
2437.4I4575226p2282p7939q5146r2870r4223q9728r2566r9004r9003r4235q4823p7731
2461.8I3515676q4078r2614r1296q9556q7315q0252q1044q4818p6395o9862p7075q9818
2486.3I2511553j04809j20348j31696j42432j48397j41752j32913j25551j14476j06949
2506.7I1242230j07229j10489j20979j39702j53893j62274j70839j79332j87874j93161
2527.1H9716458j93774k00767k11930k12884k10464k14255k16305k12586k03723j87027
2547.5H7652743j68634j51097j24628r3889o3902k6482J3327N1135R8741J60593K36720
2569.9H7584627L22312L94326M37689M53711M27907L56084K66421J67007N5927m6349
2590.3I0419662j31935k00748k39963k46930k28172j76323q8554K1380J33401K13969
$$ plain form
2437.4 94575226 94502944 94425005 94339859 94246989 94152766 94063038 93970472 93871468 93772465 93678230 93593407 93515676
2461.8 93515676 93431598 93338984 93247688 93158132 93070817 92990565 92909521 92824703 92748308 92678446 92601371 92511553
2486.3 92511553 92406744 92286396 92154700 92012268 91863871 91722119 91589206 91463655 91349179 91242230
2506.7 91242230 91135001 91024512 90903533 90763831 90609938 90447664 90276825 90097493 89909619 89716458
2527.1 89716458 89522684 89321917 89109987 88897103 88686639 88472384 88256079 88043493 87839770 87652743
2547.5 87652743 87484109 87333012 87208384 87114495 87050593 87024111 87037438 87088573 87187314 87347907 87584627
2569.9 87584627 87906939 88301265 88738954 89192665 89620572 89976656 90243077 90410084 90466011 90419662
2590.3 90419662 90287727 90086979 89847016 89600086 89371914 89195591 89107037 89128417 89261818 89475787
2610.7H9475787K40868K19274J64789J03586N0712o419p1824j28138j67888j92190
2631.1H9688557j94943j81508j63841j43063j24335j06001q2338o8867p7534r9707
2651.5H8446420j26475j47956j50878j41567j33430j22089j09434j03026q9556o3306
2671.9H7258703l7307r948K4652O0267R8091J46109K00087K56765L17782L80760M40765
2694.3H9136726M84281M94165M64236L98899L07470K08640J12730J9950n5110j01549
2714.7I1470438j24717j25914j10489q6785m8321O20M9942J00810J36900J39063J14131
2737.2I1515678P5489K7323k3722o8731j06096j30641j32656j16533r7406q4788q4507
2759.6I0773410q8692p6336n2148m2283o0720j01977j47414j81383j84101j43016q4579
$$ plain form
2610.7 89475787 89716655 89935929 90100718 90204304 90255016 90248597 90176773 90048635 89880747 89688557
2631.1 89688557 89493614 89312106 89148265 89005202 88880867 88774866 88692528 88623661 88546127 88446420
2651.5 88446420 88319945 88171989 88021111 87879544 87746114 87624025 87514591 87411565 87322009 87258703
2671.9 87258703 87221396 87211448 87236100 87296367 87394458 87540567 87740654 87997419 88315201 88695961 89136726
2694.3 89136726 89621007 90115172 90579408 90978307 91285777 91494417 91607147 91627097 91571987 91470438
2714.7 91470438 91345721 91219807 91109318 91022533 90974212 90974832 91024774 91125584 91262484 91401547 91515678
2737.2 91515678 91591167 91618490 91594768 91526037 91419941 91289300 91156644 91040111 90942705 90857917 90773410
2759.6 90773410 90684718 90608382 90556234 90513951 90453231 90351254 90203840 90022457 89838356 89695340 89610761
2782H9610761n3250o7735j11431j62137k02667k16550k15107k27577k50607k63059
2802.4H7840641k64687k58195k46668k44552k48581k42049k25258k05481j88195j73944
2822.8H5543031j58763j44387j27095r8806o7997m0096j1874L153O599K3579M9883
2845.3H4977227P3582J03969J41001J71619J81502J50466P1955k4980j06603j61559
2865.7H5578179j82932j65159j27858j05667j01059q7470o3801n0366m3476k3257J1515
2888.1H4638649M6289P7844J04457J15693J18100J23555J20407J03021Q3548N9753
2908.5H5591316L6389L0023K9957K5249K6947L8320N3143O2251O2382M1855j4407p3224
2933H5910201j02246j16235j24877j19430j06740j05870j11091r6470o8367o5934q1015
$$ plain form
2782 89610761 89557511 89489776 89378345 89216208 89013541 88796991 88581884 88354307 88103700 87840641
2802.4 87840641 87575954 87317759 87071091 86826539 86577958 86335909 86110651 85905170 85716975 85543031
2822.8 85543031 85384268 85239881 85112786 85013980 84945983 84905887 84894013 84897166 84903765 84927344 84977227
2845.3 84977227 85050809 85154778 85295779 85467398 85648900 85799366 85871321 85846341 85739738 85578179
2865.7 85578179 85395247 85230088 85102230 84996563 84895504 84808034 84744233 84693867 84650391 84627134 84638649
2888.1 84638649 84684938 84762782 84867239 84982932 85101032 85224587 85344994 85448015 85531563 85591316
2908.5 85591316 85627705 85657728 85687685 85712934 85739881 85778201 85831344 85893595 85955977 85997832 85983425 85910201
2933 85910201 85807955 85691720 85566843 85447413 85340673 85234803 85123712 85027242 84958875 84892941 84811926
2955.4H4811926p9358p0089p1114q0240q0424o3628m4835l3909l6830n9801p9698q0221
2979.9H4031779p5907o8563o3718p6311r4706j13505j36173j42634j39832j38152j25039
3002.3H2857239j13940j05584p9637l7849j1212k1201l9024m0221l5912k5588j7792
3024.7H2329279k5540k5797j4305q792j79M7612J30242J67585J26213N3072r764n5241
3049.2H2714385j13887j90753k68232l60215m22829l73388k43419j83302k93571m18097
3069.6G9846692k37322L23338Q89402J027310P67738M55767K65574J57833R4307O5398
3090H3656037O7550J10888J70911K01863J81985J34182J13052J30963J45662J38825
3110.4H5051918J47033J71965J68300J36816J01364P7081Q1920J06132J20718J11210
$$ plain form
2955.4 84811926 84732568 84662479 84591365 84511125 84430701 84367073 84322238 84288329 84251499 84191698 84112000 84031779
2979.9 84031779 83955872 83887309 83823591 83747280 83652574 83539069 83402896 83260262 83120430 82982278 82857239
3002.3 82857239 82743299 82637715 82558078 82520229 82509017 82487816 82448792 82408571 82372659 82347071 82329279
3024.7 82329279 82303739 82277942 82263637 82254845 82254666 82302278 82432520 82600105 82726318 82779390 82769626 82714385
3049.2 82714385 82600498 82409745 82141513 81781298 81358469 80985081 80741662 80558360 80264789 79846692
3069.6 79846692 79609370 79932708 80822110 81849420 82617158 83072925 83338499 83496332 83590639 83656037
3090 83656037 83723587 83834475 84005386 84207249 84389234 84523416 84636468 84767431 84913093 85051918
3110.4 85051918 85198951 85370916 85539216 85676032 85777396 85854477 85936397 86042529 86163247 86274457
3130.8H6274457R3967R5695J08337J00643P1400N5617O3277P5709R1917J03736Q5526
3153.2H7220281N3937M4959N1183N1546M5705M8256O5589Q5526R5761Q9300P3492O5792
3177.7H7991327O6483O7145O9898P7111Q7428R6315R4765Q4055P7355P6544P4387P5376
3202.2H8938189Q3768R1565R2512Q7714P9018P2253O7073O0707N9629O0093N5653N0354
3226.7H9798528N0229O3765O8962L9596J3685K0671L4481M1866N0462N0831L8176L2145
3251.1I0303397L9691M7713M3804L2186K8146L6233M8375O0320O5768M6057J6331M268
3275.6I0772289K980N722R555J0008R894J4621K2787J8304j078k1404l4196l1316j5008
3302.1I0763158r615l2389o6685q8442r1541q4239q2934q9878r5337r5624r5838j07003
$$ plain form
3130.8 86274457 86368424 86464119 86572456 86673099 86744499 86800116 86863393 86939102 87031019 87134755 87220281
3153.2 87220281 87274218 87319177 87370360 87421906 87467611 87515867 87581456 87666982 87762743 87852043 87925535 87991327
3177.7 87991327 88057810 88124955 88194853 88271964 88359392 88455707 88550472 88634527 88711882 88788426 88862813 88938189
3202.2 88938189 89021957 89113522 89206034 89293748 89372766 89445019 89512092 89572799 89632428 89692521 89748174 89798528
3226.7 89798528 89848757 89912522 89981484 90021080 90034765 90055436 90089917 90131783 90182245 90233076 90271252 90303397
3251.1 90303397 90343088 90390801 90434605 90466791 90494937 90531170 90579545 90639865 90705633 90751690 90768021 90772289
3275.6 90772289 90775269 90780991 90790546 90800554 90810448 90825069 90847856 90866160 90865082 90843678 90809482 90778166 90763158
3302.1 90763158 90753543 90721154 90654469 90566027 90474486 90390247 90307313 90217435 90122098 90026474 89930636 89823633
3326.6H9823633j20186j24145j29861j33907j30946j40744j61201j72049j79797j87457
3347H8343340j89656j98156k12264k16925k15316k20268k32631k45589k53869k55286
3367.4H6103380k51729k46334k41750k40338k36768k28792k20561k06584j89972j81436
3387.8H3859116j78200j71548j59949j50395j44851j39618j34355j28251j19340j09673
3408.2H2422936j03778j01387r7406r3073r0688q1915o1357m4960l8457k5528j1021
3430.6H1673366M35J2392J5825J2243J6981L3057N0747O6161P5406P8929Q1288Q4126
3455.1H2200956R3836J06442J06698J12075J35302J46455J21349Q4692Q7154J17111
3475.5H3312070J32597J21707J05214J17576J35737J30666J24657J30725J43397J51592
$$ plain form
3326.6 89823633 89703447 89579302 89449441 89315534 89184588 89043844 88882643 88710594 88530797 88343340
3347 88343340 88153684 87955528 87743264 87526339 87311023 87090755 86858124 86612535 86358666 86103380
3367.4 86103380 85851651 85605317 85363567 85123229 84886461 84657669 84437108 84230524 84040552 83859116
3387.8 83859116 83680916 83509368 83349419 83199024 83054173 82914555 82780200 82651949 82532609 82422936
3408.2 82422936 82319158 82217771 82120365 82027292 81936604 81854689 81793332 81748372 81709915 81684387 81673366
3430.6 81673366 81673801 81686193 81702018 81714261 81731242 81764299 81815046 81881207 81956613 82035542 82116830 82200956
3455.1 82200956 82294792 82401234 82507932 82620007 82755309 82901764 83023113 83107805 83194959 83312070
3475.5 83312070 83444667 83566374 83671588 83789164 83924901 84055567 84180224 84310949 84454346 84605938
3495.9H4605938J40125J28948J38146J46443J38056J38867J68383J95390J87105J64741
3516.3H6152142J58871J67340J78080J73128J62190J78349K04933K11179K09648K05838
3536.7H8001698J92231J84441J82748J75714J70535J73789J79822J89268J95038J90485
3557.1H9835769J88714J79041J36333J13726K02686L01158K72536K20031K16335K29597
3577.5I1895926K46048K46042K01601J62846K17682K92074K66880K33799K52760K70098
3597.9I4285756K64323K55191K25395J76102J77747K16711K21932K15828J91671J92928
3618.3I6423584K62934K57629J42986L4922R0438K61373K53302J81591J50591J19448
3638.7I8178798R6238O0969k5552r2829J4466K06888J92154R9074J09739J31434P8010
$$ plain form
3495.9 84605938 84746063 84875011 85013157 85159600 85297656 85436523 85604906 85800296 85987401 86152142
3516.3 86152142 86311013 86478353 86656433 86829561 86991751 87170100 87375033 87586212 87795860 88001698
3536.7 88001698 88193929 88378370 88561118 88736832 88907367 89081156 89260978 89450246 89645284 89835769
3557.1 89835769 90024483 90203524 90339857 90453583 90656269 90957427 91229963 91449994 91666329 91895926
3577.5 91895926 92141974 92388016 92589617 92752463 92970145 93262219 93529099 93762898 94015658 94285756
3597.9 94285756 94550079 94805270 95030665 95206767 95384514 95601225 95823157 96038985 96230656 96423584
3618.3 96423584 96686518 96944147 97087133 97122055 97212493 97473866 97727168 97908759 98059350 98178798
3638.7 98178798 98275036 98336005 98310453 98217624 98232090 98438978 98631132 98730206 98839945 98971379 99049389
3661.1I9049389K6542j3220p4738p5221k414k8646j9807J24013J56177J02984M7637
3683.5I9292696j1945k6584M8548J40864J48523Q9490J7875k2834L487M2462l713q1456
3708I9637413p8011M0997J15180N8561j7136n2655m5580o234M0894L0548n1218j09148
3732.5I9563611m1736J04899J23214j7565j33085p1139J9175k4611J5945J36018J07616
3754.9I9782342K2590J8567N3405K5863j5307j9890N550N3489N3477N42l2716j4401
3779.4I9933511J1325O312J0699K3270J4883r131n2673p2712o9189p2718o961O0552
3803.9I9777168M0650O2561O8284j5772q8793p3689m8697m0037O4636J06233L9089
3826.3I9891633o581l8522n4389n4944n7131j2195N3716P8952Q0317L1573q1080j98293
$$ plain form
3661.1 99049389 99075931 99062711 98987973 98912752 98910338 98881692 98861885 98985898 99142075 99245059 99292696
3683.5 99292696 99280751 99254167 99302715 99443579 99592102 99681592 99699467 99676633 99680120 99722582 99718869 99637413
3708 99637413 99559402 99600399 99715579 99774140 99757004 99704349 99658769 99652535 99693429 99723977 99672759 99563611
3732.5 99563611 99521875 99626774 99749988 99732423 99599338 99528199 99547374 99522763 99538708 99674726 99782342
3754.9 99782342 99804932 99823499 99876904 99902767 99887460 99867570 99873120 99926609 99980086 99980628 99947912 99933511
3779.4 99933511 99944836 99951148 99961847 99985117 100000000 99990869 99938196 99865484 99796295 99723577 99716616 99777168
3803.9 99777168 99817818 99880379 99948663 99932891 99844098 99770409 99721712 99681675 99746311 99852544 99891633
3826.3 99891633 99885052 99846530 99792141 99737197 99680066 99667871 99721587 99800539 99880856 99912429 99831349 99633056
3850.8I9633056j50949J18500J75524N1409l0553m2844j2785j9211k6345L5399P2056
3873.2I9803257N8311oo1273l2622Q220K6166L7527j019l100L7331M935o7347q5002
3899.7I9725378l9709L6490J06513R9606L7074j2976m0341m2915o038L1644J8090m297
3924.2I9908519L969l677j4895J8692M6193K3270j2368l0214j4549J0598K729k777
3948.7I9935490J7053K7537J9920P701J812P284R584l517j0800j490O866R716M268
3975.2A00031424r513j0133P045J8919P832j3066j8453r644l338k03J049
3997.6A00001919
$$ plain form
3850.8 99633056 99482107 99600607 99776131 99827540 99796987 99754143 99741358 99722147 99695802 99731201 99803257
3873.2 99803257 99861568 99861562 99800289 99767667 99775887 99802053 99839580 99838561 99835461 99872792 99877727 99810380 99725378
3899.7 99725378 99685669 99722159 99828672 99928278 99965352 99952376 99912035 99869120 99863082 99894726 99912816 99908519
3924.2 99908519 99912488 99908811 99893916 99912608 99958801 99982071 99969703 99939489 99924940 99935538 99938267 99935490
3948.7 99935490 99952543 99980080 100000000 100007701 100009513 100016797 100026381 100022864 100012064 100010574 100017440 100027156 100031424
3975.2 100031424 100021911 100011778 100018823 100037742 100045574 100032508 100014055 100004411 100001073 100000870 100001919
3997.6 100001919
##END=$$ End of the data block
