##TITLE=KClA $$ Begin of the data block
##JCAMP-DX=5.00 $$ ACD/SpecManager v 10.08
##SPECTROMETER/DATA SYSTEM=Alpha
##DATE=05 Nov 2013 10:22:34
##DATA TYPE=INFRARED SPECTRUM
##DATA CLASS=XYDATA
##ORIGIN=
##OWNER=
##NPOINTS=1765
##FIRSTX=399.75695801
##LASTX=3997.56933594
##MAXX=3997.56933594
##MINX=399.75695801
##MAXY=0.84055150
##MINY=0.20374513
##XFACTOR=1.0000000000
##YFACTOR=1.000000000000000e-9
##FIRSTY=0.82866907
##DELTAX=2.03957629
##XUNITS=1/CM
##YUNITS=ARBITRARY UNITS
##XYDATA=(X++(Y..Y))
399.8H28669071l267944j592576q17359j204371j122594k28703O70195O96241r82761
418.1H20819199l009021k529025k274990m602194p555545r659349j0677875j0921895
434.4G69589305j3323128j9010365k4856210j7709732J4414906M3013096L8818002
448.7G90935874J9606233P405579K316355O28353M32789O59823J80424q42691j168132
467.1H20154607k52783L45588q94487k289713j764893q76427j536131l205240m729688
485.4H04950833o089747r386539j7149985k9830217m8349798o4300716l7111759L9079666
501.7F31811738Q3172560O0605049K7484059J0871947M031897J798153J578927J173734
518.1H22528064j77681j244426j204073r11057j542867k833902m143835n711734p235706
$$ y = [828669071, 825401127, 823808551, 822991192, 821786821, 820664227, 820435524, 821105719, 821801960, 820819199, 817810178, 815281153, 813006163, 808403969, 800848424, 791189075, 780511200, 769589305, 756266177, 737255812, 712399602, 694689870, 709104776, 752117872, 790935874, 810542107, 817947686, 820264041, 820892394, 821325183, 821985006, 822165430, 821322739, 820154607, 819901824, 820247412, 819352925, 817063212, 815298319, 814421892, 812885761, 809680521, 804950833, 798861086, 789474547, 772324562, 742494345, 694144547, 629843831, 592732072, 631811738, 714984298, 775589347, 803073406, 813945353, 817977250, 819775403, 821354330, 822528064, 822350383, 821105957, 819901884, 818990827, 817447960, 814614058, 810470223, 804758489, 797522783]
536.4G97522783n446672R83178O717325P312715M620075J877308L22521j30773j17421
554.8H13661039j76251l51310n58853m50551p2241j37985r43005j826048k361178l475905
575.2H03307712o537020j2675285k4218381l2212555j0865689K8616071L9214790K1730244
591.5H06359887P681489K851427R92477J8119k8312M01855K45929m38154p09415k52843
611.9H17122459K24531Q106q55207j389682k183855l598034j245737M716515O528735
630.2H19327831L722728J175224j17540l01421L48568P59125L84986m9769M4584J55091
650.6H25449407n61774k319872m969060q503914j0531247n957782L951728J3652384
666.9H10209870J5338838M814148L95954J38402J16050K84791J42157k82943m83036
$$ y = [797522783, 792076111, 793059289, 799776614, 807089329, 811709404, 813586712, 813909233, 813778460, 813661039, 813484788, 813133478, 812574625, 812124074, 812051833, 811913848, 810970843, 809144795, 806783617, 803307712, 796770692, 784095407, 759877026, 727664471, 716798782, 745414853, 784629643, 806359887, 814041376, 816892803, 817885280, 817903399, 817875087, 818276942, 818522871, 818084717, 817375302, 817122459, 817346990, 817355096, 816499889, 815110207, 812926352, 809328318, 808082581, 812799096, 819327831, 823050559, 824225783, 824108243, 823806822, 824155390, 824914515, 825299501, 825249732, 825294316, 825449407, 824887633, 822567761, 817598701, 809094787, 798563540, 792605758, 796557486, 810209870, 825548708, 830362856, 830758810, 830897212, 831013262, 831298053, 831440210, 831157267, 830674231]
685.3H30674231k65717j84358o82234j351238j575529j642764k521098m636049q340776
703.7H09474468j7238617l0057788k0868897J6952515L6989271K3291052P747113J925171
720H28214288l30746j063288r51588r53913j446008k072037k435922k536416l184855
738.3H13239515m096925m227519m240871o158650j0049999j4514207j5816987j3131857
754.6G41002500j8728971l9968849m7088861n154371N1814913O4351261M0509045J8448711
771H05185378P614851K433955p65443k890527l766835l916561m479468o340802r879410
789.3G83195138j5709996k4444640l2763243k7017355K129972L3147037L7428916K0438850
805.6G76404679M900217q1897O5327k227843p266521j1669994j5198469k0887852l1104803
$$ y = [830674231, 830408514, 830224156, 829541922, 828190684, 826615155, 824972391, 822451293, 817815244, 809474468, 792235851, 762178063, 741309166, 758261681, 795250952, 818542004, 826289117, 828214288, 827883542, 826820254, 825868666, 824914753, 823468745, 821396708, 818960786, 816424370, 813239515, 809142590, 804915071, 800674200, 794515550, 784465551, 769951344, 754134357, 741002500, 722273529, 682304680, 635215819, 630061448, 681876361, 746227622, 786736667, 805185378, 812800229, 815234184, 814468741, 811578214, 807811379, 803894818, 799415350, 793074548, 783195138, 767485142, 743040502, 710277259, 683259904, 685389876, 718536913, 755965829, 776404679, 781304896, 781222999, 781288326, 779060483, 771793962, 760123968, 744925499, 724037647, 692932844]
824F92932844m5001745n7886243o4031005m6610176J3640642Q1156075R6503973O7892849
840.3G38597214L7995637J9889831Q832455J258612m145623p101833n296112K165318
856.6G92195499R531498J0576188O905795L299594J378476O28293L46303J59442p3969
875H24947119k95818m96984j083493k172053l380477m298687n086601o485045r570718
893.3G92077243j4792502j8938660j1971474R997904K8368295K6376783J3851345N314946
909.6H30283880J942039N27382j56761l77655n12659r03309j353502j571238j549244
928H26328933j680910k077043k376855k137422j525522j082956r86219j062274j300454
946.4H12099278k352953m989147p637263m591286K973616N191207J260400k438426
$$ y = [692932844, 647931099, 590044856, 526013851, 479403675, 493044317, 574200392, 670704365, 738597214, 776592851, 796482682, 805315137, 806573749, 802428126, 795326293, 790030181, 792195499, 801726997, 812303185, 819208980, 822508574, 823887050, 824515343, 824861646, 825021088, 824947119, 824651301, 824154317, 823070824, 820898771, 817518294, 813219607, 808133006, 801647961, 792077243, 777284741, 758346081, 746374607, 756372511, 784740806, 811117589, 824968934, 830283880, 832225919, 832753301, 832596540, 832218885, 831706226, 830802917, 829449415, 827878177, 826328933, 824648023, 822570980, 820194125, 818056703, 816531181, 815448225, 814462006, 813399732, 812099278, 809746325, 804757178, 797119915, 792528629, 795502245, 800693452, 801953852, 799515426]
962.7G99515426m751324m584194r69767K31445l997624j0588587k0831763l4915627
979G19107985l1275033O220400L9065242L2025218R805262j888693n866468q267939
995.3G58925974j0906934j3476611j5406489j8055618k6429355m5835614o4917743
1009.6E63897610l5426081L9926827O4673782K2262156o449044M412532K7188003L8343668
1025.9G18829453L3214509K1530688J1716366N496562J766502k04443j081706j407921
1042.2G89860010j813531k300262k679050k817393k981305l552735m549205n872369
1058.5G63294160p566034r596348j0886550j1919558j5372098k2514939l2887876m6009719
1074.8F06541038n6994319n1962316k0758450J5645980K4045051J5222430J8141389
$$ y = [799515426, 794764102, 790179908, 789210141, 789441586, 785443962, 774855375, 754023612, 719107985, 687832952, 694053352, 733118594, 765143812, 774949074, 773060381, 767193913, 758925974, 748019040, 734542429, 719135940, 701080322, 674650967, 628815353, 563897610, 528471529, 568398356, 633072138, 655334294, 648885250, 653297782, 680485785, 718829453, 752043962, 773574650, 785291016, 790787578, 792554080, 792349637, 791267931, 789860010, 788046479, 785746217, 783067167, 780249774, 777268469, 773715734, 769166529, 763294160, 755728126, 746131778, 735245228, 723325670, 707953572, 685438633, 652550757, 606541038, 549546719, 497584403, 476825953, 492471933, 516516984, 531739414, 549880803]
1089.1E49880803K2809505J6424775J6299427K7030766K8629362J4160991l059745
1103.4F72175884j2657702j4760673r159505O761074K5020182K9167354J9088745J1049390
1119.7G26684749J1004150J2521207J3231635J3316393J0439217N565227J874685M0233
1136G94677496q13127j531899k445042l347218l980219m493892n212784o202817p118404
1154.4G59532094p489502o700576m370749j603246o45875k175808m455150n454003
1170.7G26637185n169869n639672q092880j2403906j8259227k4906218k9480815k6224315
1187E96460283j4483869p321835j7460763l6853791m5923799l4364164j0065496O145597
1203.3D36132163N876064O231725K3422420M9358338O8159521P1915090N7369471L2598495
$$ y = [549880803, 572690308, 589115083, 605414510, 632445276, 661074638, 675235629, 672175884, 659518182, 644757509, 635598004, 642359078, 667379260, 696546614, 715635359, 726684749, 737688899, 750210106, 763441741, 776758134, 787197351, 792762578, 794637263, 794677496, 793864369, 792332470, 789887428, 786540210, 782559991, 778066099, 772853315, 766650498, 759532094, 752042592, 745342016, 740971267, 739368021, 738722146, 736546338, 732091188, 726637185, 721467316, 715827644, 707734764, 695330858, 677071631, 652165413, 622684598, 596460283, 581976414, 574654579, 557193816, 520340025, 474416226, 440052062, 429986566, 436132163, 442008227, 448239952, 471662372, 521020710, 589180231, 661095321, 718464792, 751063287]
1219.7G51063287J2117327N40733n171895q276403j0517657j2534618j3952196j3481438
1236F99787140j0818362q753538r938598j3418079j7759621k3318946l0855239l9678752
1252.3E45246005m8218042n3599745n0551980l7028551j8915862l198386O000281N777418
1268.6C45511138K10643n58257R793312K8244793M3772787M3223560K3615896k682
1284.9D93811190p951289K495378K0855963L8911641M8697650M6573639L8405359L0194998
1301.2G11994529K1556675O262481k0757436l3746362j428485L8244307L9594829K3319960
1317.6G85040498J3064146O994247K543748L22222J641214M510820N334199M563510
1333.9H24014604M200399L433704J459062p21335j765013j604855j101970j468182
$$ y = [751063287, 763180614, 763721347, 758549452, 750273049, 739755392, 727220774, 713268578, 699787140, 688968778, 680215240, 670276642, 656858563, 639098942, 615779996, 584924757, 545246005, 497027963, 443428218, 392876238, 355847687, 336931825, 333733439, 339733720, 345511138, 345721781, 345163524, 354956836, 383201629, 426974416, 470197976, 493813872, 493811190, 485859901, 488355279, 509211242, 548122883, 596820533, 643394172, 681799531, 711994529, 733551204, 739813685, 719056249, 685309887, 683881402, 722125709, 761720538, 785040498, 798104644, 805098891, 807642639, 807964861, 809606075, 814116895, 819451094, 824014604, 828215003, 831648707, 833107769, 832386434, 830621421, 829016566, 827914596, 826446414]
1350.2H26446414l303707o760955j2549996k1329939l3970535m1826606k2927582J2105048
1366.5F95882142K7882933K2600591J7400623J6054153J1287451M732907k009869q884430
1382.8G84946501j1375487o512224J470923N557954N741418L798187L17335l400743
1399.1G80543864p377208j3631701k5321484l7931144l6834776j2466192K1428167
1413.4F68409526M2760134M7631443L6469996J6754388N975724J991868l22283j798153
1429.7H17872643k885937l383875n335510r790838j3290047j7199219j9280314j2510002
1446G34196901P11203Q638024R718776J1061013J2124955O407261j893222n277097
1462.4G75687814q568347j2643695j5715241j8310309j3237118K564251P935345K580405
$$ y = [826446414, 823142707, 816381752, 803831756, 782501817, 748531282, 706704676, 683777094, 695882142, 723765075, 746365666, 763766289, 779820442, 791107893, 795840800, 793830931, 784946501, 773571014, 767058790, 768529713, 774087667, 779829085, 783627272, 783944607, 780543864, 773166656, 759534955, 734213471, 696282327, 659447551, 646981359, 668409526, 711169660, 758801103, 795271099, 812025487, 818001211, 819993079, 819670796, 817872643, 814986706, 811602831, 806267321, 796476483, 783186436, 765987217, 746706903, 734196901, 734908104, 743546128, 753264904, 764325917, 776450872, 782858133, 780964911, 775687814, 767119467, 754475772, 738760531, 720450222, 707213104, 709777355, 717712700, 720293105]
1478.7G20293105p83623n529105j8868566m4091105q1082166q5408628j1486560Q1577093
1495E54620445J22270465Q5744023L8102925J7069936R956598M639447j534105l425598
1511.3H27444136l533661m157961n187511m137337n80311K463043K966582J720250
1527.6H16997230M05908j02938j677453k644479j412392j655996n245864p289648p427872
1546G89946496p465600q409381p904649m975259l830135j2611986k8858244k7183175
1562.3F88708067j3491750J1696935L3809245K7219653L712177j1693060k4725736
1576.6G15235531l1648874l4688055m5297802o1495185o7696631l7859320K6386261
1590.9D62935925P3666632O6757559L0312062L214597q714437j7673850k9321134m1303098
$$ y = [720293105, 719509482, 713980377, 695111811, 651020706, 569938540, 484529912, 473043352, 554620445, 676890910, 762634933, 800737858, 817807794, 827764392, 832403839, 830869734, 827444136, 823910475, 819752514, 814565003, 810427666, 809847355, 812310398, 815276980, 816997230, 817403138, 817300200, 815622747, 812978268, 811565876, 809909880, 804664016, 797374368, 789946496, 782480896, 774071515, 766166866, 761191607, 757361472, 744749486, 715891242, 688708067, 675216317, 686913252, 720722497, 747942150, 751654327, 739961267, 715235531, 683586657, 648898602, 603600800, 542105615, 474408984, 436549664, 462935925, 536602557, 603360116, 633672178, 636886775, 628172338, 610498488, 581177354, 539874256]
1607.2E39874256m6496928l4316331k977550M0170282P5551212O7114234M6129465
1621.4F85048640L4930229K2012472J1718452O465614L964245L645599L213048R47058
1637.8G71945357J85013R56774J955390K155781M01795n95808o25790l485441n102157
1656.1G67790914k710224J628280O490827P049024M044592J564443j164138l436685
1672.4G81257033n723893q729875r982765r895623j0367215j0919153q356452p885516
1688.8G09396541j0943591j2071968j3586580j6023040j7918945k2448658k0968915
1703E95434844k0585536k5526405k8493106l0349583l2891333m1860789o3902587p3497563
1719.3B78327942n2588135k1994680J3262659M2838037N8070839O2552601O8996608
$$ y = [539874256, 493377328, 459060997, 456083447, 496253729, 571804941, 638919175, 685048640, 719978869, 741991341, 753709793, 760175407, 764139652, 767785251, 770998299, 771945357, 772130370, 773087144, 775042534, 777198315, 777600110, 777004302, 776378512, 772893071, 767790914, 765080690, 766708970, 773199797, 780248821, 784293413, 785857856, 784693718, 781257033, 775533140, 766803265, 756820500, 746924877, 736557662, 725638509, 717282057, 709396541, 698452950, 686380982, 672794402, 656771362, 638852417, 616403759, 595434844, 574849308, 549322903, 520829797, 490480214, 457588881, 415728092, 351825505, 278327942, 225739807, 203745127, 217007786, 259845823, 317916662, 380469263, 449465871]
1733.6D49465871O2812328M2465568L5869956L3073425K7464151K3032487J8661141
1747.9F92844927J5278101J2599647J1014998J2076140J3828754J4260292J3963282
1762.2G85866141J1127234P982492O310761M778803L055274J016617J1802P8976K11954
1780.5H20440054J90437M79400Q04722P86722K81751l59714M7922Q14378P64430K91765
1800.9H24541867N5671L4272K46108N92589O67632M38213M77672Q61168J315713J718342
1821.3H30949247J801073J438678J142263J096189N88179J68621L23058N65588Q32915
1839.7H38905811J055122N90563m06862m68015L8862J25110j22190j69575L5286M1783
1860.1H39625895k63512l78788P749J41621n71907j146436r05156l26335Q1002L5882
$$ y = [449465871, 512278199, 554743767, 590613723, 623687148, 651151299, 674183786, 692844927, 708123028, 720722675, 731737673, 743813813, 757642567, 771902859, 785866141, 796993375, 804975867, 811286628, 816065431, 819120705, 820137322, 820149124, 820228100, 820440054, 820630491, 821109891, 821914613, 822701335, 822983086, 822623372, 822671294, 823485672, 824250102, 824541867, 824597538, 824631810, 824877918, 825470507, 826138139, 826576352, 827054024, 827915192, 829230905, 830949247, 832750320, 834188998, 835331261, 836427450, 837015629, 837184250, 837507308, 838072896, 838905811, 839960933, 840551496, 840144634, 839676619, 839715481, 839840591, 839718401, 839548826, 839584112, 839625895, 839362383, 838983595, 838991344, 839132965, 838561058, 837414622, 836509466, 836183131, 836264133, 836300015]
1880.5H36300015k48730k50935J58131L60310j96278p94709q92699r05871j134455
1898.8H32394779j497984j589477j115918p32184j581490l859103o603777q460820
1915.1H06954026o716013R88126Q692145R309650N199373J965582P22945L56912L28660
1933.5H27801406M26293M34398J53900l46721r08434j231551j296342j370787j707375
1951.9H21954787k458632l106535k072334J112521L897965M155039K752066J154065
1968.2H27388942J44422m1425J35958J50264o8784j89126m1306J12653M3809j90973
1988.6H27444434l59058l40820j68442m4823q6069p2479J05798K00510K7001k45631
2009H26460421l04937j03534j0788l22521p50243p20442j19567M02153K25663j87635
$$ y = [836300015, 836051285, 835800350, 835958481, 836318791, 836122513, 835327804, 834435105, 833529234, 832394779, 830896795, 829307318, 828191400, 827459216, 825877726, 822018623, 815414846, 806954026, 800238013, 801226139, 809918284, 819227934, 824427307, 826392889, 827115834, 827472746, 827801406, 828227699, 828662097, 828815997, 828469276, 827560842, 826329291, 825032949, 823662162, 821954787, 819496155, 816389620, 814317286, 815429807, 819327772, 823482811, 826234877, 827388942, 827533364, 827491939, 827627897, 827778161, 827709377, 827520251, 827478945, 827591598, 827635407, 827444434, 827085376, 826744556, 826576114, 826531291, 826445222, 826372743, 826478541, 826679051, 826706052, 826460421, 826155484, 826051950, 826041162, 825718641, 824968398, 824247956, 824128389, 824530542, 824756205, 824568570]
2029.4H24568570j33098J45197Q4818k59698l96490k00033n3465k31326n19752n31555
2049.8H22473168k53081r9778k66612m20332k73168L6001J07944j65462l23594p5042
2070.2H20740044J81437K3663l50237m41551j92523l7313k06113l77297j88470J74344
2090.5H19325984K18272j46449m36067k96414m7088j77979o12736q37505o43671l79145
2110.9H15967202l59297l91841j41143K74360M06384J20759j83344p7307L00169M15802
2131.3H16331744J33395q6188O6459K91407J71304j86860l20793j21772K4140j69575
2151.7H16133261m44591m02272j04606j5855l24667o25073n32568k54333k07365l08096
2172.1H12913835j54197K27570L68059K9981m57763n96166l64721j83880l20971o18100
$$ y = [824568570, 824435472, 824580669, 824665487, 824405789, 824009299, 823809266, 823755801, 823524475, 823004723, 822473168, 822220087, 822120309, 821853697, 821433365, 821160197, 821196198, 821304142, 821138680, 820815086, 820740044, 820921481, 820945144, 820594907, 820153356, 819960833, 819923520, 819717407, 819340110, 819151640, 819325984, 819544256, 819397807, 818961740, 818665326, 818618238, 818440259, 817827523, 816990018, 816346347, 815967202, 815607905, 815216064, 815074921, 815349281, 815755665, 815876424, 815693080, 815615773, 815915942, 816331744, 816465139, 816378951, 816445410, 816736817, 816908121, 816721261, 816400468, 816278696, 816302836, 816133261, 815688670, 815286398, 815181792, 815165937, 814841270, 814216197, 813683629, 813429296, 813221931, 812913835, 812759638, 812987208, 813355267, 813385248, 812927485, 812331319, 811966598, 811782718, 811461747, 810843647]
2192.5H10843647p71046p03156o04987p34985j124025j600682k174557k946496l809392
2210.9G96374321n027413p728458j3716101k4051846l3295929k6158035L162325L2220363
2227.2G21779227L8204611K6871264J4398753O964922L411174J621604O11961J39177
2243.5H14002693p0751l32296o30975p20024m70102j48356j12176l08811l68416j32978
2263.9H10707808P5280m4107k68102k00629J25646L08276J43230j36197j87695K1696
2284.3H10545206J63674O4016o8426j9312J37031J25468n7102l7193K88248N47111
2304.7H11688721M44949Q1479k23636k41101J77979R38416J547158J694083J466751
2323.1H17574799J033843O57439N02705L70741J49310k7895j20401m4406M17o45101
$$ y = [810843647, 810072601, 809369445, 808764458, 808029473, 806905448, 805304766, 803130209, 800183713, 796374321, 791346908, 783618450, 769902349, 745850503, 712554574, 686396539, 689558864, 721779227, 759983838, 786855102, 801253855, 808218777, 811629951, 813251555, 813863516, 814002693, 813931942, 813599646, 812968671, 812248647, 811778545, 811630189, 811518013, 811209202, 810840786, 810707808, 810783088, 810738981, 810470879, 810270250, 810395896, 810704172, 810847402, 810711205, 810523510, 810545206, 810708880, 810772896, 810704470, 810685158, 810822189, 810947657, 810890555, 810853362, 811141610, 811688721, 812133670, 812215149, 811991513, 811750412, 811928391, 812866807, 814413965, 816108048, 817574799, 818608642, 819266081, 819768786, 820139527, 820288837, 820260942, 820140541, 820096135, 820096552, 819451451]
2343.5H19451451j923918k011300l96311J524389K600253K409637J496076M32611l31164
2361.8H23251724r08494j622140k228975k416194k434194k586603k745986k584219
2378.1H05724919k095938j602530j307190j090407o95884j26243K73287L27766K35677
2396.5G99643457K08378K52187K46346J62363J13368J89424L10242K79307P3850j28626
2416.9H01350296j43946M0174J82569Q7619j06156j87040k36570l16441k56539p1406
2437.3H00342560K0087p3076k55108m00543m36604l86000l88741n14030o43731o28233
2457.7G96636581m92572l72231k70903r8348Q1122Q9466j05798l16322l62456l09050
2478.1G94479489l23593l87907l64602k03848J192R6858N7578K1458J06275K37345
$$ y = [819451451, 817527533, 815516233, 815119922, 816644311, 819244564, 821654201, 823150277, 823582888, 823251724, 822343230, 820721090, 818492115, 816075921, 813641727, 811055124, 808309138, 805724919, 803628981, 802026451, 800719261, 799628854, 798932970, 798806727, 799080014, 799407780, 799643457, 799851835, 800104022, 800350368, 800512731, 800626099, 800815523, 801125765, 801405072, 801478922, 801350296, 801206350, 801246524, 801429093, 801516712, 801410556, 801223516, 800986946, 800670505, 800413966, 800342560, 800362647, 800289571, 800034463, 799633920, 799197316, 798811316, 798422575, 797908545, 797264814, 796636581, 796144009, 795771778, 795500875, 795402527, 795483649, 795573115, 795467317, 795150995, 794788539, 794479489, 794155896, 793767989, 793403387, 793199539, 793200731, 793297589, 793355167, 793376625, 793482900, 793720245]
2498.5G93720245K22206R3878N0545O1869L2962l4273j24991j35779m0949J9312k2232
2520.9G93842793o0082L457J17004J52648P2479j4067j8656J3411j2875r6559j56820
2543.3G93842733j33574o8843p9632j87636k87831l50177m62353o52432q51334r93192
2563.7G89775729j044273r45747o92427l78669o3002K81096O66141R03547Q10802N11885
2584.1G89825082J62661k50042p07745j054466j098752p64370j14322N44787P67112
2602.5G87309945N55873K85983J51574J26720J38104J76429K45691K57313J24693p8619
2622.9G89293706j91748j99914k23696k53856j90318j19328j53423k35915k73645k09570
2643.3G87242293j13129j03355j60157j85788j42276q2136q3923j48415j86503j88291
$$ y = [793720245, 793942451, 794036329, 794086874, 794148743, 794181705, 794147432, 794022441, 793886662, 793845713, 793865025, 793842793, 793782711, 793786168, 793903172, 794055820, 794128299, 794114232, 794095576, 794108987, 794096112, 793999553, 793842733, 793709159, 793640316, 793560684, 793373048, 793085217, 792735040, 792272687, 791620255, 790768921, 789775729, 788731456, 787785709, 787093282, 786714613, 786651611, 786932707, 787598848, 788502395, 789313197, 789825082, 789987743, 789737701, 789029956, 787975490, 786876738, 786112368, 785998046, 786542833, 787309945, 787865818, 788151801, 788303375, 788430095, 788568199, 788744628, 788990319, 789247632, 789372325, 789293706, 789101958, 788902044, 788678348, 788424492, 788234174, 788114846, 787961423, 787725508, 787451863, 787242293, 787129164, 787025809, 786865652, 786679864, 786537588, 786455452, 786371529, 786223114, 786036611, 785848320]
2663.7G85848320k43545l49999l97384l84628m29512m92870l58940J3233L23355L20911
2684.1G83848941R0003j57118k68757k62618k37048j89900j44541j06633k1696N245
2704.5G82555878j08480k09451k23458k75910m02152m94123l93569j08421R2804P8798
2724.8G80511916o2704k38359l55900m08888m17053l34561j68920k9087l8862j59502
2745.2G78298080l06129m65394n46276n18263n07593n74648o21080n60999m34935l42489
2765.6G73420274l40700m16219m52876k88487J5199K22147J87814o3002l05831k92778
2786G71685541j25826j63793m97341r07243j021683n09381J85966K71917j15812l31938
2806.4G68470407k50102j87516k52843k16663M650K32100K99811K25306J13189R418
$$ y = [785848320, 785604775, 785254776, 784857392, 784472764, 784043252, 783550382, 783191442, 783204675, 783528030, 783848941, 783938944, 783781826, 783513069, 783250451, 783013403, 782823503, 782678962, 782572329, 782550633, 782555878, 782447398, 782237947, 782014489, 781738579, 781336427, 780842304, 780448735, 780340314, 780433118, 780511916, 780449212, 780210853, 779854953, 779446065, 779029012, 778694451, 778525531, 778496444, 778457582, 778298080, 777991951, 777526557, 776980281, 776462018, 775954425, 775379777, 774758697, 774197698, 773762763, 773420274, 773079574, 772663355, 772210479, 771921992, 771937191, 772159338, 772347152, 772284150, 771978319, 771685541, 771559715, 771395922, 770898581, 769991338, 768969655, 768460274, 768646240, 768918157, 768802345, 768470407, 768220305, 768032789, 767779946, 767563283, 767567933, 767800033, 768099844, 768325150, 768438339, 768447757]
2826.8G68447757j40012m08947o94215q06153p39217p59542r49025r58264p09534n01573
2847.2G61781275m87327n81742o31868o41883o74009q07405j156747j651943k141833
2865.6G53006518k443791k109229r26137M02450J057268R57846L36469n14567j315892
2883.9G48450935k122045l080427m118383n117893o278933q228659j0744870j0483801
2900.2F98275924l620386O717205J2486457J1300445P244229L713191J210153n71549
2916.6G36755669j715600k339125k476811j918197p70331k7835o95407k683103n318106
2934.9G18811154p526219o817758j422166M827916N766332J221061m317701p212519
2951.2G03330100n553782J8715N682528P909716O704390M080593J449108q49127k903104
$$ y = [768447757, 768307745, 767898798, 767204583, 766398430, 765659213, 764899671, 763950646, 762992382, 762282848, 761781275, 761293948, 760712206, 760080338, 759438455, 758764446, 757957041, 756800294, 755148351, 753006518, 750562727, 748453498, 747527361, 747929811, 748987079, 749944925, 750281394, 749766827, 748450935, 746328890, 743248463, 739130080, 734012187, 727733254, 719504595, 708759725, 698275924, 694655538, 701372743, 713859200, 725159645, 732403874, 736117065, 737327218, 736755669, 735040069, 732700944, 730224133, 728305936, 727535605, 727507770, 726812363, 724129260, 718811154, 711284935, 704467177, 703045011, 707872927, 713639259, 714860320, 710542619, 703330100, 697776318, 697795033, 703477561, 711387277, 718091667, 722172260, 723621368, 722772241, 719869137]
2969.6G19869137m898250o886542q050025p442176o463587p948280j1810124j4357388
2985.9F52012765j2142181m993439M511118J3294637J8611789J8918634J5638589J1724830
3002.2G17576742Q590460O131768M199147K708078J351476N4895p95602j008034j000464
3020.6G37808466j271546k093792l735661o516576j0517895j4129281j3146699m457772
3036.9F81939244P660210J4242828J3023615R220362O595075N057395L713309K424121
3053.2G43876159J388192M99070m73797j714051l268242m255950l221989p23720N56767
3071.6G32662439o1631n9J866996L199100K563954J069665l40820j635074k977073
3089.9G36347497l873766k887249R0301K613545K848923J706719Q40366Q21531J260578
$$ y = [719869137, 714970887, 708084345, 700034320, 692592144, 686128557, 678180277, 666370153, 652012765, 639870584, 634877145, 639388263, 652682900, 671294689, 690213323, 705851912, 717576742, 726167202, 732298970, 736498117, 739206195, 740557671, 740612566, 739816964, 738808930, 737808466, 736536920, 734443128, 730707467, 724190891, 713672996, 699543715, 686397016, 681939244, 689599454, 703842282, 716865897, 726086259, 732681334, 737738729, 741452038, 743876159, 745264351, 745763421, 745289624, 743575573, 740307331, 736051381, 732829392, 732105672, 732662439, 732600808, 732600749, 734467745, 737666845, 740230799, 741300464, 740959644, 739324570, 736347497, 732473731, 729586482, 729676783, 732290328, 735139251, 736845970, 737686336, 738507867, 739768445]
3108.3G39768445J529575J467883J288355R91106N83291J60694j89602k30968J8894
3126.6G45387673L01421N15282N71490M33921K66910P0035j93774k76327j86980k14696
3147G46674955l56734n15640p24733p94470m83930k2411K06589J72317K8849j81317
3167.4G44003475m10319m89652l87490k87473l32594m59432n31078n82218o92606q24332
3187.8G39006281r03785q89540q20756p64012o99938n72562l95775k82228l47554n10216
3208.2G32819915n60463m68373l79085m03703m92692n51820n77569o03735o91652q38995
3228.6G27251828r21965q93950q74818r53316j012087r01997p01607o27577p29978
3247G19634533q02934p02501n73813o19174p85291p93218o23167n34236n66244m93527
$$ y = [739768445, 741298020, 742765903, 744054258, 745045364, 745628655, 745789349, 745599747, 745368779, 745387673, 745689094, 746204376, 746775866, 747209787, 747476697, 747546732, 747352958, 747076631, 746889651, 746674955, 746318221, 745802581, 745077848, 744283378, 743799448, 743777037, 743983626, 744155943, 744184792, 744003475, 743593156, 743103504, 742716014, 742428541, 742095947, 741636515, 741105437, 740523219, 739830613, 739006281, 738102496, 737212956, 736392200, 735628188, 734928250, 734355688, 733959913, 733677685, 733330131, 732819915, 732259452, 731791079, 731411994, 731008291, 730515599, 729963779, 729386210, 728782475, 728090823, 727251828, 726329863, 725435913, 724561095, 723607779, 722595692, 721693695, 720992088, 720364511, 719634533, 718831599, 718129098, 717555285, 716936111, 716150820, 715357602, 714734435, 714200199, 713633955, 713140428]
3267.4G13140428k90751l38972o33776p98762q17537p22468n61893n54085o95109p09772
3287.8G07017303m95971m09007o51777r19103j033545j026213q97705p87080r13977
3306.1F99882925j229585j471877j558661j543224j482904j408041j325786j288175
3322.4F88574672j378775j632035j834392j819015j758814j700222j548648j548350
3338.8F75354421j770198j956463k088010k084971j930952k006113k321601k436519
3355.1F58759594k313912k228022k304375k392351k306521k231598k379537k627909
3371.4F39975369k679229k474367k279818k196432k160370k141058k064705j882673
3387.7F22096717j668334j669764j883447j887262j591265j412809j618564j860559
$$ y = [713140428, 712849677, 712510705, 711876929, 711078167, 710260630, 709538162, 708976269, 708422184, 707727075, 707017303, 706521332, 706112325, 705460548, 704541445, 703507900, 702481687, 701583982, 700796902, 699882925, 698653340, 697181463, 695622802, 694079578, 692596674, 691188633, 689862847, 688574672, 687195897, 685563862, 683729470, 681910455, 680151641, 678451419, 676902771, 675354421, 673584223, 671627760, 669539750, 667454779, 665523827, 663517714, 661196113, 658759594, 656445682, 654217660, 651913285, 649520934, 647214413, 644982815, 642603278, 639975369, 637296140, 634821773, 632541955, 630345523, 628185153, 626044095, 623979390, 622096717, 620428383, 618758619, 616875172, 614987910, 613396645, 611983836, 610365272, 608504713]
3404F08504713j743377j520514j516402j640797j698970j667321j633644j659334j718223
3422.4E93706131j684845j522600j321852j012206l60013N80431J455962J977027K074360
3440.7E93892395J862348J533150J223326R13322O84083O70909P78139Q08835P54416
3459.1F03120923P24852P26879P56919P97749P41482O53743O95110P98523Q82030R05633
3479.5F10803843Q40961Q25108R34541R91821R43065R61184J064539J133025J109958
3497.8F19608045J125812J219154J138389R48369R74775J098096J160502J188755J163185
3516.2F29625082J175702J319825J529098J500785J239360J106798J107276J223504
3532.5F39827430J529455J643122J432001J499594J868367J902997J427710J078904
$$ y = [608504713, 606761336, 605240822, 603724420, 602083623, 600384653, 598717332, 597083688, 595424354, 593706131, 592021286, 590498686, 589176834, 588164628, 587804615, 588385046, 589841008, 591818035, 593892395, 595754743, 597287893, 598511219, 599424541, 600108624, 600779533, 601557672, 602366507, 603120923, 603845775, 604572654, 605329573, 606127322, 606868804, 607522547, 608217657, 609016180, 609898210, 610803843, 611644804, 612469912, 613404453, 614396274, 615339339, 616300523, 617365062, 618498087, 619608045, 620733857, 621953011, 623091400, 624039769, 625014544, 626112640, 627273142, 628461897, 629625082, 630800784, 632120609, 633649707, 635150492, 636389852, 637496650, 638603926, 639827430, 641356885, 643000007, 644432008, 645931602, 647799969, 649702966, 651130676, 652209580]
3548.8F52209580J252592J433432J360654J392544J598060J770139J888513J987577
3565.1F64893091J824379J316547J090825J352966J650273J694739J732707K006173
3581.5F77561700K320230K380371J955331J366377J371622J822471K118647K175987
3597.8F93072736K152682J993835J871705J953244K008676J807750J619160J599371
3614.1G08079159J566708J611591J493692J122594J157343J521588J577556Q53360
3630.4G18983591K17139K79665M77314O28949Q11517R62376J210451J559198J419187
3648.8G26549387K73943o30736m41611J04367K52724J56641K00987M90248Q50499R88841
3669.2G28795290P34866L93748J31369m02511o54041l49939J51872P05362J127183
$$ y = [652209580, 653462172, 654895604, 656256258, 657648802, 659246862, 661017001, 662905514, 664893091, 666717470, 668034017, 669124842, 670477808, 672128081, 673822820, 675555527, 677561700, 679881930, 682262301, 684217632, 685584009, 686955631, 688778102, 690896749, 693072736, 695225418, 697219253, 699090958, 701044202, 703052878, 704860628, 706479788, 708079159, 709645867, 711257458, 712751150, 713873744, 715031087, 716552675, 718130231, 718983591, 719200730, 719480395, 719957709, 720586658, 721398175, 722360551, 723571002, 725130200, 726549387, 726823330, 726192594, 725750983, 725855350, 726108074, 726264715, 726465702, 726955950, 727806449, 728795290, 729530156, 729923904, 730055273, 729652762, 728998721, 728648782, 728800654, 729506016, 730633199]
3687.5G30633199P74563k52426o29604l11851Q3148L30806K99454R4175J99616N73337
3707.9G31794417N40137k05099q32677o38426l6478M49360N83470L23772k8431p6235
3728.3G31873810K72334P48694O15775j57833m78327k39491K9385J49607j1146j36137
3748.7G32666671l00407p77424p91251l35097r4057k31742k64109j1742Q1361j29402
3769.1G29812801m44532n19990j54019K47717J68502l00765m98652l79920k78890j54674
3789.5G27497578Q3863L82901N80072M87447K40087K5213l00765m55439m11928m07517
3809.9G27721512j79767K19345M89831L91364K861n30899q63135n87642j89900n7101
3830.3G26416469Q9526K85625L01719R8407k51353m82440m30524j63317K89143O98924
$$ y = [730633199, 731407762, 731155336, 730525732, 730213881, 730297029, 730627835, 730927289, 731021464, 731221080, 731794417, 732334554, 732129455, 731296778, 730658352, 730621874, 731071234, 731654704, 731978476, 731950045, 731873810, 732146144, 732894838, 733510613, 733352780, 732874453, 732634962, 732664347, 732813954, 732802808, 732666671, 732366264, 731588840, 730797589, 730462492, 730368435, 730136693, 729872584, 729860842, 729942203, 729812801, 729368269, 728848279, 728694260, 728941977, 729110479, 728809714, 728311062, 727931142, 727652252, 727497578, 727581441, 727964342, 728544414, 729031861, 729271948, 729297161, 728996396, 728540957, 728129029, 727721512, 727541745, 727761090, 728250921, 728642285, 728645146, 728114247, 727251112, 726663470, 726473570, 726416469, 726505995, 726791620, 727093339, 727191746, 726940393, 726457953, 726027429, 725864112, 726153255, 726852179]
3850.7G26852179N75363k95877q71957o37471r7871K26259J70946r417j22249k38598
3871.1G25551307l69966l74138k20061P0632J54495n8830j91629l90768m46200k16424
3891.5G23508418j59324j00076K15531M21702K34306j89483n53191o48677m25100q6248
3911.9G22217858Q7797Q1122m4465j79648j46508m7446q6069j01804K9862K9146j96814
3934.3G21643031l17335j69158K980l2008j75476k18928j50263q9586q0049r7930j09792
3956.7G20205486j11759j44005j83403j76966j46926j19269p2598m0114q7798j78516
3977.1G18944132k02775j32382o1631o0260q5235r8943j23263j61290j81496j37270
3997.5G17699587
$$ y = [726852179, 727427542, 727131665, 726259708, 725622237, 725524366, 725750625, 725921571, 725912154, 725789905, 725551307, 725181341, 724807203, 724587142, 724657774, 724812269, 724753439, 724561810, 724171042, 723724842, 723508418, 723349094, 723249018, 723464549, 723886251, 724120557, 723931074, 723377883, 722729206, 722304106, 722217858, 722305655, 722386777, 722342312, 722162664, 722016156, 721968710, 721882641, 721780837, 721810699, 721839845, 721643031, 721325696, 721156538, 721159518, 721127510, 720952034, 720733106, 720582843, 720493257, 720413208, 720315278, 720205486, 720093727, 719949722, 719766319, 719589353, 719442427, 719323158, 719250560, 719210446, 719122648, 718944132, 718741357, 718608975, 718547344, 718487084, 718401849, 718302906, 718179643, 718018353, 717836857, 717699587]
##END=$$ End of the data block
