##TITLE=Julia 4 $$ Begin of the data block
##JCAMP-DX=5.00 $$ ACD/SpecManager v 10.08
##SPECTROMETER/DATA SYSTEM=Alpha
##DATE=24 Sep 2014 08:19:16
##DATA TYPE=INFRARED SPECTRUM
##DATA CLASS=XYDATA
##ORIGIN=
##OWNER=
##NPOINTS=1765
##FIRSTX=399.76428223
##LASTX=3997.64306641
##MAXX=3997.64306641
##MINX=399.76428223
##MAXY=0.88043350
##MINY=0.43504316
##XFACTOR=1.0000000000
##YFACTOR=1.000000000000000e-9
##FIRSTY=0.78893733
##DELTAX=2.03961372
##XUNITS=1/CM
##YUNITS=ARBITRARY UNITS
##XYDATA=(X++(Y..Y))
399.8G88937330K450526j881659j687050L563047M676222j108050m708528q57115L786027
418.1G93170750M84109n176425l048003K451063J846790m080534n277813L44277L113389
436.5G83827603j355589m832506j222312L461242J010954m375398l746093J573563
452.8G74341464K708674k294481n096257o50704K814055n40615n009234l180980J849890
471.2G64941812J241266m243970n128979k30253K166867k080738o194175l628909N09441
489.5G47352362j639426p648647r242415o567121p145941j1532009q524477N984544
505.8G01036870J6352416R869277j849890k240419N174160P077038J368940k567172
522.1G34221220J91569L589511R46760l691792k980828J585960K292991k000392m035294
$$ y = [788937330, 791387856, 789506197, 787819147, 791382194, 796058416, 794950366, 790241838, 789384723, 793170750, 793654859, 788478434, 785430431, 787881494, 789728284, 785647750, 780369937, 780714214, 783827603, 782472014, 777639508, 776417196, 779878438, 780889392, 776513994, 772767901, 774341464, 777050138, 774755657, 769659400, 769008696, 771822751, 771282136, 766272902, 763091922, 764941812, 766183078, 761939108, 756810129, 756579876, 758746743, 756666005, 750471830, 746842921, 747352362, 745712936, 738064289, 728821874, 722254753, 715108812, 703576803, 695052326, 701036870, 717389286, 727258563, 725408673, 723168254, 728342414, 735419452, 736788392, 734221220, 734412789, 738002300, 738949060, 735257268, 732276440, 733862400, 736155391, 734154999, 730119705]
540.5G30119705m78864K730251M23133l499865k551318J679242K172291j809656l446400
558.9G25338519J57833L039956O24060k874314j570881K394974K417326j561403k954066
577.2G25012004O42658L242373O75976k686977j292467K531946K538919j316905k743244
595.6G26604283L72767K606988J7464l518879k686441L92258k09212m452884n917192
613.9G13209152o77347R505749J9178271K1628559J5969515Q018076J104653m639566
630.2G83297062o276846l672957l872812p416725k535761R354592J2798547O690324
646.6G88365424n9665k014458J195967L846944J619816j843393q78573K736509L010810
664.9G95979381r53973l388941J180112L607333J326203k072095j504362J870632K127111
$$ y = [730119705, 729640841, 732371092, 732794225, 729294360, 726743042, 728422284, 730594575, 728784919, 725338519, 725496352, 728536308, 729160368, 726286054, 724715173, 727110147, 729527473, 727966070, 725012004, 725654662, 728897035, 729573011, 726886034, 725593567, 728125513, 730664432, 729347527, 726604283, 726977050, 729584038, 729601502, 726082623, 723396182, 723788440, 723579228, 719126344, 713209152, 712531805, 722037554, 741215825, 762844384, 778813899, 786831975, 787936628, 783297062, 777020216, 773347259, 769474447, 762057722, 759521961, 768876553, 781675100, 788365424, 788305759, 786291301, 787487268, 791334212, 792954028, 791110635, 790232062, 792968571, 795979381, 795025408, 791636467, 792816579, 796423912, 797750115, 795678020, 794173658, 796044290, 798171401]
683.3G98171401j655996m014492k516448k015233p141233j6100824k3096978j9387305
699.6G22242892l31402K1014035K7595460K1567822J3809502O865620J073003k29597
715.9H13607335K315939L287255M17531k034843l57568K486586J634538j713752k273918
734.3H17369103O37472K101362m43280l092706j746059J095176M26531l078461m433155
752.6H08835983k558589k139210o110073j0511398j2135148j6084433k7778267m1569949
768.9F89948916m1461527j6393721K1969199M6366155M4930697L1527877K0972907
783.2G97860503J3416052N988896J514733K219975M038453K241075j259685j433730
799.5H24586272J459837K283514p75099l213346j548111R45508K62439j649439p86722
$$ y = [798171401, 796515405, 792500913, 789984465, 787969232, 780827999, 764727175, 741630197, 722242892, 721911490, 742925525, 770520985, 792088807, 805898309, 812763929, 813836932, 813607335, 815923274, 819210529, 819628060, 817593217, 817235649, 819722235, 821356773, 819643021, 817369103, 818006575, 820107937, 819664657, 816571951, 814825892, 815921068, 816347599, 813269138, 808835983, 806277394, 804138184, 798028111, 787516713, 775381565, 759297132, 731518865, 689948916, 648487389, 632093668, 654062867, 700429022, 745359719, 776887596, 797860503, 811276555, 817265451, 818780184, 821000159, 825038612, 827279687, 826020002, 824586272, 826046109, 828329623, 827554524, 824341178, 822793067, 823738575, 824001014, 822351575, 821564853]
817.9H21564853J859486J791299j910746m913807m146278k331376l215969o482720
834.2H02214742r767533j3736426k1810532l0633748k7972519j0661960J1989296L0248582
850.5G29869902L3844471K3759186J4159501R604275N438984J504779O91473J995862
866.8H20868433J143455k376378m205524k502501j144887k820730l764927J41621O024658
885.2H11363220P617474L769576L3677M83274K069116O79076k036512j844585Q00014
903.5H22934330J479864r70662k623081q71301J363039M49777k118111k187192L30507
921.9H17787170J347423p54237k524197j119554J136958O66380j647830k045631K4855
940.3H12871337J111865o60241k569079j757920R0540m14372k605736k632201j36971
$$ y = [821564853, 823424339, 825215638, 823304892, 818391085, 814244807, 811913431, 808697462, 802214742, 792447209, 778710783, 756900251, 726266503, 698293984, 687632024, 699621320, 729869902, 763714373, 787473559, 801633060, 811237335, 816676319, 818181098, 818872571, 820868433, 822011888, 819635510, 815429986, 812927485, 811782598, 808961868, 805196941, 805338562, 811363220, 818980694, 822750270, 822783947, 823267221, 825336337, 826015413, 823978901, 822134316, 822934330, 824414194, 823443532, 820820451, 819949150, 821312189, 821761966, 819643855, 817456663, 817787170, 819134593, 818380356, 815856159, 814736605, 815873563, 816539943, 814892113, 812846482, 812871337, 813983202, 813322961, 810753882, 808995962, 809086502, 808672130, 806066394, 803434193, 803297222]
958.6H03297222P74860j625895l229142o56962K534270J967073r59218k360523j114547
977G98627138J83702p68662k569973k490580p93279l11911j884401l075420k224029
995.3G84692585j028180j707255l532351m041373l099561l403246o079436q236289
1011.6G53564894p691085o746888q139491j1065245j2219846q543909J068115J3778270
1028G14004815K2406935K2193432J5892029Q448780K338707r86755j230001n55873
1044.3G82512069j296461k880990l174961k066791j652896k923370m235923m039705
1060.6G60240972l283799l833234n525887o370068n554616m535198m517377m436969
1076.9G22183824k764762j57714J245022P60257o8485p1347l21627k223372n124033
$$ y = [803297222, 804072082, 802446187, 799217045, 798560083, 801094353, 803061426, 802102208, 799741685, 798627138, 798810840, 798042178, 795472205, 792981625, 792188346, 791876435, 789992034, 786916614, 784692585, 783664405, 781957150, 778424799, 774383426, 771283865, 767880619, 761801183, 753564894, 745873809, 739126921, 730987430, 719922185, 707702339, 699158430, 700226545, 714004815, 736411750, 758605182, 774497211, 782945991, 785284698, 784297943, 783067942, 782512069, 781215608, 778334618, 775159657, 773092866, 771439970, 768516600, 764280677, 760240972, 756957173, 753123939, 747598052, 741227984, 735673368, 731138170, 726620793, 722183824, 719419062, 719261348, 720506370, 721266627, 721198142, 721126795, 720805168, 718581796, 713457763]
1095.3G13457763p366955q984029j1734426j6260982k0377159j9570768r689450N889535
1111.6F25363529J5518248J2683391K207101q573950j5064835j3712525k852738J2518525
1127.9F28086746K2301078K2314548J8167079J5589833J3958514J0705888O326437
1142.2G37450123L168046J664460j29819l279328o350160p699132p488549p206320
1158.5G10129321q705438j3229250k1091462l1820476m1388094l9928496j8527567
1172.8E35438538J8798768N3468764O7354441N8689713L9863050K2523344R986579
1187.1H06123197J982391j436532j752019k050578l464222m087031k552926n60344
1203.4G92201936m79579j959383k650798j853227j352966k329171l483653l365576
$$ y = [713457763, 706090808, 697106779, 685372353, 669111371, 648734212, 629163444, 619473994, 625363529, 640881777, 653565168, 655772269, 647198319, 632133484, 618420959, 615568221, 628086746, 650387824, 672702372, 690869451, 706459284, 720417798, 731123686, 737450123, 740618169, 742282629, 742152810, 738873482, 732523322, 724824190, 717335641, 710129321, 701423883, 688194633, 667103171, 635282695, 593894601, 553966105, 535438538, 554237306, 607706070, 675060511, 733750224, 773613274, 796136618, 806123197, 808105588, 806669056, 804917037, 802866459, 799402237, 795315206, 792762280, 792201936, 791722357, 789762974, 787112176, 785258949, 783905983, 781576812, 778093159, 774727583]
1219.7G74727583k932906m059613o334782p579088p299602p349908q634210r016037
1236G21521437o182611j677751L36885j351535l926158n370617o803036r438395j2172699
1254.4F74935520j3324619j3273477j3808310j5401781j7230213j9209325k2301853
1268.6E60385942k6400268k8970301k7360260k1770597j4407187o434173K233714J0796428
1285D48073298J9299566K9685349M0401220M5484662M1116119K9679000J5674233K293229
1301.3F71706676p239282j3882875k5421858l6347568k2614300J3806939L8833260
1315.6F18840992L9556027L0555069K3538173K0767092J9160807J5815855J1673927
1329.8G79907942Q823991O776690L640771l57211k140045J98424L734052M776418L595949
$$ y = [774727583, 771794677, 767735064, 761400282, 753821194, 746521592, 739171684, 730537474, 721521437, 715338826, 713661075, 713997960, 712646425, 708720267, 703349650, 696546614, 687108219, 674935520, 661610901, 648337424, 634529114, 619127333, 601897120, 582687795, 560385942, 533985674, 505015373, 477655113, 455884516, 441477329, 435043156, 437276870, 448073298, 467372864, 497058213, 537459433, 582944095, 624060214, 653739214, 669413447, 671706676, 664467394, 650584519, 625162661, 588815093, 566200793, 580007732, 618840992, 658397019, 688952088, 712490261, 733257353, 752418160, 768234015, 779907942, 788731933, 795508623, 799149394, 798792183, 796652138, 796850562, 800584614, 805361032, 808956981]
1348.2H08956981K707421K091885o77705o451010j3709307k3141623l5743892m0668547
1364.5F93364203k7218759k678573J8379748K6814639K5515676J9933164J4683604
1378.8G68793702J0315001N571544R92418k849639n038261l684044J572966Q377195
1395.1G84050882J1412322R745896N684018K012313P92801J428545J784682O25253
1411.4H17536712n60344q3088Q50021k55227k490580l207266k776444l071606n827070
1429.8H00115108r153485j0934591j5851140k3097813k0468712p217288J0123908J8773616
1446.1G42289603J2909889M502058N457938R686708R452939L548920j190662j616418
1462.4G85040975k077580m244685o715119j0596812j5972018q981049J1749089K3622691
$$ y = [808956981, 811664402, 813756287, 813078582, 806627572, 792918265, 769776642, 734032750, 693364203, 666145444, 663466871, 681846619, 708661258, 734176934, 754110098, 768793702, 779108703, 784680247, 785672665, 782823026, 777784765, 774100721, 775673687, 784050882, 795463204, 805209100, 810893118, 812905431, 813698232, 815126777, 816911459, 817536712, 816976368, 816893280, 817743301, 817488074, 814997494, 811790228, 809013784, 805942178, 800115108, 790961623, 780027032, 764175892, 741078079, 720609367, 713392079, 723515987, 742289603, 755199492, 759701550, 765159488, 774846196, 784299135, 787848055, 786657393, 785040975, 782963395, 778718710, 772003591, 761406779, 745434761, 736453712, 748202801, 771825492]
1478.7G71825492J8977642Q483708J309812k161026l746509l870726l333032m065990
1495G83419371o349743p544756p142901p237733j0974645j9049585k1112680k2007287
1511.4F82000041k1881163o600201K1960735M4233918N1382184L6084771J4440477
1525.6H21620762L193796j585722l963590o251812n760550l460884l610373n699396
1542G94482231n764007m375697k606332k019644k604425l037691k671599m140735q153498
1560.3G59108603p806361p312834q193910j0854721j5913010j4615714k530694J1749327
1576.6G03630686P218361o687224j3668120j5990436j7881513k0278156k1885156k1716118
1593E92742324k0187974j7293632j2407005m794002N915583J8117070K8344393L2908082
$$ y = [771825492, 790803134, 799286842, 800596654, 798435628, 794689119, 790818393, 787485361, 783419371, 777069628, 769524872, 762381971, 755144238, 744169593, 725120008, 704007328, 682000041, 660118878, 653518677, 675479412, 719713330, 771095514, 807180285, 821620762, 824814558, 823228836, 819265246, 813013434, 807252884, 803792000, 800181627, 794482231, 788718224, 784342527, 781736195, 779716551, 777112126, 774074435, 771402836, 767262101, 759108603, 751302242, 743989408, 735795498, 724940777, 709027767, 694412053, 691881359, 703630686, 710849047, 704161823, 690493703, 674503267, 656621754, 636343598, 614458442, 592742324, 572554350, 555260718, 542853713, 538059711, 543975294, 562092364, 590436757, 623344839]
1609.3F23344839K9682099K0886064J0157168k062142r539902j1060238j2022138j2236416
1625.6F37149334j2693286j2649536r337962m251957K850354J1183441J7399668K1753550
1641.9F51403606K2959769K3824632K2399247J7069518J6614318J4341176L237247
1656.2G71849513k108157m477560r196341j4448106j6340912j9526899k4917185k6874125
1672.5F53960228l1925201l5854757k8127015j8397033j1305511n502582K197385J0546565
1688.8E35592079J7220557J9272566K1042764K2075593K0584166K0801843J6330719
1703.1F72920287J3991356J4680445J3020456J1204838J0518015J0961830J1430145
1717.4G58727372R028375O293118O319225P019162O489754N289495M745543N867958
$$ y = [623344839, 653026938, 673913002, 684070170, 682008028, 672468126, 661407888, 649385750, 637149334, 624456048, 611806512, 602468550, 598216593, 601066947, 612250388, 629650056, 651403606, 674363375, 698188007, 720587254, 737656772, 754271090, 768612266, 771849513, 769741356, 765263796, 756067455, 741619349, 725278437, 705751538, 680834353, 653960228, 622035027, 586180270, 558053255, 539656222, 528350711, 522848129, 525045514, 535592079, 552812636, 572085202, 593127966, 615203559, 635787725, 656589568, 672920287, 686911643, 701592088, 714612544, 725817382, 736335397, 747297227, 758727372, 767755747, 774048865, 780368090, 787387252, 793877006, 799166501, 803912044, 809780002]
1733.7H09780002N730688L555715K236903J988828K550185L008604K782941K670646
1750H34304512L157258L343999K578855J246690R43959J778305K081394J687467J652241
1768.4H52774680K480805L156244J900435K07484o6460M14372L56257k24233Q3864
1786.7H61083448J685679L210366K864718J037240M72903J239539J495421N20527j77205
1805.1H73432636L85583J255393R62853k11537n64873J78814O71446J09196o27220
1823.4H75592291l88443O48081Q97646q8036m02927O14285J374900Q89719J29282R8527
1843.8H79365325N47230N20945k25783p23600j39236O18398L27825n58138o37531K59102
1864.2H79354537P98881K2232j009583o57916K12371Q9645p91728j034320l31580R5844
$$ y = [809780002, 815510690, 819066405, 821303308, 823292136, 825842321, 828850925, 831633866, 834304512, 837461770, 840805769, 843384624, 844631314, 845575273, 847353578, 849434972, 851122439, 852774680, 855255485, 858411729, 860312164, 860519648, 860453188, 860867560, 861223817, 860999584, 861083448, 862769127, 865979493, 868844211, 869881451, 870354354, 871593893, 873089314, 873609841, 873432636, 873818219, 875073612, 876036465, 875824928, 875260055, 875438869, 876110315, 876219511, 875592291, 875203848, 875851929, 876749575, 876661539, 876258612, 876872897, 878247797, 879137516, 879266798, 879365325, 879912555, 880433500, 880207717, 879484117, 879344881, 879963279, 880291104, 879732966, 879095435, 879354537, 880153418, 880175650, 879166067, 878508151, 878720522, 878810167, 878018439, 876984119, 876652539, 876748383]
1884.6H76748383n05090j325428j230419m80473m80652j323521j603246q98480l56793
1903H68544281q75891j816153k109826k167284l388584m836440k999008K378404N847633
1921.3H58577132M887521K270699J022518J236260J203417K36273n68628k67208M06921
1939.7H69004905K49744o01292q05795r5368L72649o9321o57022m28140K28465J80602
1960.1H67379427o04689r25183l14415K30491r6202o57201n17547L3617j18434j074016
1980.5H63335848j594782j031935k88904k80678n54383k14994N75721P60734J7882
1998.8H60724509o26922l73065J13129j00612p24912p84636k03013K6345m93765p50184
2019.2H56806874L0577R38416O98745l64661q43525k39313M94302M50730M5061J59145
$$ y = [876748383, 876243293, 874917865, 873687446, 873206973, 872726321, 871402800, 869799554, 868901074, 868544281, 867668390, 865852237, 863742411, 861575127, 858186543, 853350103, 850351095, 852729499, 858577132, 863464653, 865735352, 866757870, 867994130, 869197547, 869433820, 868865192, 868597984, 869004905, 869254649, 868653357, 867847562, 867752194, 868124843, 868055522, 867398500, 866970360, 867198825, 867379427, 866774738, 865849555, 865535140, 865765631, 865669429, 865012228, 864494681, 864528298, 864409864, 863335848, 861741066, 860709131, 860420227, 860139549, 859585166, 859370172, 859945893, 860706627, 860724509, 860097587, 859724522, 859837651, 859737039, 859012127, 858227491, 858024478, 858050823, 857557058, 856806874, 856837451, 857775867, 858474612, 858109951, 857266426, 857027113, 857521415, 857972145, 858017206, 858176351]
2039.6H58176351N93960M75526j73033m26352Q2851N28514J92225m14967l85881J64807
2060H58814001L01004k29896n78761j84357K78473M4465n45859o04093q8334J50263
2080.4H57356906k44260o12080l42667J55747Q0049m63069o33001k25961N7459k52605
2100.8H54876518o64830n46455j37270j56402o60241r40859o51539l27706m70638p43211
2121.2H49577367n73814q5175K1220m94421r92000q35717k17676J89662K35975M20511
2141.6H47245932Q88228J080930O91831K13862K08199M69386L98577j1564j91211P3850
2162H51068020L13341J00613k80678k08676K42054L72708l576l24130j61707J49130
2182.4H51267099N0366l53813m58717j37985N5790j88231m47751k88486J5676l8445
$$ y = [858176351, 858770311, 859245837, 859072804, 858646452, 858729303, 859257817, 859450042, 859035075, 858649194, 858814001, 859115005, 858885109, 858306348, 858121991, 858400464, 858444929, 857899070, 857294977, 857206643, 857356906, 857112646, 856500566, 856157899, 856313646, 856393695, 855930626, 855297625, 855071664, 855129123, 854876518, 854211688, 853665233, 853527963, 853371561, 852711320, 851770461, 851118922, 850791216, 850320578, 849577367, 849003553, 848918378, 848939598, 848445177, 847453177, 846617460, 846399784, 846589446, 846825421, 847245932, 848134160, 849215090, 849906921, 850120783, 850328982, 850798368, 851196945, 851185381, 850994170, 851068020, 851381361, 851481974, 851201296, 850992620, 851234674, 851607382, 851603806, 851279676, 851117969, 851267099, 851317465, 850963652, 850504935, 850366950, 850422740, 850234509, 849786758, 849498272, 849513948, 849475503]
2202.8H49475503l86477n10096k18749M7147o4254k40981n1379L10599L08812r2030
2223.2H48578095l52621j55031J34170L4094k85268k68638O0320J04427l40223p51555
2243.6H46757770o34253k14816l9517j31131m9531L19183N26488K38180j84238j77920
2264H46410215J12057J02877k11417l14177k9861K08139J7703l28124l42727o3419
2284.4H45561266L9101k37644n08666l72350r8467k01881n37873n64515k35140o3599
2304.8H42780232k87056m93109l28958l0219o2228m68611p13706l88444R6202R2506
2325.2H40196609k46345k58625J15871K62320j8119k04564L4035L27170K71201J18136
2345.6H40597689J82092J46389k20775q15988j253962j159430p56979n59986m82499
$$ y = [849475503, 849089026, 848578930, 848360181, 848407328, 848343074, 848102093, 848050714, 848361313, 848670125, 848578095, 848225474, 848070443, 848204613, 848238707, 847953439, 847684801, 847745121, 847849548, 847509325, 846757770, 846123517, 845908701, 845869184, 845738053, 845688522, 846007705, 846534193, 846772373, 846588135, 846410215, 846522272, 846625149, 846413732, 846099555, 846069694, 846277833, 846295536, 845967412, 845624685, 845561266, 845600367, 845362723, 844854057, 844481707, 844383240, 844181359, 843643486, 843078971, 842843831, 842780232, 842493176, 842000067, 841671109, 841640890, 841578662, 841110051, 840396345, 840007901, 840104103, 840196609, 839950264, 839691639, 839807510, 840069830, 840051711, 839847147, 839881182, 840208352, 840479553, 840597689, 840779781, 840926170, 840705395, 839889407, 838635445, 837476015, 836719036, 836159050, 835676551]
2363.9H35676551j09017M62949O91414L91305P510j3888J46568L4392l34263n31852
2384.3H36421669l53277q7619j18852l80635n15997m57049m35710n27501m80354r9182
2404.7H32965493L27707L74615J55389J23024L48866M85539L57211K15292L19421M98176
2425.1H36170733L95596L5584j90616j10387R179r5308l16501l41832j51814p3671
2445.5H35330963k09808k58506j7046K74062K70307M3988k7061J64211K78116P2538
2465.9H35921764j88410j81198l9697q0824k86162l57568j90019m7207j77980m39107
2486.3H33933592m91500k84553j12474j24931j15812N8830K24471J39654j25408k42234
2506.7H32859635j35839q4638k55108m37439l78251k11656k61664n14209n66721j99199
$$ y = [835676551, 835567534, 836030483, 836721897, 837113202, 837120712, 837106824, 837253392, 837287784, 836953521, 836421669, 836068392, 835980773, 835861921, 835481286, 834965289, 834508240, 834072530, 833545029, 833064675, 832965493, 833293200, 833667815, 833823204, 833946228, 834295094, 834780633, 835137844, 835353136, 835672557, 836170733, 836566329, 836601913, 836411297, 836300910, 836310089, 836214781, 835898280, 835556448, 835404634, 835330963, 835121155, 834862649, 834845603, 835119665, 835389972, 835433960, 835406899, 835571110, 835849226, 835921764, 835733354, 835552156, 835512459, 835431635, 835145473, 834787905, 834597886, 834550679, 834372699, 833933592, 833442092, 833157539, 833045065, 832920134, 832804322, 832863152, 833087623, 833227277, 833101869, 832859635, 832723796, 832639158, 832384050, 831946611, 831568360, 831356704, 831095040, 830580831, 830014110, 829814911]
2527.1H29814911K35319K99811M7744j52946j56581j86980l60072m45664l32534k02060
2547.5H28560948j55985p8619J50621M35293N19574L32117J10686P3790J26422M0531
2567.9H30115378j80602l11911k81632k90930m92096p55668q16226o40810m35650k71618
2588.3H25638235p2718J60277K79784J19388k16424m29273m56989m84884n97536o19054
2608.7H23320806m01854q7202O6638K3425R4711M49360P19607N27978O0856k63572
2629.1H24510753l83258n40912q41141j090407j081407q73089o82235n64217l82722
2647.4H18071365p1644J94430J89185n8234l42667n47528p58708j002252j102686r87470
2667.8H13583791p75218o29246n25296j97530L85643Q55743R72033R19521R25720R00149
$$ y = [829814911, 830050230, 830350041, 830397785, 830244839, 830088258, 829901278, 829541206, 829095542, 828763008, 828560948, 828404963, 828326344, 828476965, 828912258, 829431832, 829763949, 829874635, 829948425, 830074847, 830115378, 829934776, 829622865, 829341233, 829050303, 828558207, 827802539, 826986313, 826345503, 825909853, 825638235, 825565517, 825725794, 826005578, 826124966, 825908542, 825479269, 825022280, 824537396, 823939860, 823320806, 822918952, 822831750, 822898388, 822921813, 823016524, 823465884, 824185491, 824713469, 824774325, 824510753, 824127495, 823586583, 822745442, 821655035, 820573628, 819700539, 819018304, 818454087, 818071365, 817999721, 818194151, 818383336, 818325102, 817982435, 817434907, 816676199, 815673947, 814571261, 813583791, 812808573, 812179327, 811654031, 811456501, 811842144, 812697887, 813669920, 814589441, 815515161, 816415310]
2688.2H16415310O37650J81795j69695k58982k67565l45886l64840j74522J56819M02153
2708.6H16212237M25637L78251M69446O12795N96524M45187L43144L79860L74377J39415
2729H20376873j27077j68622r3996k12372n09977o14643l81947j03592j28985l95119
2749.4H17640543n45383m77492m27783n60999p06732o73831n73694o02484o65724m44591
2769.8H11961830J15275O06775O58274M67598M23491M81785L43203J014k55704k94388
2790.2H14509153k44796k53260k74837k13385j44958k26677m95135p12932o09099l81172
2810.6H10952902l57807m01318k92182p6532R0301N8889o7949j7643J53661J01983
2831H10144305k02119m10974l81768m71890q74996j149833r60410o27577o07610p78794
$$ y = [816415310, 817052960, 817234755, 817065060, 816806078, 816538513, 816192627, 815827787, 815653265, 815810084, 816212237, 816637874, 817016125, 817485571, 818098366, 818694890, 819140077, 819483221, 819863081, 820237458, 820376873, 820249796, 820081174, 819987178, 819774806, 819264829, 818650186, 818268239, 818164647, 818035662, 817640543, 817095160, 816617668, 816189885, 815628886, 814922154, 814248323, 813674629, 813072145, 812406421, 811961830, 812077105, 812683880, 813342154, 813809752, 814233243, 814715028, 815058231, 815059245, 814803541, 814509153, 814264357, 814011097, 813736260, 813522875, 813377917, 813151240, 812656105, 811943173, 811334074, 810952902, 810595095, 810193777, 809901595, 809825063, 809915364, 809974253, 809906304, 809888661, 810042322, 810144305, 809942186, 809531212, 809149444, 808677554, 807802558, 806652725, 805692315, 805064738, 804457128, 803678334]
2851.4H03678334p33018m56631k76447n34773j139581j534521j568258j624048j631975
2869.7G94179082j077175r0361N45859M40240r2744n14091o97433j097203k036333
2888.1G89559841l218949m156112m729927m973113l977120l08156M901886P851362
2904.4G80949712O927490M370749K559304J604200N94854o28591j584649k136826k515972
2922.8G90140271k747655k488553j760066j266300j386524j870930k346456k316654
2939.1G73957133j190841O47664J503229N21601j272321k745867l532588l150523j356602
2957.4G63380885O31988J260340R72748J447141K349735J700937p82370l685296n975008
2975.8G61301100p543683q512914p979035m368842K314389R507715J3543427J2857676
$$ y = [803678334, 802945316, 802488685, 802212238, 801677465, 800537884, 799003363, 797435105, 795811057, 794179082, 793101907, 793011546, 793557405, 793997645, 793904901, 793390810, 792693377, 791596174, 789559841, 786340892, 782184780, 777454853, 772481740, 768504620, 768196464, 773098350, 780949712, 787877202, 792247951, 794807255, 796411455, 797006309, 796377718, 794793069, 792656243, 790140271, 787392616, 784904063, 783143997, 781877697, 780491173, 778620243, 776273787, 773957133, 772766292, 773413956, 774917185, 775438786, 774166465, 771420598, 767888010, 764737487, 763380885, 764012873, 765273213, 766245961, 767693102, 770042837, 771743774, 770961404, 767276108, 761301100, 753757417, 745244503, 737265468, 732896626, 735211015, 744718730, 758262157, 771119833]
2992.1G71119833R640217O824136M836320L040314J744747J190544R58919P46548N36680
3010.5H00638258L60609K04384p2718n35130q85368p78377l49223n4598n3227j76430
3030.9G98298180k97427n84126j175642j749277k031862j964748j177013M31776J760185
3049.2G91510046J740813Q20458j10507p66337j010657r22322r89795j371681j614630
3067.6G87285388j156629k4378R76205J325309J232147R13918M43399r6678m72308
3085.9G90426373l62217j00255k76566o34253n98192j76728R1732j00791l86715l76940
3106.3G87505448k81751m62830p05123o62864m98712n39243r19819j297831j157582
3124.7G80979693o72758m20272n62489p50065o70850n74410r01878j511753j724302
$$ y = [771119833, 780760050, 787584186, 792420506, 795460820, 797205567, 798396111, 799355030, 800101578, 800638258, 800998867, 801203251, 801130533, 800595403, 799710035, 798931658, 798582435, 798527837, 798474610, 798298180, 798000753, 797416627, 796240985, 794491708, 792459846, 790495098, 789318085, 789749861, 791510046, 793250859, 794071317, 793960810, 793194473, 792183816, 791261494, 790271699, 788900018, 787285388, 786128759, 786104381, 787080586, 788405895, 789638042, 790551960, 790995359, 790898681, 790426373, 790064156, 789963901, 789687335, 789053082, 788454890, 788278162, 788369894, 788269103, 787882388, 787505448, 787223697, 786760867, 786055744, 785392880, 784894168, 784354925, 783435106, 782137275, 780979693, 780306935, 779886663, 779324174, 778574109, 777903259, 777328849, 776426971, 774915218, 773190916]
3143G73190916j248897m82261K4498J9729k49207m79758p45714j080632j199901j069605
3163.4G66679168j076579j347065j554847j496673j395762j526534j821399j968980
3179.8G54491329j893520j907706k222658k629637k856315k971351l255248l749847
3196.1G33005047m143894m238188m262388m471719m692197m639745m389643m281223
3212.4F97886050m413724m356563l695131k474725r30488P74622K542973M056274M753590
3230.7F94142878M360259L222227K114653J435578R27031N83232P79986J485586K256751
3249.1G11308181K765537K934873K806842K389312J693547Q94963L04520P689k83718
3267.5G24821746p40111j189529j437247j531303j709759k012253k230942k247990
$$ y = [773190916, 771942019, 771459758, 771484256, 771503985, 771254778, 770775020, 770029306, 768948674, 767748773, 766679168, 765602589, 764255524, 762700677, 761204004, 759808242, 758281708, 756460309, 754491329, 752597809, 750690103, 748467445, 745837808, 742981493, 740010142, 736754894, 733005047, 728861153, 724622965, 720360577, 715888858, 711196661, 706556916, 702167273, 697886050, 693472326, 689115763, 685420632, 682945907, 682015419, 682790041, 685333014, 689389288, 694142878, 698503137, 701725364, 703840017, 705275595, 706202626, 706785858, 707565844, 709051430, 711308181, 714073718, 717008591, 719815433, 722204745, 723898292, 724793255, 725097775, 725105464, 724821746, 724081635, 722892106, 721454859, 719923556, 718213797, 716201544, 713970602, 711722612]
3283.8G11722612k221644k399325k698421k887309l034532l336251l777206m048407
3300.1F87319517l931999l773630m080415m727363n071700m835367m402995m186749
3316.4F52309299m130960m075527m110635m430174n044222n517304n556464n482614
3332.7F13961399n464077n265177m787624l980994k702296j057148P22707K353847
3349E93780637L538668M622877O124675P645130Q346260Q012056P017493N816937M681170
3367.4F49585903L671944K769232J983821J312315P04885J03831n67496j226365j700640
3385.7F56637430k043843k458096l039658l618955l953457m137218m533708n260349
3402.1F27592146n925178o208539o341279o520927o605506o395518n773425m779518
$$ y = [711722612, 709500968, 707101643, 704403222, 701515913, 698481381, 695145130, 691367924, 687319517, 683387518, 679613888, 675533473, 670806110, 665734410, 660899043, 656496048, 652309299, 648178339, 644102812, 639992177, 635562003, 630517781, 625000477, 619444013, 613961399, 608497322, 603232145, 598444521, 594463527, 591761231, 590704083, 591426790, 593780637, 597319305, 601942182, 608066857, 615711987, 624058247, 632070303, 639087796, 644904733, 649585903, 653257847, 656027079, 658010900, 659323215, 660028100, 660131931, 659564435, 658338070, 656637430, 654593587, 652135491, 649095833, 645476878, 641523421, 637386203, 632852495, 627592146, 621666968, 615458429, 609117150, 602596223, 595990717, 589595199, 583821774, 579042256]
3418.4E79042256l498733j882970P1287K109289L903210N296350O380140P098794P176876
3436.7F05696499O748021O306648N976618N518436M826188L931046L008306K308607
3453.1F44320369K170264K850712L858566M319191M226148M068196L737569L047168
3469.4F72598183K378166K113700K077162K076387K032698J845479J754760J836539
3485.7F88713074J846075J832187J846015J806558J787602J717508J620591J591921
3502G02761531J400649J204431J331389J509190J503110J349091J189948J232743J439273
3520.4G14921355J601219J491309J260697J220525J289189J373946J462937J385808
3536.7G26006985J245260J405716J668095J601995J223564R76860J049042J116276
$$ y = [579042256, 575543523, 573660553, 573731840, 575841129, 579744339, 585040689, 591420829, 598519623, 605696499, 612444520, 618751168, 624727786, 630246222, 635072410, 639003456, 642011762, 644320369, 646490633, 649341345, 653199911, 657519102, 661745250, 665813446, 669551015, 672598183, 674976349, 677090049, 679167211, 681243598, 683276296, 685121775, 686876535, 688713074, 690559149, 692391336, 694237351, 696043909, 697831511, 699549019, 701169610, 702761531, 704162180, 705366611, 706698000, 708207190, 709710300, 711059391, 712249339, 713482082, 714921355, 716522574, 718013883, 719274580, 720495105, 721784294, 723158240, 724621177, 726006985, 727252245, 728657961, 730326056, 731928051, 733151615, 734128475, 735177517, 736293793]
3553G36293793J133203J313508J524985J556098J538992J620650J616597J363516J174808
3571.3G49136150J273274J496375J655221J747727J852036J995265K015055J684844
3587.7G62855947J333654J383424J571297J672149J737833J723766J634479J615822
3604G75528371J626134J554489J438857J430928J454473J374721J302004J209319J073420
3622.3G87992716J072883J137972J025558P64489P11381P53403P01666O87242P39455
3640.7G95586765P86483Q86440J000345Q45075K73168m1902J49727L90172L95536J84119
3661.1H00455928k7895M5121K63929K45154R2983Q1956j67191m57942l20554j72436
3681.5H00039053K7776N13851R38774N45263j99974j89364J61708L55661L29017M8697
$$ y = [736293793, 737426996, 738740504, 740265489, 741821587, 743360579, 744981229, 746597826, 747961342, 749136150, 750409424, 751905799, 753561020, 755308747, 757160783, 759156048, 761171103, 762855947, 764189601, 765573025, 767144322, 768816471, 770554304, 772278070, 773912549, 775528371, 777154505, 778708994, 780147851, 781578779, 783033252, 784407973, 785709977, 786919296, 787992716, 789065599, 790203571, 791229129, 791993618, 792704999, 793458402, 794160068, 794847310, 795586765, 796373248, 797259688, 798260033, 799105108, 799378276, 799336374, 799486101, 799876273, 800271809, 800455928, 800428033, 800473154, 800737083, 800982237, 801075220, 801157176, 800989985, 800532043, 800211489, 800039053, 800066829, 800580680, 801519454, 802064717, 801864743, 801675379, 801837087, 802192748, 802521765, 802570462]
3701.9H02570462j73390K5869L60846L73185m7028l15845j80841o6757r5844j52052
3722.3H02298605j83224j76132j3411K70367M67538L03686k03490m45128k47299j3113
3742.7H02058399Q702o020J9193j68443l00229j36971n2750j86682k68817r7454O7771
3765.1H00936699P3016k027j41084k03371o6102J25110P4685j77979k71619k33948
3785.5H00113380j70648p1228l0756n9068j05739q5532K9981l5226j54913j59383k69890
3807.9G99000978k21431Q881J03653M5597P4447k0683l82960l60787j51634r6917p093
3830.4G97992051P5638J67549J39892k20657m36961l11792j80364l5107J61350K36749
3850.8G97588348r9718n57244l92675r8467N3167O0260o4611p6830q1063k19643k41578
$$ y = [802570462, 802397072, 802422941, 802783787, 803156972, 803109944, 802794099, 802613258, 802546501, 802450657, 802298605, 802115381, 801939249, 801925838, 802196205, 802663743, 802967429, 802763939, 802318811, 802071512, 802058399, 802067101, 802061081, 802080274, 801911831, 801611602, 801474631, 801421881, 801235199, 800966382, 800868928, 800936699, 801009715, 801007688, 800866604, 800663233, 800597131, 800722241, 800796926, 800618947, 800347328, 800113380, 799942732, 799871504, 799840748, 799781680, 799675941, 799590409, 799620390, 799585164, 799430251, 799270868, 799000978, 798779547, 798788428, 798892081, 798937678, 799012125, 798991442, 798608482, 798247695, 798096061, 797999144, 797992051, 798067689, 798235238, 798375130, 798154473, 797717512, 797405720, 797225356, 797190249, 797351599, 797588348, 797488630, 796931386, 796538711, 796440244, 796493411, 796553671, 796489060, 796412230, 796331167, 796111524, 795869946]
3873.2G95869946j73807l2484J01924P9751N9366j29938l95954k86460j71244k05755
3893.6G94715345n1737J62661J82033q643k97248m33564k92123j29580q1301j9610
3914G93746233N0545j9431j20581j00791p4387q0347k2947N2809K2769r0122j32144
3936.4G93231606o8366j4544l7789m7505j1921m3750j17242j00553k4855r000o7830
3958.9G92688251j14084j01804p8679p3671o1870n5909n2035l2007k9803l3259j9372
3981.3G92035758m2378j45317k09987j24156k0445j7345k6285n4181
3997.6G91395664
$$ y = [795869946, 795696139, 795663655, 795765579, 795845330, 795904696, 795774758, 795378804, 795092344, 794921100, 794715345, 794663608, 794826269, 795008302, 794999659, 794702411, 794268847, 793976724, 793847144, 793765843, 793746233, 793796778, 793777347, 793656766, 793555975, 793481588, 793401241, 793378294, 793431103, 793453872, 793363750, 793231606, 793163240, 793148696, 793110907, 793063402, 793051481, 793007731, 792890489, 792789936, 792765081, 792756081, 792688251, 792574167, 792472363, 792393684, 792320013, 792258143, 792202234, 792150199, 792118192, 792088389, 792055130, 792035758, 791993380, 791848063, 791638076, 791513920, 791493475, 791476130, 791449845, 791395664]
##END=$$ End of the data block
