##TITLE=Julia 3 $$ Begin of the data block
##JCAMP-DX=5.00 $$ ACD/SpecManager v 10.08
##SPECTROMETER/DATA SYSTEM=Alpha
##DATE=16 Sep 2014 08:23:38
##DATA TYPE=INFRARED SPECTRUM
##DATA CLASS=XYDATA
##ORIGIN=
##OWNER=
##NPOINTS=1765
##FIRSTX=399.76428223
##LASTX=3997.64306641
##MAXX=3997.64306641
##MINX=399.76428223
##MAXY=0.87160206
##MINY=0.53671074
##XFACTOR=1.0000000000
##YFACTOR=1.000000000000000e-9
##FIRSTY=0.79844266
##DELTAX=2.03961372
##XUNITS=1/CM
##YUNITS=ARBITRARY UNITS
##XYDATA=(X++(Y..Y))
399.8G98442662j350940k284348J32978L310323L076375N17130l7015K144039L555715
$$ 798442662 797091722 794807374 794940352 798250675 801327050 801844180 801807165 803951204 807506919
418.1H07506919P64429j652121o020J774669P11977j264214n06938J839340J501798
$$ 807506919 808271348 806619227 806613207 808387876 809099853 807835639 807328701 809168041 810669839
436.5H10669839r08076j267255P89166J788199J14023j360416r1016K003193J518488
$$ 810669839 809761763 808494508 809283674 811071873 811185896 809825480 809734464 811737657 813256145
454.8H13256145q29518j294971Q22842J311422r35972j965940L2902J774430L11673
$$ 813256145 812426627 811131656 811954498 813265920 812329948 810364008 810396910 812171340 812483013
473.2H12483013k098143j627446O27220Q84295j550317l322780k598882k501905n807817
$$ 812483013 810384870 808757424 809384644 810268939 808718622 805395842 802796960 800295055 794487238
491.5G94487238j0090172j1009992p136642l28660N419075Q285463J0431170J1028827
$$ 794487238 784397066 773387074 766250432 765921772 771340847 779626310 790057480 801086307
507.9H01086307P095277K197385R27388J702845M34340k373100k332091P09057K350688
$$ 801086307 808181584 810378969 811306357 813009202 813443542 811070442 808738351 809447408 811798096
526.2H11798096M58359j676142j087844L92139p88927m247248o538511p188797r327709
$$ 811798096 812256455 810580313 809492469 809884608 809095681 804848433 798309922 791121125 781793416
544.6G81793416j3409079j4947474j0435819j778007N969584R817124J1048078J1464298
$$ 781793416 768384337 753436863 743001044 741223037 747192621 757009745 768057823 779522121
560.9G79522121R830534N759895K530754K551913L603339K488911J27852j89721J590133
$$ 779522121 789352655 795112550 797643304 800195217 803798556 806287467 806415319 806225598 807815731
579.3H07815731K000391O3717j248657m5717J386583K70664k133071k544939j225949
$$ 807815731 809816122 809879839 808631182 808585465 809972048 810242712 808109641 805564702 804338753
597.6H04338753j626372m285812n337835k583027P10130J37329m280865q254826q663297
$$ 804338753 802712381 798426569 793088734 790505707 791215837 791353166 787072301 778817475 770154178
616G70154178p016301k913952J0022521K6319623K7623892J4070272J963914k323389
$$ 770154178 763137877 760223925 770246446 796566069 824189961 838260233 840224147 837900758
632.3H37900758m078508n840420k646268L246904N495906M632473K074003p02739r80794
$$ 837900758 833822250 827981830 825335562 828582466 834078372 838710845 840784848 840082109 839101315
650.6H39101315Q90433J505494k00748j313031J10209J878381K148569J905679L59357
$$ 839101315 839991748 841497242 841296494 839983463 840093672 841972053 844120622 846026301 846385658
669H46385658m97043L96311j52350j087188L8385J420558L09050k087176k668381j575827
$$ 846385658 845888615 846284926 846132576 845045388 845083773 846504331 846813381 844726205 842057824 840481997
689.4H40481997j994074n412519q945703q008838p21097Q327246J1078119P597029
$$ 840481997 838487923 833075404 824129701 816120863 815399766 823727012 834805131 842402160
705.7H42402160M465759K764046L87550j168550q2492J642763R92418j214326j470506
$$ 842402160 846867919 849631965 850019515 848850965 848768473 850411236 851403654 850189328 848718822
724.1H48718822M70519J416385k6047j400053m68135J146078O72102j241625j644313
$$ 848718822 849189341 850605726 850579679 849179626 848711491 849857569 850529671 849288046 847643733
742.4H47643733j16229N55932j111328k848804k193093n63860j174569l991366o148100
$$ 847643733 847527504 848083436 846972108 844123304 841930211 841366351 840191782 836200416 830052316
760.8H30052316p822931j4065265k7041376l6570668k4360240Q393705L0562639K4887205
$$ 830052316 822229385 808164120 781122744 744552076 720191836 728585541 759148180 784035385
777.1G84035385J0371267N178214O825506P477999N728841M477024M467785L673315
$$ 784035385 794406652 799584866 806410372 813888371 819617212 824094236 828562021 832235336
793.4H32235336J517892J90795R29951J881898J057982l90291k29061Q93832M75585
$$ 832235336 833753228 833944023 834873974 836755872 837813854 837423563 837194502 838088334 838563919
811.8H38563919j329660j490295P39872K352655J458109l4214j43349K25962r42767
$$ 838563919 837234259 835743964 836483836 838836491 840294600 840260386 840117037 840342999 839400232
830.1H39400232m008353p676721j1730790j7205655k0537734j4254272n62966J0299981
$$ 839400232 835391879 827715158 815984368 798778713 778240979 763986707 763423741 773723722
846.4G73723722J5525519J7192722J5442669J1760295Q288383M941642J659870k2769
$$ 773723722 789249241 806441963 821884632 833644927 841933310 846874952 848534822 848512053
862.8H48512053K24472L03030j171768k750099k544522j254559j099407k321780k896249
$$ 848512053 848736525 849039555 847867787 845117688 842573166 841318607 840219200 837897420 835001171
881.1H35001171j921535j008093j600266k513468j748443J58966R62078K23995k55764
$$ 835001171 833079636 832071543 830471277 827957809 826209366 826368332 827330410 827554405 827298641
899.5H27298641N20051J161635K33948j231969j255631l0637L81768o45757j287877
$$ 827298641 827818692 828980327 829214275 827982306 826726675 826696038 827077806 826432049 825144172
917.8H25144172l08335R44435Q21174K5153M21583K025664K860546K070070J293778
$$ 825144172 824835837 825780272 826601446 826626599 827048182 829073846 831934392 834004462 835298240
936.2H35298240J953542K987981K576351J109362O05583J336754J487553M82917k49148
$$ 835298240 837251782 840239763 842816114 843925476 844531059 845867813 847355366 847838283 847589135
954.5H47589135p3135k39610j682699k875865j455307K223671M629791L425955R24349
$$ 847589135 847516000 847276390 845593691 842717826 841262519 843486190 848115981 851541936 852466285
972.9H52466285K45571Q83699P07149m51028q69572J11222Q96692J92762q58128n84305
$$ 852466285 852711856 853595555 854302704 853851676 852982104 853093326 853990018 854182780 853324652 852740347
993.3H52740347N09799O41465m12643j036882m27068J06693o74665j687110j177311
$$ 852740347 853250146 853891611 853478968 852442086 852015018 852121711 851447046 849759936 848582625
1011.6H48582625L62456R89199J86741n62191j21355N71430J63317q39174r38475j06454
$$ 848582625 848945081 849934280 850121021 849558830 849437475 850008905 850172222 849333048 848394573 848288119
1032H48288119K02834n53965j148522o31809J41978o8247r39906j149714m50611q0228
$$ 848288119 848490953 847936988 846788466 846156657 846298635 846230388 845290482 844140768 843690157 843609929
1052.4H43609929q23855j756132j790404j376212j591265k325237k478361j690745
$$ 843609929 842786074 841029942 839239538 837863326 836272061 833946824 831468463 829777718
1068.8H29777718r06229q45790r07541k67982O98566Q56340J09554l83795k0325M05967
$$ 829777718 828871489 828025699 827118158 826850176 827548742 828405082 828514636 828130841 828110516 828516483
1089.2H28516483L6180p46548r91285p06970r27389j999319k905130k830029k423346
$$ 828516483 828552663 827806115 826814830 826107860 825180471 823181152 820276022 817445993 815022647
1107.5H15022647k733886l456831l410101k659321k294421k360880k601624m119575
$$ 815022647 812288761 808831930 805421829 802762508 800468087 798107207 795505583 791386008
1123.8G91386008p127762p401347k57790J0155618J3858557R080649L127694N09798
$$ 791386008 784258246 776856899 776599109 786754727 800613284 809693933 812821627 813331425
1140.1H13331425o2823n76854j779497l503620m963160n719781o246626p352054r535432
$$ 813331425 813268602 812691748 810912251 807408631 802445471 796725690 790479064 783127010 773591578
1158.5G73591578j2928247j7984033k5403261l4445286m2560816m4548988l0890107
$$ 773591578 760663331 742679298 717276037 682830751 640269935 595720947 564830840
1172.8E64830840K803862M3193996O8206668O8128645N1207721L1459391J6606272
$$ 564830840 567634702 610828698 679035366 747164011 798371732 829831123 846437395
1187.1H46437395P603109K690315m06087k793252l984332l712952k889395k548099
$$ 846437395 854040504 856730819 856324732 853531480 849547148 845834196 842944801 840396702
1203.4H40396702k635061k505184k348363k969682m247785n049825m811465m212261
$$ 840396702 837761641 835256457 832908094 829938412 825690627 820640802 815829337 811617076
1219.7H11617076m068613m111945l561914k475202j741708j725554j752913j337528
$$ 811617076 807548463 803436518 799874604 797399402 795657694 793932140 792179227 790841699
1236G90841699j006484j233638j480043j140237m86493l79383j216769k391041l167093
$$ 790841699 789835215 788601577 787121534 785981297 785494804 785115421 783898652 781507611 778340518
1254.4G78340518l683447m593969n990863p259130q165777r231448j0662615j1886299
$$ 778340518 774657071 770063102 764072239 756813109 748647332 739415884 728753269 716866970
1270.7G16866970j2104928j1320293j0836184j1855364j3948858j5975058j7225683
$$ 716866970 704762042 693441749 682605565 670750201 656801343 640826285 623600602
1285F23600602j6523123j1999011l470361O079376J3633370K0543397K7631879K7147352
$$ 623600602 607077479 595078468 591608107 597687483 611320853 631864250 659496129 686643481
1301.3F86643481J2092233j0366619k4308562k1251857q081079M171193J0095835Q835017
$$ 686643481 698735714 688369095 664060533 642808676 634727597 638898790 648994625 657829642
1317.6F57829642M923463K304316M51147K340079J2065053K4812579L1022072K7429282
$$ 657829642 662753105 665057421 665508568 667848647 679913700 704726279 735748351 763177633
1333.9G63177633J7994106P201910k015173m947722M18663R029090J4251113J3870835
$$ 763177633 781171739 788373649 786358476 781410754 781829417 790858507 805109620 818980455
1350.2H18980455J0111988O016254L069997J300156j36375j971781l320933l235340
$$ 818980455 829092443 835108697 838178694 839478850 839342475 837370694 834049761 830814421
1366.6H30814421k822041k844930l136754l587663l523648l217638l383815l293216
$$ 830814421 827992380 825147450 822010696 818423033 814899385 811681747 808297932 805004716
1382.9H05004716k159238j016617r85443j087964o69181k33114k11000o83547j309573
$$ 805004716 802845478 801828861 800843418 799755454 799086273 798853159 798642159 797958612 796649039
1401.2G96649039j842797l258228n608976q069515j0435462j2120307j3115823j5367866
$$ 796649039 794806242 791548014 785939038 777869523 767434061 755313754 742197931 726830065
1417.5G26830065j7525017j0531068M375756J9773364K8086483K6136578J5008628
$$ 726830065 709305048 698773980 703149736 722923100 751009583 777146161 792154789
1431.8G92154789Q97408j6118110l3355415l2174348j2933732J5195668L5563231L8251579
$$ 792154789 793052197 776934087 743578672 711404324 698470592 713666260 749229491 787481070
1448.1G87481070K8273642J7781973J1879205Q827627M910946J357019Q48233O64354
$$ 787481070 815754712 833536685 845415890 854243517 859154463 860511482 861359715 862024069
1464.5H62024069k23100l8267R22263O21736j097321j887799j585126j338839j379073
$$ 862024069 861800969 861762702 862684965 863306701 862209380 860321581 858736455 857397616 856018543
1482.8H56018543r06229Q9348J85072j187980j902282j556456j850546k888918l262102
$$ 856018543 855112314 855201662 855386734 854198754 852296472 850740016 848889470 846000552 842738450
1501.2H42738450k585948k466083n468785p914186q244216q880496r143174q056581
$$ 842738450 840152502 837686419 832217634 824303448 816059232 807178736 798035562 789978981
1517.5G89978981m194558Q66115M349947N744875N833328N177855M642368K977192
$$ 789978981 785784423 786650538 791000485 796745360 802578688 807756543 812398911 815376103
1533.8H15376103P83920K59161p11500l228248m009425l884077l627479l692747l684163
$$ 815376103 816160023 816419184 815707684 812479436 808470011 804585934 800958455 797265708 793581545
1552.2G93581545l264367k691627m566788q952141p871092p213890q764208j2223362
$$ 793581545 790317178 787625551 783058763 774106622 766235530 759021640 750257432 738034070
1568.5G38034070j7692745j6406298k852499J9398272K1948337N648911o316662j2829125
$$ 738034070 720341325 703935027 701082528 720480800 742429137 748078048 741761386 728932261
1584.8G28932261j7331540k0928562k4042308k7401388l0787110l1262994k5951683
$$ 728932261 711600721 690672159 666629851 639228463 608441353 577178359 551226676
1599.1E51226676j4515937J263380J6698301K7610004L2289565K8494954J6875267
$$ 551226676 536710739 537974119 554672420 582282424 614571989 643066943 659942210
1613.4F59942210P54893j7165423k3656368k0753920j4616847k470255Q595824J2342036
$$ 659942210 660697103 643531680 619875312 599121392 584504545 582034290 590630114 602972150
1629.7F02972150R054899M165173K469837Q948088J8679738K4106920K2144496J5267909
$$ 602972150 612027049 616192222 618662059 627610147 646289885 670396805 692541301 707809210
1646G07809210M332900m707277j5138745k9954613k4654507j6340256j2101054p702530
$$ 707809210 712142110 707434833 692296088 662341475 637686968 621346712 609245658 601543128
1662.3F01543128l836750j106680R1493j32978m70578m09663n00977J48117J513064
$$ 601543128 597706378 596599698 596691191 596558213 596087635 595677972 595176995 595325112 596838176
1680.7E96838176M312635R046077J2066365J4615178J7904222J8376410J9984364K0324171
$$ 596838176 601150811 610196888 622263253 636878431 654782653 673159063 693143427 713467598
1697G13467598J7079592J5880942J2627602J1431634J1914611J0270476Q978904Q539855
$$ 713467598 730547190 746428132 759055734 770487368 782401979 792672455 801651359 810191214
1713.3H10191214Q510768Q126736N916238M271090M307807M301369L854453L691972
$$ 810191214 818701982 826828718 832744956 837016046 841323853 845625222 849479675 853171647
1729.6H53171647L617465L268659J707971P74920Q06868M62950P6115N2094L25024
$$ 853171647 856789112 860057771 861765742 862540662 863347530 863810480 863886595 863938689 864263713
1748H64263713M93288M73202P13348J146734J248240J179576P89047J25885J21951
$$ 864263713 864757001 865230203 865943551 867090285 868338525 869518101 870307148 870433033 870554984
1766.3H70554984M92990N54084k89261j261890j010537k18987J06811o258l1949J85967
$$ 870554984 871047974 871602058 871312797 870050907 869040370 868821383 868928194 868921936 868889987 869075954
1786.7H69075954O69181R28164K96771l57151o3181K73705K8789l53515k18690J76728
$$ 869075954 869745135 870673299 870970070 870612919 870549738 870823443 870852232 870498717 870280027 870456755
1807.1H70456755K69890o0976l17812j00016J13428M9412L6120K08259K52247K00510
$$ 870456755 870726645 870665669 870347857 870247841 870361269 870410681 870446801 870655060 870907307 871107817
1827.5H71107817n4360n61177n05448r5069j8537l6300K53499L03864k93552p12693
$$ 871107817 871053457 870492280 869986832 869891763 869873226 869836926 870090425 870394289 870100737 869388044
1847.9H69388044o58691m36246k25127j48714j77085j58310j073K53677L99292R9122
$$ 869388044 868729353 868293107 868067980 867919266 867742181 867583871 867582798 867836475 868235767 868334889
1868.3H68334889m51922m75645k05517j61350j88112q4102K8849j1266o7055n9903
$$ 868334889 867882967 867407322 867201805 867040455 866852343 866768241 866797090 866785824 866718769 866658866
1888.7H66658866j44898k22087l19660n22792n74351n54383p22944r71020j074016
$$ 866658866 866513968 866291881 865972221 865449429 864875078 864320695 863597751 862626731 861552715
1907.1H61552715q89063l79204J51872M58837O70731P97987P52866M53949Q6427M7564
$$ 861552715 860663652 860284448 860436320 860895157 861565888 862363875 863116741 863570690 863657117 863704681
1927.5H63704681J60635J46091R1135J71006L55303M25280K27510r0420j41799m0770
$$ 863704681 863865316 864011407 864102542 864273548 864628851 865054131 865281641 865191221 865049422 865008652
1947.9H65008652j15990k06769p3969J12593M0531k24769l16322q3685P6652j64986
$$ 865008652 864892662 864685893 864611924 864724517 864765048 864540279 864223957 864140272 864216924 864051938
1968.3H64051938m13179k93434l1114K2889j24395j86026n4598M6253m6551j61827
$$ 864051938 863638759 863345325 863314211 863337100 863212705 863026679 862972081 863018334 862971783 862809956
1988.7H62809956j08361o7413k13742l69489l72351k40981j66774k72274m20451m41969
$$ 862809956 862701595 862634182 862420440 862050951 861678600 861437619 861270845 860998571 860578120 860136151
2009H60136151l96013m54307n70118m40836J4305L78013L31282N3823r1016m7386o7472
$$ 860136151 859740138 859285831 858715713 858274877 858289182 858667195 858998477 859052300 858961284 858913898 858846426
2031.5H58846426k53975l86238l07739j90854k55466m14908m20034k88188k26379k88784
$$ 858846426 858592451 858206213 857898474 857707620 857452154 857037246 856617212 856329024 856102645 855813861
2051.9H55813861k73943o2347J74881K41220J83284K05636L00348K84373J25528j2458
$$ 855813861 855539918 855477571 855652452 855893672 856076956 856282592 856582940 856867313 856992841 856980383
2072.3H56980383l1113l8386j41024k37882j91510k8312Q7619L4511p4208o5863L7372
$$ 856980383 856949270 856910884 856769860 856531978 856340468 856312156 856399775 856434286 856360078 856294215 856331587
2094.7H56331587O4671j4126o1691k2769j9253j32203k51770k66492k06292k12490
$$ 856331587 856396258 856382132 856320441 856297672 856278419 856146216 855894446 855627954 855421662 855209172
2115.1H55209172l19779l64244k71857j90914k32875l12269k81632j63912j04785j34051
$$ 855209172 854889393 854525149 854253292 854062378 853829503 853517234 853235602 853071690 852966905 852832854
2135.5H52832854j54853p8738J6213J1027n3049o7889j4901J1146o4850j46032p3433
$$ 852832854 852678001 852599263 852615476 852626503 852573454 852505565 852490664 852501810 852436960 852290928 852217495
2157.9H52217495O5685M6372r1076j26123m0770J9491l1292j42813j72854j11341j00732
$$ 852217495 852283180 852329552 852238476 852112353 852071583 852091074 852059782 851916969 851744115 851632774 851532042
2180.4H51532042j92583k65657k14518j47283k05934k94029k64466j73569j74463k89440
$$ 851532042 851339459 851073802 850859284 850712001 850506067 850212038 849947572 849774003 849599540 849310100
2200.8H49310100l83615l53396k75433k63870k60771j57654j3351M2975j6272j23918
$$ 849310100 848926485 848573089 848297656 848033786 847773015 847615361 847602010 847644985 847628713 847504795
2221.2H47504795j85669j78516j83105k26498j93417p6055l7253j22130k01106j77563
$$ 847504795 847319126 847140610 846957505 846731007 846537590 846461535 846424282 846302152 846101046 845923483
2241.6H45923483j17004j37627k32637k65121j92165j38760j78218k10583j48058r0003
$$ 845923483 845806479 845668852 845436215 845171094 844978929 844840169 844661951 844451368 844303310 844213307
2262H44213307j39713k24471k37525j90556j74999k63095l74735l84032l40343l16381
$$ 844213307 844073594 843849123 843611598 843421042 843246043 842982948 842608213 842224181 841883838 841567457
2282.3H41567457k51890r9003O8605J20103N2095l398N425M7266R2268J47343K81334
$$ 841567457 841315567 841216564 841285169 841405272 841457367 841453969 841459394 841506660 841598928 841746271 842027605
2304.8H42027605M95433O50704O00875L89218L40581O61135J013457J006842P21872
$$ 842027605 842523038 843173742 843774617 844163835 844504416 845165551 846179008 847185850 847907722
2323.1H47907722N51879O48141O89984L80098K7180L7253J38104R5666j43052r84847
$$ 847907722 848459601 849107742 849797726 850177824 850205004 850242257 850380361 850476027 850332975 849348128
2343.5H49348128k318978k234161l17157J763821K721310K233088J015663k45333j104593
$$ 849348128 847029150 844794989 844477832 846241653 848962963 851196051 852211714 851966381 850861788
2361.9H50861788j710355k278388k703428k917946k934813k763212k531946k342820
$$ 850861788 849151433 846873045 844169617 841251671 838316858 835553646 833021700 830678880
2378.2H30678880k136171j832306j455724j090884p89464n63025m48883m67956n13494
$$ 830678880 828542709 826710403 825254679 824163795 823374331 822811306 822362423 821894467 821380973
2396.6H21380973m97162m52340m27723m51803m68612m15325l59774l69251l90291l65972
$$ 821380973 820883811 820431471 820003748 819551945 819083333 818668008 818308234 817938983 817548692 817182720
2417H17182720l37720l70503m31716m56035m78566n30362n89252o49154o80923o93083
$$ 817182720 816845000 816474497 816042781 815586746 815108180 814577818 813988566 813339412 812658489 811965406
2437.4H11965406p33972p82668p85709p37309o56784n91159n55455m73082l57747k81454
$$ 811965406 811231434 810448766 809663057 808925748 808268964 807677805 807122350 806649268 806291521 806010067
2457.8H06010067k34305j95623j64270j67847k17736k87711l56794m23312n08726o23166
$$ 806010067 805775762 805580139 805415869 805248022 805030286 804742575 804385781 803962469 803453743 802830577
2478.1H02830577p46489q17716p68602o08265m39704l59475l87073m72307n51224o39319
$$ 802830577 802084088 801266372 800497770 799889505 799449801 799090326 798703253 798230946 797679722 797040403
2498.5G97040403p47860q24153q61168q84235r01401q92043q47280q23736q60691r17733
$$ 797040403 796292543 795468390 794607222 793722987 792821586 791929543 791082263 790258527 789397836 788480103
2518.9G88480103r43243r42231r48906r81152j016676j038909j075983j148224j209915
$$ 788480103 787536860 786594629 785645723 784664571 783647895 782608986 781533003 780384779 779174864
2537.3G79174864j174450j038372q81434p00950m56870j93775M1604K51413M59790
$$ 779174864 778000414 776962042 776080608 775379658 774922788 774729013 774770617 775022030 775481820
2555.6G75481820P14123J051724J429379J744807J961052K064944J991033J724363
$$ 775481820 776195943 777247667 778677046 780421853 782382905 784447849 786438882 788163245
2572G88163245J300394P87437L02136j34170n67317r73523j254141j287281j057804
$$ 788163245 789463639 790251076 790553212 790419042 789851725 788878202 787624061 786336780 785278976
2590.3G85278976o26564k7537O57558J246393J538217J477003J216948Q89957M87566
$$ 785278976 784652412 784624875 785282433 786528826 788067043 789544046 790760994 791650951 792138517
2608.7G92138517L1590m01258p03156q48174r57787j066983j080871r28402o64711
$$ 792138517 792170107 791768849 791065693 790217519 789259732 788192749 787111878 786183476 785518765
2627G85518765m47213l03328j74880j38760k79307m99189o34611o58631o69420p44760
$$ 785518765 785071552 784768224 784593344 784454584 784175277 783676088 783041477 782382846 781713426 780968666
2647.4G80968666q12113p52509o30736o13034o81400o62446n31495m01974l46064l04759
$$ 780968666 780156553 779404044 778773308 778160274 777478874 776816428 776284933 775882959 775536895 775232136
2667.8G75232136j77502k6465N4360J54793L86238P26461J147330J618087K035201
$$ 775232136 775054634 775028169 775082529 775237322 775623560 776350021 777497351 779115438 781150639
2686.2G81150639K346754K526164K474010K208531J890421J585603J273155R30846
$$ 781150639 783497393 786023557 788497567 790706098 792596519 794182122 795455277 796386123
2702.5G96386123N92708L62695K44200J18196l3975j32203j36971j04547j64807k93851
$$ 796386123 796978831 797341526 797585726 797703922 797669947 797537744 797400773 797296226 797131419 796837568
2722.9G96837568l17990k58029k12371j39356n8174j0908j3232j26004k94507l83854
$$ 796837568 796519578 796261549 796049178 795909822 795851648 795840740 795827508 795701504 795406997 795023143
2743.3G95023143l87728m52936o49750q31961q72732q44598q76605r28581q99970q03888
$$ 795023143 794635415 794182479 793532729 792700768 791828036 790983438 790106833 789178252 788278282 787474394
2763.7G87474394p01368o31094n64635m88758m64737n60105p45714q60214q24034p26879
$$ 787474394 786773026 786141932 785577297 785088539 784623802 784063697 783317983 782457769 781633735 780906856
2784.1G80906856o53922o02901n73695n45979m77195m33266m93943n95034o25133o21855
$$ 780906856 780252934 779650033 779076338 778530359 778053164 777619898 777125955 776530921 775905788 775283933
2804.5G75283933o67513p39038q30888r22084r81629j004160r29117p51972n19812
$$ 775283933 774616420 773877382 773046494 772124410 771142781 770138621 769209504 768457532 767937720
2822.8G67937720k62320P450K50101L89040M49002N27382O50108O80565N60403M05669
$$ 767937720 767675400 767682850 767932951 768321991 768770993 769298375 769948483 770629048 771189451 771595120
2843.2G71595120K27631K98k71917n46217p48157q46803p86424o63936o59466o41346
$$ 771595120 771822751 771823049 771551132 771004915 770256758 769409955 768623531 767959595 767300129 766658783
2863.6G66658783m67658k99573k11775j38581j64032k05517n7578J25527J87517J86622
$$ 766658783 766191125 765891552 765679777 765541196 765377164 765171647 765114069 765239596 765427113 765613735
2884G65613735J65343J19627L9994J1206N3525q524k13384l73364m08351m29034n12064
$$ 765613735 765779078 765898705 765938699 765949905 766003430 765994906 765781522 765408158 764999807 764570773 764058709
2906.5G64058709n88059n11766k82645j53720j89543j86145o7831J47343L32534L90947
$$ 764058709 763470650 762958884 762676239 762522519 762332976 762146831 762079000 762226343 762558877 762949824
2926.8G62949824L25740N3465k80142m59969n62548o17028n09381l78728m99546p84457
$$ 762949824 763275564 763329029 763048887 762588918 762026370 761409342 760899961 760521233 760021687 759237230
2947.2G59237230q82685p29323o94454q38458q17895o21617m42684l71694l48628k49684
$$ 759237230 758354545 757625222 756930768 756092310 755274415 754652798 754210114 753838420 753489792 753240108
2967.6G53240108j00374R1374K65539L01957L49104M32790L14593J53601K34545M43637
$$ 753240108 753139734 753231108 753496647 753798604 754147708 754580498 754895091 755048692 755283237 755726874
2988G55726874O31034O42658M23371K74361K17378J38044K18391L86596N03302O79791
$$ 755726874 756357908 757000566 757423937 757698298 757915676 758053720 758272111 758658707 759162009 759841800
3008.4G59841800Q25107O67393K86579J4544n4658n781R5784J22786N2392O1930J15156
$$ 759841800 760666907 761334300 761620879 761635423 761580765 761574984 761670768 761793554 761845946 761907876 762023032
3030.9G62023032M7862j80185l91185l21865j92761l29078o68168j035273j117646
$$ 762023032 762070894 761890709 761499524 761177659 760984898 760655820 759987652 758952379 757834733
3049.2G57834733p19309j55986K20239M03584N01751N85854O93739P77960O71744M45008
$$ 757834733 757115424 756959438 757179677 757583261 758085012 758670866 759364605 760142565 760814309 761259317
3069.6G61259317M14610O14047Q59797R08137O41942M11391M28379M34994M05371M19319
$$ 761259317 761673927 762287974 763147771 764055908 764697850 765109241 765537620 765972614 766377985 766797304
3090G66797304L66867K97248L42071M62175M85360M06265M02213M66466M49717L39210
$$ 766797304 767164171 767461419 767803490 768265665 768751025 769157290 769559503 770025969 770475686 770814896
3110.4G70814896L53515M95791M56691K74181J38820L8981M4942J81854L37004L76702
$$ 770814896 771168411 771664202 772120893 772395074 772533894 772572875 772617817 772799671 773136675 773513377
3130.8G73513377K50816J34707J91688K33650L1770j95504j42753J13070L17872L15130
$$ 773513377 773764193 773898900 774090588 774324238 774356008 774160504 774017751 774130821 774448693 774763823
3151.2G74763823Q5175j77563k16782j56402k12908k64704k02895j45256k07543l20852
$$ 774763823 774848998 774671435 774454653 774298251 774085343 773820639 773617744 773472488 773264945 772944093
3171.6G72944093l28243k51770k49922l35276l97325m07159m34518n40495o98447q04842
$$ 772944093 772615850 772364080 772114158 771778882 771381557 770974398 770539880 769999385 769300938 768496096
3192G68496096q42750r46283j162052j357556j412868j368761j345456j361787j316369
$$ 768496096 767653346 766707063 765545011 764187455 762774587 761405826 760060370 758698583 757382214
3210.3G57382214j191854j129985j227498j455963j724482j996219k273798k367437
$$ 757382214 756190360 755060375 753832877 752376914 750652432 748656213 746382415 744014978
3226.7G44014978j944899r27329K53320J093983J575947J840293J842142J540839J114309
$$ 744014978 742070079 741142750 741396070 742490053 744066000 745906293 747748435 749289274 750403583
3245G50403583Q25048P37845P85411Q69334R03189R25481R18985P43985M55141K47776
$$ 750403583 751228631 751966476 752751887 753621221 754524410 755449891 756368876 757112861 757568002 757815778
3265.4G57815778J71662Q7201j84357m98176o05404o35147p75874r64343j046896j035273
$$ 757815778 757987440 758074641 757890284 757392108 756786704 756151557 755375683 754411340 753364444 752329171
3285.8G52329171j074970j169980j301467j470566j588881j662493j683473j546502
$$ 752329171 751254201 750084221 748782754 747312188 745723307 744060814 742377341 740830839
3302.1G40830839j360715j458049j838743k137900k246499k301216k426505k676725
$$ 740830839 739470124 738012075 736173332 734035432 731788933 729487717 727061212 724384487
3318.4G24384487k931476l107667l332376l650785l887355l994525m139960m378438
$$ 724384487 721453011 718345344 715012968 711362183 707474828 703480303 699340343 694961905
3334.8F94961905m647910m976452n392789n865634o467461p251740q183062r398997
$$ 694961905 690313995 685337543 679944754 674079120 667611659 660359919 652176857 642777860
3351.1F42777860j0932624j2446642j3404846j3050497j0500967n243361J981377Q772314
$$ 642777860 631845236 619398594 605993748 592943251 582442284 577198923 579180300 587952614
3367.4E87952614J2308001J1306346O576478J00255n686819q027315n209625J317680
$$ 587952614 600260615 611566961 618143439 618243694 612556875 604529560 599319935 600637615
3383.7F00637615P668733J1133314J1621296R885549O964326M329324K642751J462757
$$ 600637615 608306348 619439662 631060958 640946507 647910833 652240157 654882908 656345665
3400F56345665L76761m43637p57933q22007r68099j180172j357973j447439j405179
$$ 656345665 656722426 656278789 655520856 654698849 653730750 652550578 651192605 649745166 648339987
3418.4F48339987j389623j475811j489997j387000j289844j364172j447499j384616
$$ 648339987 646950364 645474553 643984556 642597556 641307712 639943540 638496041 637111425
3434.7F37111425j485049j771033j881302j834571j975477k650499l991008n863845
$$ 637111425 635626376 633855343 631974041 630139470 628163993 625513494 621522486 615658641
3451F15658641q198440j0225713r966493n898774J002133P500053J0187029Q170426
$$ 615658641 607460201 597234488 587267995 581369221 582371354 589871407 600058436 608228862
3467.3F08228862L886760Q36610Q24392L077626N770207P600427Q111596P631957O700099
$$ 608228862 612115622 612952232 613776624 616854250 622624457 630224884 638336480 645968437 652668536
3485.7F52668536N528867M414678L713011L338516L033698K674818K478838K458572
$$ 652668536 658197403 662612081 666325092 669663608 672697306 675372124 677850962 680309534
3502F80309534K139807J761973J847625K051651K073467J931667J734018J763583K001822
$$ 680309534 682449341 684211314 686058939 688110590 690184057 692115724 693849742 695613325 697615147
3520.4F97615147K175808J979053J606702J538873J657367J790285J975238J966179
$$ 697615147 699790955 701770008 703376710 704915583 706572950 708363235 710338473 712304652
3536.7G12304652J803755J962424K257824K178311J729667J496196J678944J763463
$$ 712304652 714108407 716070831 718328655 720506966 722236633 723732829 725411773 727175236
3553G27175236J718342J898110K145529K212763K230882K353668K304733J858533J621902
$$ 727175236 728893578 730791688 732937217 735149980 737380862 739734530 742039263 743897796 745519698
3571.3G45519698J876950K213478K360165K467334K647341K855837K925754K564668
$$ 745519698 747396648 749610126 751970291 754437625 757084966 759940803 762866557 765431225
3587.7G65431225K106965K190709K550244K649129K534926K435267K343714K329469
$$ 765431225 767538190 769728899 772279143 774928272 777463198 779898465 782242179 784571648
3604G84571648K398669K443731K378106K345980K344548K276540K285898K153098J802862
$$ 784571648 786970317 789414048 791792154 794138134 796482682 798759222 801045120 803198218 805001080
3622.3H05001080J775324K060533K078593J411259R35256J013995J095593J134395
$$ 805001080 806776404 808836937 810915530 812326789 813262045 814276040 815371633 816506028
3638.7H16506028J199901J265407J533866J923859J729667N46336k02834Q3565N21601
$$ 816506028 817705929 818971336 820505202 822429061 824158728 824705064 824502230 824585795 825107396
3657H25107396N23388K99454K00331M42684Q22007Q28266M65155L52502J13368n36561
$$ 825107396 825630784 825930238 826130569 826573253 827395260 828223526 828688681 829041183 829154551 828617990
3677.4H28617990o38783k37524L53515J018703J421511R07421r6440k67148L5286K18451
$$ 828617990 827979207 827741683 828095198 829113901 830535412 831442833 831346393 831079245 831114531 831332982
3697.8H31332982L21865K88903R7514J62959M71115M52578j60635o11543l59357J33097
$$ 831332982 831654847 831943750 832041264 832204223 832675338 833127916 832967281 832355738 831996381 832129478
3718.2H32129478M48764M21762R5070j83463k0624M74751Q17180M33266n05268q33094
$$ 832129478 832578242 833000004 833095074 832911611 832890987 833365738 834182918 834616184 834110916 833277822
3738.6H33277822m16100j3352L3796n901P1287k25603p75278o66380k24888j16885
$$ 833277822 832861722 832848370 832882166 832876265 832947552 832721949 831946671 831280291 831055403 830938518
3759H30938518k93791k19405N8234J38819l7014l51191m42565r4831K89202J57237
$$ 830938518 830644727 830425322 830483556 830622375 830585361 830234170 829791605 829696774 829985976 830143213
3779.4H30143213k91824l57211k03669j65105j41739n3525J22368K49803J94490Q1301
$$ 830143213 829851389 829494178 829290509 829125404 828983665 828930140 829052508 829302311 829496801 829578102
3799.8H29578102o6460k26795l32356n23865m95613o8724L16561L47733K33769M6909
$$ 829578102 829511642 829284847 828952491 828428626 827933013 827864289 828180850 828528583 828762352 828809261
3820.2H28809261m58836o86109m37379j70767N9843K64525L77119K65598j13309l99887
$$ 828809261 828350425 827664316 827226937 827056170 827116013 827380538 827757657 828023255 827909946 827510059
3840.6H27510059n07712n44549k97486K41160O50168K73764o87421p33912k56776R6201
$$ 827510059 827002347 826457798 826160312 826401472 827051640 827325404 826637983 825904071 825647295 825743496
3861H25743496J88172L4273k2590k921k45213m60089l56257p2062J45674Q5473j2338
$$ 825743496 825931668 825965941 825943351 825940430 825695217 825235128 824878871 824806809 824952483 825037956 825025618
3883.4H25025618j43945l75927k87652j54972k15769n3525K70367L27647L1769l56018
$$ 825025618 824881673 824505746 824218094 824063122 823847353 823793828 824064195 824391842 824423611 824067593
3903.8H24067593o14941n98014l60429n4956J74880J73867l3677j46925o9916o0857
$$ 824067593 823452652 822854638 822494209 822439253 822614133 822788000 822754323 822607398 822537482 822476625
3924.2H22476625j64747j20342L4631j1981k16543k62499j01805L6061k3008j42634
$$ 822476625 822311878 822191536 822226167 822214186 821997643 821735144 821633339 821669400 821646392 821503758
3944.6H21503758r9957L517k6107j02043j19448q2254j2934l7253j48416j49488q2553
$$ 821503758 821403801 821407318 821381211 821279168 821159720 821077466 821064532 821027279 820878863 820729375 820646822
3967H20646822n8412n066P867p2777j46508j59204r4176m1663o0678o0320n4001p6712
$$ 820646822 820588410 820583344 820591211 820518434 820371926 820212722 820118546 820076883 820016205 819955885 819901884 819825172
3991.5H19825172p5936q1956j14143
$$ 819825172 819749236 819667280 819553137
3997.6H19553137
$$ 819553137
##END=$$ End of the data block
