##TITLE=Julia 02 $$ Begin of the data block
##JCAMP-DX=5.00 $$ ACD/SpecManager v 10.08
##SPECTROMETER/DATA SYSTEM=Alpha
##DATE=09 Sep 2014 08:39:12
##DATA TYPE=INFRARED SPECTRUM
##DATA CLASS=XYDATA
##ORIGIN=
##OWNER=
##NPOINTS=1765
##FIRSTX=399.76428223
##LASTX=3997.64306641
##MAXX=3997.64306641
##MINX=399.76428223
##MAXY=0.81008941
##MINY=0.02353260
##XFACTOR=1.0000000000
##YFACTOR=1.000000000000000e-9
##FIRSTY=0.78802162
##DELTAX=2.03961372
##XUNITS=1/CM
##YUNITS=ARBITRARY UNITS
##XYDATA=(X++(Y..Y))
399.8G88021624J1231601O498099K934694O21676M42744L38971j370728l205776m563153
$$ 788021624 799253225 805751324 808686018 809307694 809750438 810089409 808718681 805512905 800949752
418.1H00949752n573928n447388q107364j8776417l7826478m5208633j2910247L4551323
$$ 800949752 795375824 789928436 781821072 763044655 725218177 680009544 667099297 701650620
434.4G01650620M8502862L1356454J4144659O080747K998590K120197J350820n8532
$$ 701650620 750153482 781509936 795654595 801735342 804733932 806854129 808204949 808146417
450.8H08146417o64770L11553J175225L82066q78632p98584R2865J78217o67095j141906
$$ 808146417 807481647 807793200 808968425 809350491 808471859 807673275 807766140 807944357 807277262 806135356
471.2H06135356q63194o32286r69827j638055j890361j820147k239526l482938n071759
$$ 806135356 805272162 804639876 803670049 802031994 800141633 798321486 796081960 792599022 787527263
489.5G87527263o883740j0553003j9089996l6655605o1706007o3673615o493032O2223553
$$ 787527263 780643523 770090520 751000524 714344919 652638912 588965297 582472265 644695818
505.8F44695818P3116959M3214738J8563986O706238N51343j695693j144111o78420
$$ 644695818 717812777 761027515 779591501 786297739 786849082 785153389 784009278 783330858
522.1G83330858j853407l440201l973782m694402p716656j2815893j9175768k8372466
$$ 783330858 781477451 778037250 774063468 769369066 761652410 748836517 729660749 701288283
538.5G01288283m2301178n6676269n9395373l8769304K485513M3103576O1732888N6620658
$$ 701288283 658987105 602310836 542915463 504146159 506631672 549735248 611468136 668088794
554.8F68088794M0894985K5691509J4327884O803155K656460m06504n253792j2441337
$$ 668088794 708983779 734675288 749003172 755806327 758462787 758056283 752802491 740361154
571.1G40361154j6446352p486343J0099530J7212868J1356055M983724K235174K81512
$$ 740361154 723914802 716428459 726527989 743740857 755096912 760080636 762315810 762597322
587.4G62597322j926898l550292m549443o138325r491265j4608383k0922422k8135837
$$ 762597322 760670424 757120132 752570689 746432364 736941099 722332716 701410294 673274457
603.7F73274457l2026648j8977225J5386284M4268190M3164254K4473309R562492K938569
$$ 673274457 641247809 622270584 637656868 681925058 725089312 749562621 759125113 762063682
620G62063682M90189j463652l851891o150841q047700n462349L150940P844806N036712
$$ 762063682 762553871 761090219 757238328 751087487 743039787 737577438 740728378 748573184 753609896
638.4G53609896K264380J315832K41220n51879l21090r060o99520k048433k818942
$$ 753609896 755874276 757190108 757431328 756879449 756558359 756549299 755849779 753801346 750982404
656.8G50982404k959132l918231n951345p543385j0861754j5289545j3158501j5829801
$$ 750982404 748023272 744105041 738153696 730610311 719748557 704459012 691300511 675470710
673.1F75470710k9153109m3477297l1758487R816647L4748196K2305250J949668q295953
$$ 675470710 646317601 602840304 571081817 580898464 615646660 637951910 639901578 631605625
689.4F31605625j2438476j7401040k9743373m5450389m5409501k0568222J1525363
$$ 631605625 619167149 601766109 572022736 526572347 481162846 460594624 472119987
703.7D72119987L1569660L7310302L5221159L0876399K6651918K2768796J8837035
$$ 472119987 503689647 540999949 576221108 607097507 633749425 656518221 675355256
717.9F75355256J5331864J2795567J1155904R636462P769644O153345N451679N207300
$$ 675355256 690687120 703482687 714638591 724275053 732044697 738198042 743649721 748857021
734.3G48857021M544437L460288K806306K869129K681435J658976M21881k73943j027703
$$ 748857021 753401458 756861746 759668052 762537181 765218616 766877592 767299473 767025530 765997827
752.6G65997827l294468q161962j4792859k4681867n3061247j06178164j21141881
$$ 765997827 762703359 754541397 739748538 715066671 662005424 555827260 434685379
766.9D34685379k6966035R8112315J24906182P4400365L0472398J2195170O197751
$$ 434685379 407719344 505831659 630737841 705138206 735610604 747805774 754003525
781.2G54003525L675461J534044q19325m090846j0048389j8561542k3734570j4811873
$$ 754003525 757678986 759213030 758393705 754302859 744254470 725692928 701958358 687146485
797.5F87146485R134769K9544890L0871272K0122290J0488749M953086J506567r41038
$$ 687146485 696281254 725826144 756697416 776819706 787308455 792261541 793768108 792827070
813.8G92827070k255202l041923m359662o271124q056164j0008275j3682485j9791782
$$ 792827070 790571868 787529945 783170283 776899159 768842995 758834720 745152235 725360453
830.1G25360453k5598347k3120403o611050J4799297K3960054J7786443N816043n992651
$$ 725360453 699762106 676641703 670030653 684829950 708790004 726576447 732392490 726399839
846.4G26399839j8346012l3510685m6589553l5836101O160975L6755741K3087978j3511062
$$ 726399839 708053827 674543142 627953589 592117488 598278463 635034204 658122182 644611120
862.8F44611120m7021806n5567503r984970O4517796R3639314O5203130K9040814J0430276
$$ 644611120 597589314 542021811 532036841 596554637 690193951 755397081 784437895 794868171
879.1G94868171L757954J490176O8783j385092k351284k671242k855182l293216l882706
$$ 794868171 798626125 800116301 800185084 798799992 796448708 793777466 790922284 787629068 783746362
897.4G83746362m175484m298628m884302o119311p453800q563637r783805j1510670
$$ 783746362 779570878 775272250 770387948 764268637 756814837 748251200 738467395 726956725
913.7G26956725j3584375j5565157j7488957j9614994k1741808k3201406k3396849
$$ 726956725 713372350 697807193 680318236 660703242 638961434 615760028 592363179
928E92363179k1977246j8905044j4222979q082688j165450N426228J0724247J4447570
$$ 592363179 570385933 551480889 537257910 529175222 528009772 533436000 544160247 558607817
944.3E58607817J6810953J7974198J7210066J2991667O137491L641367R831905J4033139
$$ 558607817 575418770 593392968 610603034 623594701 629732192 633373559 643205464 657238603
960.7F57238603O920039l51906N996943J9777775K5439143J9964099J1121511L468037
$$ 657238603 664158642 663806736 669803679 689581454 715020597 734984696 746106207 749574244
977G49574244m466355j5246212k2669852j1795580J2264907K2843480J4539599L846169
$$ 749574244 745107889 729861677 707191825 695396245 707661152 730504632 745044231 748890400
993.3G48890400j819730m837692p303536r664952j2057364j4810026j8099129k1210730
$$ 748890400 747070670 742232978 734929442 725264490 713207126 698397100 680297971 659087241
1009.6F59087241k2015393j8158436j0851145l598272O708502K3006320L4062028K9951275
$$ 659087241 637071848 618913412 608062267 604463995 611172497 634178817 668240845 698192120
1025.9F98192120J7710030P068336o8188n127907r215057j2172639j2189150p060766
$$ 698192120 715902150 722970486 722902298 717774391 708559334 696386695 684197545 677136779
1042.2F77136779K357542J1209131J4976740J3679027J0134280O552696L616214J302421
$$ 677136779 679494321 690703452 705680192 719359219 729493499 736046195 739662409 740964830
1058.6G40964830l95596j618087k609671l499209m159153m554212m903495n481899
$$ 740964830 740569234 738951147 736341476 732842267 728683114 724128902 719225407 713743508
1074.9G13743508o057143o126821n659104n073130m597664m093110l569067l207207
$$ 713743508 707686365 701559544 695900440 690827310 686229646 682136536 678567469 675360262
1091.2F75360262l272116l792226m601121n583763p060826r667099j3458609j6396105
$$ 675360262 672088146 668295920 663694799 658111036 651050210 641383111 627924502 611528397
1107.5F11528397j4259994n995810K319216M419804J891255R46045M059792M744589
$$ 611528397 597268403 591272593 593591809 598011613 599902868 600848913 604908705 609653294
1123.8F09653294o649554k3942887j8999041J5473903M1269183L5182774J7326176
$$ 609653294 603003740 579060853 560061812 575535715 616804898 651987672 669313848
1138.1F69313848N915582R69231r09745j554490k030372k582371k750934k348959j983643
$$ 669313848 675229430 676198661 675288916 673734426 671704054 669121683 666370749 664021790 662038147
1156.5F62038147k257943l202736m825831p554829j2052357j8728852k7790964l8932144
$$ 662038147 659780204 656577468 651751637 644196808 632144451 613415599 585624635 546692491
1172.8E46692491m8855693m8999965l2310337l450006K8337717N9135169P6410532
$$ 546692491 497836798 448836833 416526496 413076490 441414207 500549376 576959908
1187.1E76959908O4447165L4758687J1447906M54724l777027n013883m792989m166782
$$ 576959908 641407073 676165760 687613666 688068390 684291363 679277480 674484491 670317709
1203.4F70317709l772437l753603l948867m343212m903853n182147m712879l809810
$$ 670317709 666545272 662791669 658842802 654499590 649595737 644413590 639700711 635890901
1219.7F35890901l402829l813684m501581m852891n070567n773485o991088q144975
$$ 635890901 632488072 628674388 624172807 619319916 614249349 608475864 601484776 593339801
1236E93339801r133399j0679066j3273060j6437173j9354224k2099555k5488555l0255854
$$ 593339801 584206402 573527336 560254276 543817103 524462879 502363324 476874769 446618915
1252.3D46618915l6616922m3978363n0420463n1722884m1222379j4105961K6212842
$$ 446618915 410001993 366023630 315603167 263880283 222657904 208551943 234764785
1266.6B34764785O3470065P6333493N9526295K9346734K780616j6485542l0535221
$$ 234764785 298234850 374568343 434094638 463441372 466221988 449736446 419201225
1280.9D19201225m0331095m6181858m8461795m6580955l9474443k8030336j5555903
$$ 419201225 378870130 332688272 284226477 237645522 198171079 170140743 154584840
1295.2A54584840m873142N311087J7814741K9280379K8787017R915575j8381685l7387609
$$ 154584840 149711698 155022785 172837526 202117905 230904922 240820497 222438812 185051203
1311.5A85051203l1316683L34129L2946020M0326014L1776354L3939451M7736198N6475371
$$ 185051203 153734520 154068649 187014669 227340683 259117037 293056488 340792686 397268057
1327.8C97268057N1872402L8170427K4363280J7106235J7945647K2826254K4179280
$$ 397268057 449140459 487310886 511674166 528780401 546726048 569552302 593731582
1342.1E93731582J9732535J2241185L888190l836096j0605156j6920209k3849070l2074988
$$ 593731582 613464117 625705302 629593492 625757396 615152240 598232031 574382961 542307973
1358.4E42307973m1356266m6002984l4975439j3368964K812058R206235J1247814J3685941
$$ 542307973 500951707 454948723 419973284 406604320 409416378 418622613 429870427 443556368
1374.7D43556368J4907539J3388932R331852L198952l507018j0683507j6363204j7523348
$$ 443556368 458463907 471852839 481184691 484383643 480876625 470193118 453829914 436306566
1391D36306566j7268479j8213987j9601882k1559149k1462440j7795831j0465920K911299
$$ 436306566 419038087 400824100 381222218 359663069 338200629 320404798 309938878 312850177
1407.3C12850177J6912818K3101747J6918838K303541j5874147l3768148l7715017
$$ 312850177 329762995 352864742 369783580 372087121 356212974 322444826 284729809
1421.6B84729809l1575174k0540773j115486K3295357M3958724N3673655O1634868
$$ 284729809 253154635 232613862 231498376 254793733 298752457 352426112 414060980
1435.9D14060980O0966075M4224768L2997251K7189016K1775306J7908454J3997137
$$ 414060980 475027055 519251823 552249074 579438090 601213396 619121850 633118987
1450.2F33118987J0824621Q968591Q410216O157935K053678k86997k043009l571331
$$ 633118987 643943608 652912199 661322415 667480350 669534028 669247031 667204022 663632691
1466.5F63632691l824055m013956n812287q079648j0242999j2197196j2767196j0148883
$$ 663632691 659808636 655794680 649982393 641902745 631659746 619462550 606695354 596546471
1482.8E96546471n723178m095078q016765j5079617j9219280k4419605l3535392l7715733
$$ 596546471 590823293 586728215 578711450 563631833 544412553 519992948 486457556 448741823
1499.1D48741823l4566938l1265468l7903875n3941190m5510754k8434217k1316558
$$ 448741823 414174885 382909417 345005542 291064352 245553598 217119381 195802823
1513.4A95802823k2287399k6924446k3024827j2242623P41929J2520313K2544690K8907254
$$ 195802823 173515424 146590978 123566151 111323528 112065457 124585770 147130460 176037714
1529.7A76037714L6142990M7002584M6068161M3326438N6137353N7434767M3855519
$$ 176037714 212180704 259183288 305251449 348577887 404715240 462150007 506005526
1544E06005526L6965370L2031893K8524101K4093747J8980444J4282226J1526227P411540
$$ 506005526 542970896 575002789 603526890 627620637 646601081 660883307 672409534 679821074
1560.3F79821074K098084L64124O75321J272380Q28684j863480p237911j7305196k5335609
$$ 679821074 681919158 682283282 682958603 684230983 685059667 683196187 675958276 658653080 633317471
1578.7F33317471l1786263m3923438n9720516p5342417p7102304m9436748j027762
$$ 633317471 601531208 557607770 497887254 422544837 345442533 296005785 294978023
1593B94978023L5458594M0504456K3918926O58095k5337070m7095209m3654919L418654
$$ 294978023 330436617 370941073 394859999 395518094 370181024 323085815 279430896 282849550
1609.3B82849550O8686068R5580727Q1308216M8648119J4568865k740264j0584294
$$ 282849550 351535618 447116345 528424561 577072680 591641545 588901281 578316987
1623.5E78316987j4777482j7991841k1129787k1534920k3024261k9278814k7978957
$$ 578316987 563539505 545547664 524417877 502882957 479858696 450579882 422600925
1637.8D22600925k1420240j8983990j8872023k3102909k6362390k1800428k6420415
$$ 422600925 401180685 382196695 363324672 340221763 313859373 292058945 265638530
1652.1B65638530m0145680l4702435l1509280l4787447l5846144k9538370j8570241
$$ 265638530 225492850 190790415 159281135 124493688 88647544 59109174 40538933
1666.4D0538933j1376338n629998P50810O733634J1094542J2147971J2144170J4564894
$$ 40538933 29162595 23532597 24283407 31017041 42111583 54259554 66403724 80968618
1682.7H0968618K0032771K0294220J8873937J9656822J7012462J4845312J5114322
$$ 80968618 101001389 121295609 140169546 159826368 176838830 191684142 206798464
1697B06798464K2987798M1362002M7087998M8504203M9368113M0212244L2498420K8913438
$$ 206798464 229786262 271148264 318236262 366740465 416108578 456320822 488819242 517732680
1713.3E17732680K8276801L0168951K7251660K1023572J9153297J8250227J5847921
$$ 517732680 546009481 576178432 603430092 624453664 643606961 661857188 677705109
1727.6F77705109J3468623J1089564R986102P855118N372822N320191N562365M998088
$$ 677705109 691173732 702263296 712249398 720104516 725477338 730797529 736359894 741357982
1743.9G41357982M586876M147529L592253K698779J771390J408697J058757N08606
$$ 741357982 745944858 750092387 753684640 756383419 758154809 759563506 760622263 761130869
1760.2G61130869j06871k73883J13070M61757L14593J07050M60029Q50618O68049m2320
$$ 761130869 761023998 760750115 760863185 761324942 761639535 761746585 762206614 763057232 763725281 763682961
1780.6G63682961o29484q10087o09159j91689L03924P01845Q65459Q99852O98328J35362
$$ 763682961 763053477 762243390 761634231 761442542 761746466 762448311 763313770 764213622 764911950 765047312
1801G65047312n05269n68807O5386R52065J493693J803815K300739K803684K827584
$$ 765047312 764542043 763973236 764038622 764990687 766484380 768288195 770588934 773392618 776220202
1819.4G76220202K385915J883149J289487N99563M2021k38955j86562p75J18613K35558
$$ 776220202 778606117 780489266 781778753 782378316 782420337 782181382 781994820 781994045 782112658 782348216
1839.8G82348216M54843N79416L85464J99914L23534N07831N29051L67284J86920J02639
$$ 782348216 782803059 783382475 783767939 783967853 784291387 784799218 785328269 785695553 785882473 785985112
1860.2G85985112O7830L3677J3411n3227k40803l62456m37438n72801o57737o55949
$$ 785985112 786052942 786086619 786100030 786046803 785806000 785443544 785006106 784433305 783775568 783119619
1880.5G83119619p21097q58963q48293o52075m28259k13921L7730L50832O76811P86126
$$ 783119619 782398522 781539559 780691266 780039191 779610932 779397011 779434741 779785573 780462384 781248510
1900.9G81248510N47409J21832k57909n14210o04987m25279M1723P24256J379431J760721
$$ 781248510 781795919 781917751 781659842 781145632 780540645 780115366 780157089 780881345 782260776 784021497
1921.3G84021497J892924J756311J395463Q61288J61230n03838q53836p09117r1910
$$ 784021497 785914421 787670732 789066195 789927483 790088713 789584875 788731039 788021922 787930012
1939.7G87930012O83665J121163J072288P76887L06964l74854j273691k194226k476692
$$ 787930012 788613677 789734840 790807128 791584015 791890979 791516125 790242434 788048208 785571516
1958.1G85571516j468599L69429J790822K242565J959145J379192Q81195N86510M27305
$$ 785571516 784102917 784472346 786263168 788505733 790464878 791844070 792725265 793311775 793739080
1976.4G93739080K77698J34051J09375J89006K69771K86221K59757K01285J31250R9003
$$ 793739080 794016778 794150829 794260204 794449210 794718981 795005202 795264959 795466244 795597494 795696497
1996.8G95696497J06037J70111K42293K22445P5519r0838j70469j87337k20716l06845
$$ 795696497 795802534 795972645 796214938 796437383 796512902 796422064 796251595 796064258 795843542 795536697
2017.2G95536697l63469l17693k67267l31879m47869m96686n03242o03795p69555q14975
$$ 795536697 795173228 794855535 794588268 794256389 793808520 793311834 792808592 792204797 791435242 790620267
2037.6G90620267o74009n07593n14865o47008o85633o05285o09457p06911p27415o60778
$$ 790620267 789946258 789438665 788923800 788276792 787591159 786985874 786376417 785669506 784942091 784281313
2058G84281313o73890q22484j018942j161336j194180j232206j326323j319706j111567
$$ 784281313 783607423 782784939 781765997 780604661 779410481 778178275 776851952 775532246 774420679
2076.4G74420679q04246n07653k09868J67907N69403Q10265Q35300P14838N04733J74760
$$ 774420679 773616433 773108780 772898912 773066819 773636222 774446487 775281787 775996625 776501358 776676118
2096.8G76676118k75492p13051r13024q08239n40614k42471M7445L09527M80234N20885
$$ 776676118 776400626 775687575 774774551 773966312 773425698 773183227 773230672 773540199 774020433 774541318
2117.1G74541318M63546L87251K91407J33574q3923k64943l15487k83182k76804l17395
$$ 774541318 775004864 775392115 775683522 775817096 775733173 775468230 775152743 774869561 774592757 774275362
2137.5G74275362l26573l21687m06742n78463o97851p10964p15912p92145r25422j059175
$$ 774275362 773948789 773627102 773220360 772641897 771944046 771233082 770517170 769725025 768799603 767740428
2157.9G67740428j116931j044273q66831n97477k81334k3543J05083J27852R5367M7505
$$ 767740428 766623497 765579224 764712393 764114916 763833582 763810039 763915122 764042974 764138341 764185846
2178.3G64185846J0431k3663o1095j35601k58028l99769m86970m73856m11988l69966
$$ 764185846 764196277 764172614 764111519 763975918 763717890 763318121 762831151 762357295 761945307 761575341
2198.7G61575341l62158l91483m61399n05805m82977m32074m25100m93825n85377o52432
$$ 761575341 761213183 760821700 760360301 759854496 759371519 758939445 758514345 758020520 757435143 756782711
2219.1G56782711p15018p60555p33912o78897o78062p45356q50082r44793r82106r52780
$$ 756782711 756067693 755307138 754573226 753894329 753216267 752470911 751620829 750676036 749693930 748741150
2239.5G48741150q69453p08759m65572k14278l0637O4492L7491j26123m00007o97315
$$ 748741150 747871697 747162938 746697366 746483088 746452451 746516943 746554434 746428311 746028304 745330989
2259.9G45330989q70168q42154o79374n42223n61893o87480p76589q01206q03530q08239
$$ 745330989 744460821 743618667 742939293 742397070 741835177 741147697 740371108 739569902 738766372 737958133
2280.3G37958133q49187r18746r93908j096725j221299j338423j396834j317978j108706
$$ 737958133 737108946 736190200 735196292 734099567 732878268 731539845 730143011 728825033 727716327
2298.7G27716327q72433o63221n03362m01198l44754l51369m23730n84363q35181j086950
$$ 727716327 726843894 726180673 725677311 725276113 724931359 724579990 724156260 723571897 722736716 721649766
2319.1G21649766j259685j314759j275599j289546j350820j235605r61125p65740o93143
$$ 721649766 720390081 719075322 717799723 716510177 715159357 713923752 712962627 712196887 711503744
2337.4G11503744o37829n67496m96745l65973l52382o90699j197874j563311j629710
$$ 711503744 710865915 710298419 709801674 709435701 709083319 708392620 707194746 705631435 704001725
2355.8G04001725j497507j353562j273632j149357j018822j034677j096249j115679
$$ 704001725 702504218 701150656 699877024 698727667 697708845 696674168 695577919 694462240
2372.1F94462240j175583j196682j081050r48846r70960j149237j335859j415312j418829
$$ 694462240 693286657 692089975 691008925 690060079 689089119 687939882 686604023 685188711 683769882
2390.4F83769882j433730j465500j438260j343131j274109j290023j369715j460612
$$ 683769882 682336152 680870652 679432392 678089261 676815152 675525129 674155414 672694802
2406.8F72694802j529395j586497j638770j625717j512349j368701j296401j272082
$$ 672694802 671165407 669578910 667940140 666314423 664802074 663433373 662136972 660864890
2423.1F60864890j209140j151681j174092j267195j385272j492738j595021j718044
$$ 660864890 659655750 658504069 657329977 656062782 654677510 653184772 651589751 649871707
2439.4F49871707j838565j904249j898766j906335k037942k276779k519011k695382
$$ 649871707 648033142 646128893 644230127 642323792 640285850 638009071 635490060 632794678
2455.7F32794678k772510k720892k565086k368629k226174k159059k066672j912773
$$ 632794678 630022168 627301276 624736190 622367561 620141387 617982328 615915656 614002883
2472F14002883j743316j627207j638234j803517k065659k330124k488434k477169k366543
$$ 614002883 612259567 610632360 608994126 607190609 605124950 602794826 600306392 597829223 595462680
2490.4E95462680k235949k062679j861989j721084j680970j783073k054930k417803
$$ 595462680 593226731 591164052 589302063 587580979 585900009 584116936 582062006 579644203
2506.7E79644203k750218l000796l197431l397048l592848l729642l825605l928721
$$ 579644203 576893985 573893189 570695758 567298710 563705862 559976220 556150615 552221894
2523E52221894m009247m033029m022359l990591l946662l889263l815829l717721l551304
$$ 552221894 548212647 544179618 540157259 536166668 532220006 528330743 524514914 520797193 517245889
2541.4E17245889l311456k969563k429068j618147n87165N18441J623452K707839L650606
$$ 517245889 513934433 510964870 508535802 506917655 506330490 506848931 508472383 511180222 514830828
2559.7E14830828M333138M795253N168438N473972N615175N555629N296409M851938
$$ 514830828 519163966 523959219 529127657 534601629 540216804 545772433 551068842 555920780
2576E55920780M237771L397882K318144J111090r6321j192272k038956k508282k519131
$$ 555920780 560158551 563556433 565874577 566985667 566889346 565697074 563658118 561149836 558630705
2594.4E58630705k086520j279891j96874R43601J853645K343595K369225J982868J328230
$$ 558630705 556544185 555264294 555067420 556011021 557864666 560208261 562577486 564560354 565888584
2612.8E65888584N63979k08318r01401j423121j721382j841366j852215j772761j665890
$$ 565888584 566452563 566244245 565342844 563919723 562198341 560356975 558504760 556731999 555066109
2631.1E55066109j638532j694024j796543j929164k041340k087653k019107j857460
$$ 555066109 553427577 551733553 549937010 548007846 545966506 543878853 541859746 540002286
2647.4E40002286j710355j636386j631438j677335j762092j835763j836718j742780
$$ 540002286 538291931 536655545 535024107 533346772 531584680 529748917 527912199 526169419
2663.7E26169419j526475j165688o32882J12951J019001J997948L007710L953457M711687
$$ 526169419 524642944 523477256 522844374 522957325 523976326 525974274 528981984 532935441 537647128
2682.1E37647128N244315N574226N693078N582571N288899M920781M523814M077136
$$ 537647128 542891443 548465669 554158747 559741318 565030217 569950998 574474812 578551948
2698.4E78551948L560066K929926K117992J097023N663r88543j787425k283036k408684
$$ 578551948 582112014 585041940 587159932 588256955 588262618 587274075 585486650 583203614 580794930
2716.8E80794930k155900j583993q43942o1453P13170J424253K004504K363444K450525
$$ 580794930 578639030 577055037 576211095 576149642 576862812 578287065 580291569 582655013 585105538
2735.1E85105538K296269J861990J087665J07587q81315j791417k540529l082693l419578
$$ 585105538 587401807 589263797 590351462 590459049 589577734 587786317 585245788 582163095 578743517
2753.5E78743517l545403l481448l237664k854944k447307k095759j888275j907945
$$ 578743517 575198114 571716666 568479002 565624058 563176751 561080992 559192717 557284772
2769.8E57284772k124846k465725k855360l194094l397763l438889l318012l087878
$$ 557284772 555159926 552694201 549838841 546644747 543246984 539808095 536490083 533402205
2786.1E33402205k871454k730489k606154k475917k386808k320051k218783k089680
$$ 533402205 530530751 527800262 525194108 522718191 520331383 518011332 515792549 513702869
2802.4E13702869j995444j980483k032221k065956k024055j923740j784473j622916
$$ 513702869 511707425 509726942 507694721 505628765 503604710 501680970 499896497 498273581
2818.8D98273581j400500j070351o84380l22223L010K76685M58717N77182P20590R44615
$$ 498273581 496873081 495802730 495118350 494796127 494799137 495075822 495534539 496111721 496832311 497776926
2839.1D97776926J199811J391679J478494J500189J551628J667857J801670J901388
$$ 497776926 498976737 500368416 501846910 503347099 504898727 506566584 508368254 510269642
2855.5E10269642J889586J708031J348794Q35597K74658k12610n63263p62940q56697
$$ 510269642 512159228 513867259 515216053 516051650 516326308 516113698 515550435 514787495 513930798
2873.8E13930798r02176q99196q17955o78896n31733l91841k18273Q822K74598N90325
$$ 513930798 513028622 512129426 511311471 510632575 510100842 509709001 509490728 509499550 509774148 510364473
2894.2E10364473Q77321J043379J199663J422166J546920J457035J190901P94411K70128
$$ 510364473 511241794 512285173 513484836 514907002 516453922 517910957 519101858 519896269 520166397
2912.6E20166397l86655j055062j604319k031862k395511k654731k516806j808763
$$ 520166397 519779742 518724680 517120361 515088499 512692988 510038257 507521451 505712688
2928.9E05712688q39710l9876L59237L66509K57850K56777K91586K19106K8015j65046
$$ 505712688 504872978 504833102 505192339 505558848 505816698 506073475 506365061 506584167 506612182 506447136
2949.3E06447136k73823l88563n17130n55038n78225o40333p22587q33571r45210j054079
$$ 506447136 506173313 505784750 505267620 504712582 504134357 503494024 502771437 501937866 500992656 499938577
2969.7D99938577j114934j108200j050919q28624m55469j96278j22845j19805j69188
$$ 499938577 498823643 497715443 496664524 495835900 495380431 495184153 495061308 494941503 494772315
2988D94772315k85417m19706m96805m67360l16172p6771K37465O03884R34005J126975
$$ 494772315 494486898 494067192 493570387 493103027 492786855 492710084 492947549 493551433 494485438 495612413
3008.4D95612413J076579P65145L03268k01851o70523j024395j233935j290023j203120
$$ 495612413 496688992 497454137 497757405 497555554 496885031 495860636 494626701 493336678 492133558
3026.8D92133558r32038l76731M07547J256287J929342K138794J897663J337170N51552
$$ 492133558 491201520 490824789 491232336 492488623 494417965 496556759 498454422 499791592 500343144
3045.1E00343144N8770O90401K486646M104555M400134L739953K921998K183736J440823
$$ 500343144 500401914 501092315 503578961 507683516 512083650 515823603 518745601 520929337 522370160
3063.5E22370160N44846n87344j900733l078341l295422j800776Q34942K806545K893030
$$ 522370160 522915006 522327662 520426929 517348588 514053166 512252390 513087332 515893877 518786907
3081.9E18786907J554489J72973q4460R07123K214849K889455K651035J674116K64704
$$ 518786907 520341396 520514369 520429909 521337032 523551881 526441336 529092371 530766487 531031191
3100.2E31031191j084983j694500j270235j59860J152098K403021L300310L542244
$$ 531031191 529946208 528251708 526981473 526821613 527973711 530376732 533677042 537219286
3116.5E37219286L277242K869904K570629K554000K737522K873540K853751K763867
$$ 537219286 540496528 543366432 545937061 548491061 551228583 554102123 556955874 559719741
3132.8E59719741K760232K877951K932608K768397K531469K329171K068877J777351
$$ 559719741 562479973 565357924 568290532 571058929 573590398 575919569 577988446 579765797
3149.2E79765797J471281J004815M67896J39058n6684l59953q10444j352906j962364
$$ 579765797 581237078 582241893 582709789 582848847 582792163 582432210 581621766 580268860 578306496
3167.5E78306496k665996l504575m436135n193412n345702m557968k909839j028418
$$ 578306496 575640500 572135925 567699790 562506378 557160676 552602708 549692869 548664451
3183.8E48664451K92241O95288M37379k6643k80499K6941Q81433J874030K528489K571702
$$ 548664451 548956692 549651980 550089359 550062716 549782217 549809158 550690591 552564621 555093110 557664812
3204.2E57664812K075135J338661O81520L07500K53856L28004K38717j55151q22961
$$ 557664812 559739947 561078608 561760128 562067628 562321484 562649488 562888205 562733054 561910093
3222.6E61910093j573801k232254k816021l337324l790378m323423m931987n482912
$$ 561910093 560336292 558104038 555288017 551950693 548160315 543836892 538904905 533421993
3238.9E33421993n973458o490529p130861p844806q555740r188741r609461r735793
$$ 533421993 527448535 520958006 513827145 505982339 497426599 488237858 478628397 468892604
3255.2D68892604r521752q993954q306533p698625p370025p352829p548452p840991
$$ 468892604 459370852 450376898 442070365 434371740 427001715 419648886 412100434 404259443
3271.5D04259443p969200p753373p466644p533520q267552r786874j1783540j3684094
$$ 404259443 396290243 388536870 381070226 373536706 365269154 355482280 343698740 330014646
3287.8C30014646j4985174j5484333j5470475j5370369j5133440j4155805j1892707
$$ 330014646 315029472 299545139 284074664 268704295 253570855 239415050 227522343
3302.1B27522343q310616l757611J367599O737247J1985109J6731962K0650625K3528189
$$ 227522343 219211727 215454116 216821715 223558962 235544071 252276033 272926658 296454847
3318.4B96454847K5251835K5777996K5264800K4062484K2352129K0288408J8255353
$$ 296454847 321706682 347484678 372749478 396811962 419164091 439452499 457707852
3332.7D57707852J6481668J4887243J3425202J2114584J0884583R675741Q404792P099688
$$ 457707852 474189520 489076763 502501965 514616549 525501132 535176873 543581665 550681353
3349E50681353O062507N311430M504025L617704K860307K322853J900554J437902J053393
$$ 550681353 556743860 562055290 566559315 570177019 573037326 575360179 577260733 578698635 579752028
3367.4E79752028R25720R28580P97749N33700L26514K47121K12431R1076j13308k98560
$$ 579752028 580677748 581606328 582404077 582937777 583264291 583511412 583723843 583814919 583701611 583403051
3387.8E83403051m18842l89457k73466l15130m72843n11944m27366m12464m76956m97163
$$ 583403051 582984209 582594752 582321286 582006156 581533313 581021369 580594003 580181539 579704583 579207420
3408.2E79207420m86552m72963m52340m49300m29511l47018k47896j37865r060N4121
$$ 579207420 578720868 578247905 577795565 577346265 576916754 576569736 576321840 576183975 576174915 576229036
3428.6E76229036M0412J13368K79188L50535L47555M11450N25713O61016P81178P94053
$$ 576229036 576269448 576382816 576662004 577012539 577360094 577771544 578297257 578958273 579739451 580533504
3449E80533504Q05736Q88646R76443J080573J185596J200854J234532J413882J491427
$$ 580533504 581339240 582227886 583204329 584284902 585470498 586671352 587905884 589319766 590811193
3467.3E90811193J276135J035929J074672J262009J418412J452446J277625J178682
$$ 590811193 592087328 593123257 594197929 595459938 596878350 598330796 599608421 600787103
3483.6F00787103J324773J374483J252771J254499J399874J486659J459420J479566
$$ 600787103 602111876 603486359 604739130 605993629 607393503 608880162 610339582 611819148
3500F11819148J541972J419783J287877J431644J623631J686036J641453J530051J502752
$$ 611819148 613361120 614780903 616068780 617500424 619124055 620810091 622451544 623981595 625484347
3518.3F25484347J598835J711309J639247J509488J574993J672804J706899J802980
$$ 625484347 627083182 628794491 630433738 631943226 633518219 635191023 636897922 638700902
3534.6F38700902J836777J747489J833439K036929K038121J746059J523077J649678
$$ 638700902 640537679 642285168 644118607 646155536 648193657 649939716 651462793 653112471
3551F53112471J788914J784742J872719K020955K043247J995027K054989K216697K179682
$$ 653112471 654901385 656686127 658558846 660579801 662623048 664618075 666673064 668889761 671069443
3569.3F71069443J995385J996159K144039K236068K306462K416551K507627K580464
$$ 671069443 673064828 675060987 677205026 679441094 681747556 684164107 686671734 689252198
3585.6F89252198K544164K339781K234459K367615K496124K474486K411187K371609
$$ 689252198 691796362 694136143 696370602 698738217 701234341 703708827 706120014 708491623
3601.9G08491623K358020K379179K412796K322972K207517K139867K061069K072930
$$ 708491623 710849643 713228822 715641618 717964590 720172107 722311974 724373043 726445973
3618.3G26445973J907706J541436J481831J724005J946866J669348J277208J233876
$$ 726445973 728353679 729895115 731376946 733100951 735047817 736717165 737994373 739228249
3634.6G39228249J203477J172185J154900J075208J093447J263916J330734Q75473
$$ 739228249 740431726 741603911 742758811 743834019 744927466 746191382 747522116 748397589
3650.9G48397589M14431N35607P57754O40869M49658L32355L13461L98934M15444K23398
$$ 748397589 748812020 749347627 750105381 750746250 751195908 751528263 751841724 752240658 752656102 752879500
3671.3G52879500Q2314o5744l96907m29630j64867K41578P47502J094580Q01861J54495
$$ 752879500 752961814 752896070 752499163 752069533 751904666 752146244 752893746 753988326 754790187 754944682
3691.7G54944682J8597J55568J75416J00375o8069k14755j07885J30355K81156J72078
$$ 754944682 754963279 755118847 755294263 755394638 755326569 755111814 755003929 755134284 755415440 755587518
3712.1G55587518o1273j11580q2970m7386J0014l0756j56462j20521J01865K38060
$$ 755587518 755526245 755414665 755331695 755284309 755294323 755263567 755107105 754986584 755088449 755326509
3732.5G55326509Q3685k29299l70621k69950j17957j90378l00288j02103o4790k95102
$$ 755326509 755410194 755180895 754810274 754540324 754422367 754231989 753931701 753829598 753764808 753469706
3752.9G53469706k74957j25765n7281o2227n0246j4484l219J19j49190l28958k39551
$$ 753469706 753194749 753068984 753011703 752949476 752899230 752884746 752881527 752881646 752732456 752403498 752163947
3775.3G52163947k6644j2099j58847j95980k09510k60234k13206j38461q4758n6148
$$ 752163947 752137303 752125204 751966357 751770377 751560867 751300633 751087427 750948966 750864208 750808060
3795.7G50808060j16288j39833j94550k46882j58012k56240l79920j91272M6134J3173
$$ 750808060 750691772 750551939 750357389 750110507 749952495 749696255 749316335 749125063 749171197 749184370
3816.1G49184370j30057j54078l10779m16696l45886k57790j20163o4909j02937j73450
$$ 749184370 749054313 748900235 748589456 748172760 747826874 747569084 747448921 747384012 747281075 747107625
3836.5G47107625l25859k98917j97470l05712l85940k13802L3080n7280m64379m89951
$$ 747107625 746781766 746482849 746285379 745979667 745593727 745379925 745413005 745355725 744891346 744401395
3856.9G44401395l17812j76012n7817r0122j98781k40088k75373l24488l35574j97947
$$ 744401395 744083583 743907571 743849754 743759632 743560851 743320763 743045390 742720902 742385328 742187381
3877.3G42187381n2929j36376j86085j59383k80857l01838k23160j93834j20282n8830
$$ 742187381 742134452 741998076 741811991 741652608 741371751 741069913 740846753 740652919 740532637 740473807
3897.7G40473807j19984k58208l66866m05133l70741k96831k09808j27137j13845j82748
$$ 740473807 740353823 740095615 739728749 739323616 738952875 738656044 738446236 738319099 738205254 738022506
3918.1G38022506k37643k49982k54870k60711k49743j94430k02000l07203l34501k36571
$$ 738022506 737784863 737534881 737280011 737019300 736769557 736575127 736373127 736065924 735731423 735494852
3938.5G35494852j58131j86205j90616q1539n364q9348k12490k52009k29418j51157
$$ 735494852 735336721 735150516 734959900 734878361 734872997 734783649 734571159 734319150 734089732 733938575
3958.9G33938575q8513j04249j15454r8347j06156j20759j26303j47819j82629j87337
$$ 733938575 733850062 733745813 733630359 733532012 733425856 733305097 733178794 733030975 732848346 732661009
3979.3G32661009j75178j99020k37703k61367k74658k62976k21908k12550k55823
$$ 732661009 732485831 732286811 732049108 731787741 731513083 731250107 731028199 730815649 730559826
3997.6G30559826
$$ 730559826
##END=$$ End of the data block
