##TITLE=Julia 01 $$ Begin of the data block
##JCAMP-DX=5.00 $$ ACD/SpecManager v 10.08
##SPECTROMETER/DATA SYSTEM=Alpha
##DATE=30 Sep 2014 13:58:06
##DATA TYPE=INFRARED SPECTRUM
##DATA CLASS=XYDATA
##ORIGIN=
##OWNER=
##NPOINTS=1765
##FIRSTX=399.76428223
##LASTX=3997.64306641
##MAXX=3997.64306641
##MINX=399.76428223
##MAXY=1.00141430
##MINY=0.32537362
##XFACTOR=1.0000000000
##YFACTOR=0.000000010000000
##FIRSTY=1.00000000
##DELTAX=2.03961372
##XUNITS=1/CM
##YUNITS=ARBITRARY UNITS
##XYDATA=(X++(Y..Y))
399.8 100000000 99090981 97755438 95513517 92311960 88707131 86511171 87533557 90918112 94854075
418.1 94854075 97983247 99414968 99806046 99989486 100141430 100000000 99601579 99108297 98682529 97995067
438.5 97995067 96636343 94528282 91971368 89501750 87853044 87879109 89940917 93028021 95650911
456.9 95650911 97253656 98147780 98655140 98649424 98056102 97104907 95824355 94111180 92733794 92939979
477.3 92939979 94816166 97016764 98426312 99109125 99575335 99932659 100000000 99858999 99791443 99846929
497.7 99846929 99767977 99423283 99018598 98644376 98031902 97000915 95908237 95466089 95977491 96977776
518.1 96977776 97851956 98472691 98901904 99080747 99039817 98981410 99024230 99048430 98914617 98736596 98689950
540.5 98689950 98685122 98518771 98215449 97969949 97802120 97511351 96980578 96298659 95487797 94336158
560.9 94336158 92712992 90973711 89886105 90032500 91264653 92915159 94457603 95602083 96079415
579.3 96079415 95691037 94479913 93049783 92580020 93751085 95767325 97337419 98086649 98238641
597.6 98238641 98013234 97616380 97125542 96549344 96019107 95665073 95436686 95257431 95227915 95523655
618 95523655 96066606 96460986 96344846 95629084 94299996 92100978 88823569 85159892 82953119
636.4 82953119 83612198 86487973 89838463 92644155 94790661 96340191 97319829 97910976 98394269
654.7 98394269 98850608 99168301 99313444 99426115 99555784 99584246 99548894 99638665 99780524 99890065
675.1 99890065 99907166 99862707 99881047 99977368 100025582 99971777 99924666 99960321 100000000 99969125 99908012 99913383
699.6 99913383 99965084 99960572 99885827 99833953 99849302 99865592 99828064 99784613 99801993 99854201 99851513 99778008
724.1 99778008 99731451 99763656 99781686 99708015 99613947 99588418 99583316 99493194 99341738 99254793 99251568 99216545
748.5 99216545 99104452 99023628 99043083 99067998 98995334 98882866 98848319 98858577 98782969 98621821 98505306
771 98505306 98465759 98388278 98222178 98071986 98017472 97972870 97818971 97604334 97466254 97391999 97242814
793.4 97242814 96994609 96777409 96642280 96461439 96140224 95779693 95494652 95194387 94729763 94130653
813.8 94130653 93508446 92820120 91904199 90704083 89278138 87601256 85493028 82626414 78522319
832.2 78522319 73116398 67939806 65681475 67226136 70344377 72329450 72421050 72036904 73843086
850.5 73843086 78907979 85135895 89998186 92947650 94709939 95998168 97108036 98088872 98945475
868.9 98945475 99610585 99960369 100000000 99921501 99838895 99682921 99342662 98857397 98296964 97558111
889.3 97558111 96428818 94978434 93876725 93921518 95030552 96270496 96986228 97219956 97170419
907.6 97170419 96910334 96520281 96111792 95708561 95242637 94688100 94116729 93587136 93044406 92404819
928 92404819 91660208 90825218 89882904 88885182 87877631 86670363 84951425 82564020 79545307
946.4 79545307 75951296 71744496 67414844 65032142 66702652 71419197 75825465 77559209 76336861
964.7 76336861 72874790 67933947 62228340 56587553 52004880 49461794 49543339 52101666 56341267
983.1 56341267 61283141 66150326 70489180 74129337 77035010 79055303 79819798 79398263 79078102
1001.4 79078102 79786456 80307049 78905541 75066417 69366521 63736260 61392921 64413851 71421242
1019.8 71421242 79167461 85475081 89809722 92492086 94071209 94993675 95490420 95641404 95515394
1038.2 95515394 95199859 94713515 94001472 93056303 91972136 90831500 89591742 88151956 86452925
1056.5 86452925 84440619 81981927 78914571 75253618 71462601 68458623 66994280 66987389 67726660
1074.9 67726660 68530709 68846589 68277413 67293006 67491841 69967330 73879939 77735752 80940777
1093.2 80940777 83526450 85531229 86968863 87972659 88754141 89426690 89967144 90362740 90679216
1111.6 90679216 90957600 91154677 91244096 91304350 91420877 91563368 91648400 91689157 91772133 91897213 91965312
1134 91965312 91938484 91887474 91853768 91773766 91571611 91260076 90886575 90422118 89807475 89093393 88395172
1156.5 88395172 87683982 86747974 85439682 83984834 83017588 83043301 83761102 84387839 84604377 84553748
1176.9 84553748 84248799 83597088 82631427 81370199 79737937 77735102 75495064 73113632 70537525
1195.2 70537525 67726934 64880121 62408853 60722071 60037225 60263896 61043757 62097591 63519734
1213.6 63519734 65610236 68509436 71984857 75455791 78314579 80273223 81347549 81613505 81114244
1231.9 81114244 79935646 78241086 76291358 74546969 73653150 73835665 74259585 73788333 72412604
1250.3 72412604 71068752 70118994 69204104 68857437 70579559 74231511 77424079 78588903 78175175
1268.6 78175175 76977462 75282389 73010093 69914037 66249251 63480794 62918264 63635713 63757747
1287 63757747 62748033 61055291 59075826 57025230 55042303 53212184 51595682 50318670 49546599
1305.4 49546599 49291229 49287596 49188066 48830667 48276305 47710133 47371006 47447592 47997904 49005499
1325.8 49005499 50413507 52166098 54230410 56583476 59223461 62223619 65500295 68560159
1342.1 68560159 70989555 72627044 73266536 72823381 71677613 70575231 70144284 70586681 71794629
1360.4 71794629 73558432 75482064 77268791 78884435 79916739 79223377 76296973 73099965 71357459
1378.8 71357459 70831901 70795500 69870847 67618603 66299689 66954201 67667365 66921860 65680039
1397.1 65680039 66125292 68737775 72007805 74700320 76458657 77620775 78676605 79804307 80918622
1415.5 80918622 81938356 82814634 83309108 83434153 83476150 83642823 83913565 84116697 84258711 84729701
1435.9 84729701 85602045 86212623 86219269 85591596 84667242 84183937 84407425 84717995 84539819 83747202
1456.3 83747202 83198035 83686537 84589744 85487711 86359143 87186831 87938231 88681453 89403725 90057659
1476.7 90057659 90661818 91219568 91706187 92061710 92293149 92522526 92872584 93238997 93517888 93788373
1497.1 93788373 94110805 94393575 94527853 94511276 94592023 94893789 95154673 95288891 95316535 95299679
1517.5 95299679 95251900 95191288 95224500 95340967 95515716 95702690 95840168 96000588 96171212 96177441 96046591
1539.9 96046591 96067685 96285063 96574771 96821183 96972227 97029787 96973252 96744227 96286798 95892215
1560.3 95892215 95703065 95483094 95323098 95385259 95700228 96060091 96289247 96480834 96682096 96793944
1580.7 96793944 96795553 96720928 96593410 96438068 96262854 96048325 95779526 95468891 95141667 94843537
1601.1 94843537 94629663 94473618 94292027 94041771 93730617 93347347 92860311 92382735 92078531 91814709
1621.5 91814709 91538274 91348207 91204727 91071922 90947169 90791267 90678340 90735614 90831846 90869105
1641.9 90869105 90851068 90830129 90942478 91091883 91207880 91555762 91986543 92210031 92248374 92182910
1662.3 92182910 92086035 91898972 91487634 90925026 90427434 90006286 89642429 89223915 88568282 87693584
1682.7 87693584 87034959 87064177 87366098 87576890 87609130 87428719 87106597 86600202 85837466 85041249
1703.1 85041249 84099162 82941526 81740206 80434567 78927106 77124804 74891025 72619849 70551836
1721.5 70551836 68323547 65949559 63681358 61577213 59679043 57714760 55826110 54063499
1737.8 54063499 51696628 48643729 45271999 41731945 38309565 35329601 33293927 32537362 33045402
1756.1 33045402 34809867 37619326 41133091 44373307 46789968 48562083 49751705 50508153 50883615
1774.5 50883615 50858265 50445718 49675316 48658106 47509050 46376082 45535502 45394215 46492633
1792.8 46492633 48679161 51341319 54236758 57106912 59584558 61526680 63080353 64397490
1809.2 64397490 65528756 66448402 67229879 68058205 69016951 70010012 70908177 71657896 72258687 72889292
1829.6 72889292 73704839 74606603 75482458 76288396 76984596 77557236 78039443 78405333 78597105 78656065
1850 78656065 78720003 78944921 79392648 79965657 80515540 80955088 81296372 81626040 82054818 82596356
1870.3 82596356 83111620 83543730 83928984 84292394 84619033 84898871 85158116 85414088 85670036 85935366
1890.7 85935366 86202180 86464310 86728370 86962819 87154335 87323254 87471730 87575984 87638867 87708539
1911.1 87708539 87810737 87922919 88035369 88188124 88390225 88626045 88868213 89085245 89286399 89482641
1931.5 89482641 89659882 89809793 89951420 90093035 90231580 90372449 90514249 90654069 90790230 90904814
1951.9 90904814 90998119 91104114 91235960 91368157 91476810 91566694 91654515 91751915 91842532 91917437 92003787
1974.4 92003787 92114556 92229950 92332351 92429900 92532343 92626631 92696589 92757225 92842466 92951590 93048579
1996.8 93048579 93125695 93205541 93291855 93369073 93429947 93486398 93548101 93604422 93643606 93679577 93733823 93798321
2021.3 93798321 93846506 93869650 93884593 93902898 93917948 93926215 93939656 93971515 94014865 94046468 94053161 94036031
2045.8 94036031 93993276 93927127 93860984 93833911 93868369 93951780 94057482 94171280 94296288 94431716 94560355
2068.2 94560355 94668305 94760442 94845933 94925463 94998533 95068383 95134771 95187491 95219839 95241565 95271742
2090.6 95271742 95315707 95360869 95403010 95453584 95521426 95599008 95667863 95718557 95759535 95795971 95817387 95812201
2115.1 95812201 95789725 95778531 95783406 95764500 95685434 95576805 95523679 95569754 95669347 95758188 95813209 95833242
2139.6 95833242 95813155 95756966 95690191 95639014 95615739 95626050 95678461 95773929 95894086 96012145 96117127
2162 96117127 96216810 96316755 96408087 96480185 96539348 96592289 96632475 96655244 96668148 96680999 96693552 96702218
2186.5 96702218 96712512 96734285 96766514 96795607 96813446 96833396 96871233 96919107 96955121 96971262 96974212 96963501
2211 96963501 96928030 96872908 96831375 96827662 96855408 96895379 96938211 96981758 97008747 96993250 96938425 96889496
2235.4 96889496 96894771 96963358 97070032 97187304 97291219 97357959 97374994 97346354 97283572 97198761 97110951
2257.9 97110951 97055036 97062433 97118998 97170699 97178710 97153765 97138995 97166908 97233701 97320467 97416764 97511351
2282.3 97511351 97586298 97632086 97661161 97687930 97709799 97718990 97722292 97738665 97762328 97758007 97705328 97610992
2306.8 97610992 97486669 97352827 97245729 97189903 97172493 97158998 97129440 97092026 97067124 97058070 97049427
2329.3 97049427 97037596 97039539 97060317 97084033 97105163 97150064 97254962 97419268 97561520 97603762 97545308
2351.7 97545308 97439110 97340471 97255498 97190082 97163236 97161007 97168434 97194415 97245610 97310078 97367156 97422010
2376.2 97422010 97506189 97625297 97734034 97785056 97775686 97744399 97732073 97751492 97799414 97875297 97972739
2398.6 97972739 98072851 98163563 98251247 98343593 98428428 98486704 98523676 98564434 98612702 98645824 98658091
2421 98658091 98667258 98683310 98697907 98700768 98697913 98706287 98729438 98753309 98770416 98788977 98813450 98834258 98843443
2447.6 98843443 98849183 98863000 98878878 98883671 98880821 98884088 98892629 98893970 98887336 98884839 98896384 98915809 98930317
2474.1 98930317 98941308 98956591 98973519 98984116 98988003 98990947 98993462 98988616 98973852 98958319 98951501 98950511 98952371
2500.6 98952371 98965168 98993713 99024945 99036753 99019998 98988116 98962772 98952144 98951751 98957342 98965132 98964632 98947322
2527.1 98947322 98921037 98904818 98910314 98931539 98959136 98990595 99023902 99053347 99070662 99071360 99061859 99050534
2551.6 99050534 99038708 99029267 99031276 99049401 99073297 99087560 99085397 99068004 99037552 98992568 98937732 98891085
2576 98891085 98865652 98853743 98847163 98850024 98862028 98872107 98871166 98866194 98870617 98883164 98895901 98910999 98935843
2602.6 98935843 98970050 99001503 99022079 99038488 99060452 99086320 99100977 99090040 99056333 99015826 98988622 98992682
2627 98992682 99027312 99072754 99109554 99127138 99130899 99139786 99158251 99168664 99164200 99161655 99174619 99198705 99225026
2653.5 99225026 99253172 99287277 99327236 99365014 99393690 99418014 99441803 99459851 99472123 99486053 99503225 99515843
2678 99515843 99520344 99522990 99528867 99534899 99534547 99528712 99527681 99535322 99540645 99537468 99534672 99536729 99536520 99526471 99512094
2708.6 99512094 99511361 99530494 99552268 99564570 99576324 99594188 99608153 99606663 99593413 99573630 99532807 99445605
2733.1 99445605 99314386 99204803 99193943 99271095 99360454 99421769 99457687 99467868 99453199 99433613 99427462
2755.5 99427462 99427629 99415660 99388796 99358422 99332249 99316853 99320936 99348825 99393910 99435151 99456573 99462914
2780 99462914 99462438 99451381 99423498 99385607 99355024 99340433 99336624 99333841 99327523 99313486 99283522 99236923 99190062
2806.5 99190062 99164426 99155951 99136853 99091393 99032575 98984259 98954135 98933750 98917288 98901826 98879743 98845088
2831 98845088 98797387 98741567 98681009 98607194 98517972 98433757 98369312 98312938 98251224 98188359 98128903 98061138
2855.5 98061138 97974157 97878462 97795719 97729462 97651577 97533309 97383642 97237915 97117215 97025102 96968168
2877.9 96968168 96941274 96923810 96909499 96902406 96890599 96851057 96774936 96672314 96559012 96452278 96359318
2900.3 96359318 96268004 96171409 96074259 95972478 95842373 95631248 95268381 94696492 93869036 92710549
2920.7 92710549 91067225 88715672 85696220 82876092 81722403 82916403 85570663 88240027
2937 88240027 90138292 91189122 91560429 91465569 91172177 90947962 90974241 91310042 91884995 92548025
2957.4 92548025 93168646 93693048 94119477 94471860 94787258 95086455 95370859 95634377 95869583 96081316
2977.8 96081316 96266234 96397299 96467441 96492255 96451867 96286744 95905447 95147878 93766183 91531962
2998.2 91531962 88557088 85740942 84462643 85118818 86691087 88193947 89498556 90746123 91853738
3016.6 91853738 92692196 93315434 93866187 94401652 94880003 95264608 95568371 95820117 96026999 96196669
3037 96196669 96360892 96519327 96634042 96693224 96729606 96784216 96852160 96905226 96948814 96992105 97030497
3059.4 97030497 97064984 97101033 97147691 97194988 97222805 97246629 97298169 97381574 97466934 97516757 97535127 97550535
3083.9 97550535 97563648 97572702 97585440 97593570 97591484 97589576 97593868 97594452 97582340 97567618 97562897 97558320 97535914
3110.4 97535914 97514158 97520471 97540349 97552490 97543675 97510636 97480696 97477925 97492731 97496736 97483408 97477961 97492254
3136.9 97492254 97501051 97477722 97437412 97411013 97399575 97396225 97398692 97383285 97338057 97284716 97237051 97196668
3161.4 97196668 97163719 97130024 97088420 97041792 96994263 96942526 96886426 96831787 96777111 96716964 96650577 96582139
3185.9 96582139 96513397 96439779 96360648 96276057 96188265 96105349 96026093 95944566 95860672 95773613 95685363 95604122
3210.3 95604122 95530003 95457530 95383769 95306504 95228755 95152104 95070130 94980091 94890809 94816619 94750786 94659632
3234.8 94659632 94541287 94425160 94316965 94217181 94136083 94058812 93958414 93846422 93753546 93683141 93614829
3257.3 93614829 93538547 93463045 93394184 93333805 93289340 93255746 93201023 93116230 93029946 92952728 92877132 92806017
3281.7 92806017 92741764 92674500 92603809 92542183 92479473 92388636 92264122 92119563 91978967 91863650 91767806
3304.2 91767806 91659164 91508168 91320509 91124630 90939730 90759999 90572780 90378225 90183175 89987898
3324.6 89987898 89772940 89530110 89278853 89028239 88779885 88536072 88273180 87974066 87657279 87340754
3345 87340754 87037182 86754215 86459482 86123943 85779727 85455906 85137230 84806997 84469861 84139937
3365.4 84139937 83812279 83455336 83058834 82662517 82301044 81972301 81666416 81377071 81103373 80851883
3385.7 80851883 80628771 80430812 80227524 79995024 79766512 79579115 79412609 79216629 78990847 78786910
3406.1 78786910 78619403 78464925 78310215 78153211 78001851 77870774 77762395 77669209 77591312 77534312
3426.5 77534312 77497828 77474344 77462429 77460623 77458394 77451962 77456820 77486938 77538502 77605587 77687079 77779698
3451 77779698 77878082 77980340 78084064 78185737 78286344 78392243 78505087 78617913 78723931 78824544
3471.4 78824544 78930384 79041481 79148287 79247475 79341853 79429221 79500586 79550582 79582244 79604566 79638511
3493.8 79638511 79717541 79859936 80053943 80277616 80520660 80760199 80966181 81136000 81277317 81395787
3514.2 81395787 81505924 81624132 81745648 81857675 81961817 82058966 82146668 82243222 82378161 82586271
3534.6 82586271 82891256 83261907 83638477 83992082 84337032 84693408 85039616 85352606 85658169 85956740
3555 85956740 86219382 86454809 86677152 86873364 87051457 87285089 87590820 87895566 88185251 88488406
3575.4 88488406 88813865 89158946 89504540 89812857 90100712 90451640 90851098 91195488 91499621 91823286
3595.8 91823286 92157543 92484063 92805237 93100661 93361104 93629700 93919677 94202834 94476753 94726741
3616.2 94726741 94970113 95259452 95548546 95758152 95885533 96051115 96341902 96622288 96844172 97039354
3636.6 97039354 97212315 97363496 97476929 97522610 97515398 97585368 97816294 98042947 98182380 98319513
3657 98319513 98474973 98594826 98666227 98684347 98644871 98604298 98616344 98608720 98616713 98741502 98882246 98973930
3681.5 98973930 99022323 99017948 98992705 99036658 99168527 99305665 99398845 99441290 99450260 99478191 99541575 99569517
3706 99569517 99524236 99466473 99509233 99628091 99695235 99690461 99657929 99635118 99640560 99668729 99678648 99624014
3730.4 99624014 99522901 99472159 99542975 99650735 99663520 99577475 99519396 99530566 99517190 99543095 99672413
3752.9 99672413 99773139 99786568 99786741 99818629 99822491 99787843 99768960 99788761 99850166 99915278 99936831 99918783
3777.3 99918783 99905807 99922687 99940014 99952668 99976522 100000000 100007904 99981397 99929756 99875164 99815273 99804258
3801.8 99804258 99847335 99870819 99912524 99969107 99962044 99887866 99818909 99779880 99749953 99796730 99881971 99920189
3826.3 99920189 99928761 99913001 99873745 99820721 99759853 99744582 99796742 99863797 99926108 99957877 99899632 99737573
3850.8 99737573 99599695 99680763 99839360 99900794 99868208 99806255 99779063 99754488 99706024 99690753 99703658
3873.2 99703658 99700254 99652374 99571013 99542975 99581718 99650127 99726981 99765784 99798632 99851620 99860269 99805492
3897.7 99805492 99739993 99715418 99753720 99845213 99933124 99980009 99991643 99971473 99938840 99938434 99964947 99974734
3922.1 99974734 99973071 99981588 99974900 99943572 99932700 99952197 99954230 99917310 99863619 99830228 99834734 99856591 99880987
3948.7 99880987 99913770 99950659 99980968 100000000 100004232 99992168 99977136 99975413 99987018 100007129 100032210 100055206
3973.1 100055206 100071931 100081015 100083876 100088406 100096333 100097251 100088549 100076747 100057721 100022578 99975294 99926150
3997.6 99926150
##END=$$ End of the data block
