##TITLE=Julia 01 $$ Begin of the data block
##JCAMP-DX=5.00 $$ ACD/SpecManager v 10.08
##SPECTROMETER/DATA SYSTEM=Alpha
##DATE=04 Sep 2014 08:34:00
##DATA TYPE=INFRARED SPECTRUM
##DATA CLASS=XYDATA
##ORIGIN=
##OWNER=
##NPOINTS=1765
##FIRSTX=399.76428223
##LASTX=3997.64306641
##MAXX=3997.64306641
##MINX=399.76428223
##MAXY=0.85138750
##MINY=0.25341645
##XFACTOR=1.0000000000
##YFACTOR=1.000000000000000e-9
##FIRSTY=0.82786363
##DELTAX=2.03961372
##XUNITS=1/CM
##YUNITS=ARBITRARY UNITS
##XYDATA=(X++(Y..Y))
399.8H27863634J2005865O343305J209736l34620j471520j971423N87999L405214K459168
418.1H50097358m45664j27792J531124L32475j891613q15988J250982k23875k289235
436.5H47417772p72417Q13604p53940j997709o2465J143276q76844k159357k63452
454.8H42488468R09328r35852j961947n62429m0293j670063k004087l66509k33709
473.2H35622907j854062j912415p03693j245200l003598l429472k956033m083633o454587
491.5H09980214q489728j1678815j9557834l5535276o1146796o9668173l9619744j9694746
507.9E44589102k4675190J1931240Q2396984J05111301P0968092L2058835J2581468
522.1H34961832N491316L086567J173317m44472n21779J63377k39k14755O05583J028478
$$ y = [827863634, 839869499, 846212804, 847422540, 847087920, 845616400, 843644977, 844232976, 847638190, 850097358, 849651694, 849523902, 851055026, 851387501, 849495888, 848679900, 849930882, 849707007, 847417772, 846645355, 847458959, 846705019, 844707310, 844644845, 845788121, 844911277, 842751920, 842488468, 843397796, 842461944, 840499997, 839937568, 839897275, 838227212, 836223125, 835856616, 835622907, 833768845, 831856430, 831152737, 829907537, 826903939, 823474467, 820518434, 816434801, 809980214, 801490486, 789811671, 770253837, 734718561, 673571765, 603903592, 564283848, 544589102, 519913912, 531845152, 614242136, 719353437, 790321529, 822380364, 834961832, 840453148, 843539715, 844713032, 844268560, 843746781, 843910158, 843909919, 843695164, 844300747, 845329225]
542.5H45329225q8155r43244p7963L54529q58307j543164l52681L47435p84277j267910
562.9H40115488m5717M08649q95500j367271j29104K17736j134574j356602o6340j43289
583.3H35603476j790107k296090j544058k366126m698694n799829o902278j3838232
599.6G96368062k9151856m0664733k2493541K0353615M2156518K8821766O860375j1394977
616G90855229k1979630q193374K1225572L0559778J7210662N742431K153993L59714
632.3H37934375j036108j051604j003623k882123n830586n594492j63734M765987M395545
650.6H29533637J934290M15623p65026j144588l98517p6949q50856j832664j380682
669H25434268k53082q34524j290739q33869r26077j648009j626432j006663j280367
$$ y = [845329225, 845241070, 844297826, 844219863, 844574392, 843716085, 842172921, 841820240, 842167675, 841383398, 840115488, 840069771, 840478420, 839582920, 838215649, 838086545, 838304281, 837169707, 835813105, 835746765, 835603476, 833813369, 831517279, 829973221, 827607095, 822908401, 817108572, 810206294, 796368062, 767216206, 726551473, 704057932, 724411547, 766568065, 795389831, 802250206, 790855229, 768875599, 760682225, 781907797, 812467575, 829678237, 835420668, 837574661, 837934375, 836898267, 835846663, 834843040, 831960917, 826130331, 820535839, 820372105, 825138092, 829533637, 831467927, 831883550, 831118524, 829973936, 829575419, 829498470, 828647614, 826814950, 825434268, 825181186, 824346662, 823055923, 822222054, 821295977, 819647968, 818021536, 817014873, 815734506]
687.3H15734506k238155k351761j899898k345919l293693l481627l863156n343079
703.7G90917218m795909j339197p4029k341032m258514m236460m087865n142450o179154
722G58462608o086588n997658o955266q172691q651077r382546j1563719j4069259
738.3F87583804j5629649j6885817j8267155j8272280j5836120j1828900p403910k295077
754.7E81164896L790319R700597J4067411J6777754J7861366J4445842M567444J442313
771F63817942J9109726L6560118L0925870J6532541R132683O093860L422796J448155
787.3G87043691O93798R9897p99715j236618j425028l043234o488621j0514021j4995575
805.6G49334574k1604717l1971753m7936678p0214271q9919388q5276664m6200037
$$ y = [815734506, 813496351, 811144590, 809244692, 806898773, 803605080, 800123453, 796260297, 790917218, 786121309, 784782112, 784708083, 782367051, 778108537, 773872077, 769784212, 764641762, 758462608, 752376020, 746378362, 739423096, 731250405, 722599328, 713216782, 701653063, 687583804, 671954155, 655068338, 636801183, 618528903, 602692783, 590863883, 583459973, 581164896, 584955215, 594655812, 608723223, 625500977, 643362343, 657808185, 662375629, 663817942, 682927668, 719487786, 750413656, 766946197, 776078880, 782172740, 785595536, 787043691, 787737489, 787837386, 787037671, 785801053, 784376025, 781332791, 774844170, 764330149, 749334574, 727729857, 695758104, 647821426, 577607155, 487687767, 402411103, 356211066]
819.9C56211066O470174M6862334O5862775O7041635O2000275N6906938M6219588K9639065
836.2G37213850J7519057J4073372J2008190P042706J442492l992736p296563l453850
852.6G74556518O036698J1857033J0368467O743431M487514K633810R13501O01351
868.9H18198323J259625J133263M28021P02918J472115J077354L6240O1750O60241
887.2H25029850K58207o26683m35293K79367p1883q27968m86076K97666K7418o33836
907.6H22810769l11434L24905j10150r44435p91371l32177q95083j767397j538217
926H16445410j114249k200723n054116j0386467j6701162j1913180O965876J7897486
942.3G93938875J1272192J548171l262639n301833o836295p866800q143544r133935
$$ y = [356211066, 362681240, 409543574, 475406349, 542447984, 604448259, 661355197, 707574785, 737213850, 754732907, 768806279, 780814469, 787857175, 789299667, 785306931, 778010368, 774556518, 780593216, 792450249, 802818716, 809562147, 814049661, 816683471, 817596972, 818198323, 819457948, 820591211, 821019232, 821722150, 823194265, 824271619, 824307859, 824369609, 825029850, 825288057, 824661374, 824226081, 824505448, 824433565, 823605597, 823119521, 823417187, 823444605, 822810769, 822499335, 822824240, 822714090, 821769655, 820978284, 820646107, 819751024, 817983627, 816445410, 815331161, 813130438, 808076322, 797689855, 780988693, 769075513, 776041389, 793938875, 805211067, 806759238, 803496599, 798194766, 791358471, 783491671, 775348127, 766214192]
958.6G66214192q462191m932344r34183P263541J5194476J2531876M981339O83844
974.9G92540550j319766l245592n163610p134616j0603965j5406727j5862585n442798
991.3G28360891R480179J4937460R496510J941800l734588q172691j1895597j6300082
1007.6G24113882k2793293k6349962j5346170J0802031K8300106J8186093N261481
1021.8G22174168J2397885J7172694P300079l128707j0812164k0512521l1256855l4099757
1038.2F59234822j8260837J1734843L4130216L6348701K6664734J6316294Q987367
1052.4G75156140M874826L224551K263010J115382M64678O22928N62787j39117m87566
1070.8G87657619j58966j04249o24597p21514k19405j15871o21557q06630m68969m66943
$$ y = [766214192, 757752001, 752819657, 751885474, 759149015, 774343491, 786875367, 791856706, 792540550, 791220784, 787975192, 782811582, 775676966, 765073001, 749666274, 733803689, 728360891, 737841070, 752778530, 762275040, 764216840, 760482252, 752309561, 740413964, 724113882, 701320589, 674970627, 659624457, 670426488, 698726594, 716912687, 722174168, 734572053, 751744747, 759044826, 755916119, 745103955, 724591434, 693334579, 659234822, 640973985, 652708828, 686839044, 723187745, 749852479, 766168773, 775156140, 780030966, 783255517, 785518527, 786633909, 787098587, 787721515, 788284302, 788145185, 787657619, 787498653, 787394404, 786769807, 786048293, 785828888, 785713017, 785091460, 784284830, 783815861, 783348918]
1091.2G83348918j016617j366615j395345j859605k668739l081619l597141o151855
1107.5G62211382j1857450j6879081j1642397L008187J0181427M684091j507044p26044
1123.8G37473071N981326J1665046J0267913M964233J323640J74642j6988m22060q52287
1142.2G70558536p81417n88476q19326j027107p26402n29885r86636j457512j299918
1160.5G62341857j114786j434862j672924j311123j143813k076924m074395p985771
1176.9G41527259j3406813j0471463N226970J5600741J0681748K679288o85870j201451
1193.2G49950409j295984k070069k899170l154576l934503o611228r557068p011235
1209.5G13416576J266778N267620K635479Q54790P09534j010001l690660n636930n790532
$$ y = [783348918, 782332301, 780965686, 779570341, 777710736, 775041997, 771960378, 768363237, 762211382, 750353932, 733474851, 721832454, 724840641, 735022068, 739706159, 738199115, 737473071, 743454397, 755119443, 765387356, 770351589, 771675229, 771849871, 771832883, 771410823, 770558536, 769777119, 769188643, 768369317, 767342210, 766615808, 766085923, 765099287, 763641775, 762341857, 761227071, 759792209, 758119285, 756808162, 755664349, 753587425, 749513030, 741527259, 728120446, 717648983, 722875953, 738476694, 749158442, 751837730, 751151860, 749950409, 748654425, 746584356, 743685186, 740530610, 736596107, 729984879, 720427811, 713416576, 714683354, 719950974, 722586453, 723441243, 724150777, 723140776, 719450116, 713813186, 708022654]
1227.9G08022654l270268K56359J228392q79287l771365n539060n672157n144119n106747
1246.2F80124402n401909n732477p245660j1183858j7394304k5377452l4297884l6286354
1262.5E37204504j3807714L3676028O8323970O0455084K9840648P195711k459347o473601
1278.8G13955283q463025q992255r008467r607911j0636866j0904372r953737r245277
1295.2F37143373j0679960j3624847j4527440q713901o88076n032837k1920860l6728561
1311.5E25226891m5193076n0091058m7454536l3359617r966195K5722534P0536792
1325.8D35421735R7656697Q9298904N9214354K9711246J0498762j92046o751478j1202156
1342.1G03656018j3806045j4814079j4885187j5659750j7163872j8273354j9963980
$$ y = [708022654, 704752386, 705008745, 706237137, 705357850, 701586485, 696047425, 690375268, 685231149, 680124402, 674722493, 668990016, 661744356, 650560498, 633166194, 607788742, 573490858, 537204504, 523396790, 557072818, 625396788, 685851872, 715692520, 722888231, 720428884, 713955283, 705492258, 696500003, 687491536, 677883625, 667246759, 656342387, 646388650, 637143373, 626463413, 612838566, 598311126, 589597225, 588909149, 583876312, 561955452, 525226891, 480033815, 429942757, 382488221, 349128604, 339162409, 364884943, 435421735, 533078432, 622377336, 681591690, 711302936, 721801698, 721609652, 714858174, 703656018, 689849973, 675035894, 660150707, 644490957, 627327085, 609053731, 589089751]
1356.4E89089751k5941252l7842691m6213270k7801752J8010617N6876599N9550465
1370.6E85728467L1817376o812632l3797026j7279505K7038276M1899144K0422161
1384.9F49016261j861870j3443947j9961774k7869702l7855446m6947539n6043595
1399.2D45032388m2606682J5493632Q5436702J01685225O4266921K4699032J982748
1413.5F95989966q138597j3212204j6500473j6770541j8134237k0805955k0839095
1427.7E81588864j9266843j6149819j4110744j8184305k3261427j8983841j0178090
1442D61453795k495437q88080p215023j5940904j9103617j1378020J3388872M6970070
1458.3D64791656N1485598L9790094K7658641J3127446J837313m069984p979333q767188
$$ y = [589089751, 563148499, 525305808, 479092538, 451290786, 469301403, 526178002, 585728467, 617545843, 610733211, 576936185, 559656680, 586694956, 628594100, 649016261, 647154391, 633710444, 613748670, 585878968, 548023522, 501075983, 445032388, 402425706, 417919338, 503356040, 605041265, 669308186, 694007218, 695989966, 687851369, 674639165, 658138692, 641368151, 623233914, 602427959, 581588864, 562322021, 546172202, 532061458, 513877153, 490615726, 471631885, 461453795, 458958358, 458070278, 450855255, 434914351, 415810734, 404432714, 417821586, 464791656, 516277254, 556067348, 583725989, 596853435, 598690748, 594620764, 586641431, 577874243]
1474.7E77874243o990313o235302p180631q766115r542822j0064126j0879874j1105418
1491E07109642j0002166j0496587j3683766j6579419j8444628k0234584k6855112l5191923
1507.3C55621457k2791803j420527J9073843L8100422M4663817L2374590J5138239
1521.6D80760038J242071p535755j1468441j0876894q776575o166160k517760o39468
1537.9D34021056k283484p658154j5674174k4386227k7979702k1685630k410560K1266758
1554.2C53209883L6752075N3308636O0606509L8887620L0432701L1066180L0272662
1568.5F34536266K6847005J6117454M846096n196035j3015628j8414438k4397671k9081762
1584.8E92241287l2106220l3918858l4340978l3774405l2968611l0722320k5282145
$$ y = [577874243, 570883930, 564648628, 557467997, 548701882, 539159060, 529094934, 518215060, 507109642, 497107476, 486610889, 472927123, 456347704, 437903076, 417668492, 390813380, 355621457, 332829654, 331409127, 350482970, 388583392, 433247209, 465621799, 480760038, 482002109, 474466354, 462997913, 452121019, 443344444, 437178284, 434660524, 434021056, 431737572, 424079418, 408405244, 384019017, 356039315, 334353685, 331943125, 353209883, 389961958, 443270594, 503877103, 542764723, 573197424, 604263604, 634536266, 661383271, 677500725, 682346821, 677150786, 664135158, 645720720, 621323049, 592241287, 560135067, 526216209, 491875231, 458100826, 425132215, 394409895, 369127750]
1599.1C69127750j6358167n937993J653314L481686K347469N581796J6322315L3568561
1615.4D09786731M6675056L5536528J7950892P172466K294421K361655J176953l679156
1631.7E19275546j0293007j7980188j9584209j7028927j5717626j2998045r886056
1646D15787488p519096p833987j8931568l8738698l6659330k8805971k0057291l825098
1662.3B53416449J1439353J9779861L1728596M6556741M6744227M3823481M1261166
1676.6D94749874L2680184K6830434K7028978L1051636K5865018J8900514J7325044
1690.9F74431682J4985561J4051199J3599992J2159586J2379467R805262P336080P082224
1707.2G65831053N863965M341960L634810M018128N056381M693270L171861K090335
$$ y = [369127750, 352769583, 346831590, 348484904, 351966590, 354314059, 359895855, 376218170, 409786731, 456461787, 491998315, 509949207, 517121673, 519416094, 521777749, 522954702, 519275546, 508982539, 491002351, 471418142, 454389215, 438671589, 425673544, 415787488, 408268392, 400434405, 381502837, 342764139, 306104809, 277298838, 257241547, 253416449, 264855802, 284635663, 316364259, 362921000, 409665227, 453488708, 494749874, 527430058, 554260492, 581289470, 612341106, 638206124, 657106638, 674431682, 689417243, 703468442, 717068434, 729228020, 741607487, 751412749, 758748829, 765831053, 771695018, 776036978, 779671788, 783689916, 788746297, 793439567, 796611428, 798701763]
1723.5G98701763J357377L91602l6001L20137J581013K998650L420055L997445M049063
1741.9H16781104K989411J976728J679719J575708J138270L44455j90973m12822n85675
1760.2H25295925l22819N23210J008213R07242Q37505J197815J532733R49323J33157
1778.6H32062304l39746o66202j159787j537740j710772j926601j133264P77603J995325
1796.9H26361120K088308J752079J418233J184403R03726M85301J68681m2796l98934
1815.3H33920121r00447j102686r15289m20511K69473O91414O44207M64737K19524
1833.6H32870543p75j3471r8764l09647k72512R6202L1888l52144m85182n41269p35999
1856.1H30188870q39829o55830n57780q50976j217425j007556k61784J14143L7074
$$ y = [798701763, 800059140, 800450742, 800414741, 800734878, 802315891, 805314541, 808734596, 812732041, 816781104, 819770515, 821747243, 823426962, 825002670, 826140940, 826485395, 826294422, 825881600, 825295925, 824973106, 825496316, 826504529, 827411771, 828249276, 829447091, 830979824, 831929147, 832062304, 831722558, 831056356, 829896569, 828358829, 826648057, 824721456, 823588192, 824365795, 826361120, 828449428, 830201507, 831619740, 832804143, 833707869, 834193170, 834361851, 834319055, 833920121, 833019674, 831916988, 831001699, 830581188, 830850661, 831542075, 832186282, 832651019, 832870543, 832869768, 832856297, 832757533, 832447886, 832175374, 832271576, 832303464, 831951320, 831466138, 830924869, 830188870, 829349041, 828693211, 828135431, 827284455, 826067030, 825059474, 824797690, 824911833, 824948907]
1874.4H24948907N8889J06156r2923l10541l67880n94735j446008k751947m516244
1892.8H15033674p499754j1096597j1431456m506588O331921J1896789R892225N900741
1909.1H14520955L438354K051711R99391L75390o735p16925j243651o32107L89993
1927.5H19176376N73099J23083j52051k43605n36203p71880m27604K71201M51506J04129
1947.9H18568051o1333l5882k63334o45697p92622p72894r46283j208663j012087l58701
1968.3H12470555L159j09791j83165j32502j38104l5047K52545L85463K18332J9073
1988.7H12750518k8014o6221l38494p13706p62940m60744k06053o4671J01328J44481
2009H10355484n1856k18749j75118j05500k20776m67419n57185m81665m86910n30124
$$ y = [824948907, 825007796, 825113952, 825021029, 824710488, 824342608, 823747873, 822301865, 819549918, 815033674, 807533920, 796437323, 785005867, 780499279, 786831200, 798727989, 808620214, 814520955, 817959309, 820011020, 821010411, 821385801, 821379066, 820662141, 819418490, 818786383, 819176376, 819749475, 819872558, 819720507, 819476902, 818940699, 818168819, 817741215, 818012416, 818463922, 818568051, 818506718, 818470836, 818207502, 817561805, 816769183, 815996289, 815050006, 813841343, 812829256, 812470555, 812473714, 812363923, 812180758, 812048256, 811910152, 811875105, 812127650, 812513113, 812731445, 812750518, 812722504, 812656283, 812317789, 811604083, 810841143, 810380399, 810174346, 810109675, 810211003, 810355484, 810303628, 810084879, 809909761, 809804261, 809583485, 809116066, 808558881, 808077216, 807590306, 807060182]
2029.4H07060182l95536k05756j19865L338K06888K35438j1444k03550j65998j40250
2049.8H06263447l00288m22538l37064k62141l90589m92037l70145k93612m55141n98014
2070.2H02341878m98533l87609m43339n06759m79936n12302o07968m54306N900L99948
2090.6G98856974M47034L26276K44081R9898j85073l64542k81870k26438l88742n09441
2111G98018157l94225l16262m41134m47035j81257j6094j44481k89142k67685k97248
2131.4G95223594n44310o91891m96029k66970l16620m52876m13060l22938l74019m03702
2151.8G90941179k21133l5406j01745k56538k65122l18765n80132p66397n87940j75655
2172.2G87632346J69516L85642M95851L61085K98k49863k29716j47224j82747k14041
$$ y = [807060182, 806664646, 806458890, 806339025, 806342363, 806549251, 806784689, 806773245, 806569695, 806403697, 806263447, 805963159, 805540621, 805203557, 804941416, 804550827, 804058790, 803688645, 803395033, 802939892, 802341878, 801843345, 801455736, 801012397, 800505638, 800025702, 799513400, 798905432, 798451126, 798457026, 798856974, 799304008, 799630284, 799874365, 799974263, 799789190, 799424648, 799142778, 798916340, 798527598, 798018157, 797623932, 797307670, 796866536, 796419501, 796238244, 796222150, 796077669, 795788527, 795520842, 795223594, 794679284, 793987393, 793491364, 793224394, 792907774, 792454898, 792041838, 791718900, 791344881, 790941179, 790720046, 790684640, 790582895, 790326357, 790061235, 789742470, 789162338, 788395941, 787808001, 787632346, 787801862, 788187504, 788683355, 789044440, 789044738, 788794875, 788565159, 788417935, 788235188, 788021147]
2192.6G88021147j18315n5671j83999k95878j57535j9789j64032l82661m20869m38750
2213G85783648n79118o27458m56393k62618j91271j18852J8358M4167j38581l32236
2233.4G83139646l54469l53932m94242o08146n33581l97444l07262j63018L8028J08897
2253.8G80074477j3113j28746j19805j71483l77714n33224n50091o09457p85291q54195
2274.2G75931358o45399l31580r6262J03176K48372J84357o8068l50654n88060p14778
2294.6G73672462o95646o39856p41184r61125r31561l74973L32475N03361J19686l00467
2315G69983172n93125r16779j158536j036286n63681j08004Q7917Q7857p15j98186
2335.4G65583634m55856m46141p2777K88963N57483O14523Q2613q47102j617014j701295
$$ y = [788021147, 787902832, 787847161, 787663162, 787367284, 787209749, 787189960, 787025928, 786643267, 786222398, 785783648, 785204530, 784577072, 784120679, 783858061, 783666790, 783547938, 783566296, 783610463, 783471882, 783139646, 782785177, 782431245, 781937003, 781328857, 780795276, 780397832, 780090570, 779927552, 779965580, 780074477, 780061364, 779932618, 779812813, 779641330, 779263616, 778730392, 778180301, 777570844, 776785553, 775931358, 775285959, 774954379, 774858117, 774961293, 775209665, 775394022, 775325954, 774975300, 774387240, 773672462, 772976816, 772336960, 771595776, 770634651, 769703090, 769328117, 769660592, 770163953, 770283639, 769983172, 769390047, 768473268, 767314732, 766278446, 765714765, 765606761, 765694678, 765782535, 765781820, 765583634, 765127778, 764681637, 764608860, 764897823, 765455306, 766069829, 766152442, 765305340, 763688326, 761987031]
2355.8G61987031j288295r33290o36577j26005M24028P43568Q45074Q65937Q31067
2374.1G62712538O08385L43144L32892M15921K24054j66118l72112l40581l49522m76420
2394.5G62932181m13477n0724K15531J53065O8664R4950o4075l34978l26574q6128
2414.9G62188435j5676j61052j84238l7670k6167k28405l47256k69354k61128m32491
2435.3G60224998n16951l90530l16679m36247m98712l81529l23474m40419m82023l04460
2455.7G56133974j89603k95162l24130n8949J94490J07527j02818j55747j73986k97547
2476.1G54838049l75449k88069k14160l15130m53531m70937m74751o10947p41005o23584
2496.5G50270486k78771Q3029K94090L12805J75118p9453l35157m65870m78506n03957
$$ y = [761987031, 760698736, 759765446, 759128869, 759002864, 759426892, 760170460, 761015534, 761881471, 762712538, 763320923, 763664067, 763996959, 764412880, 764636934, 764470816, 764098704, 763758123, 763408601, 762932181, 762518704, 762467980, 762683511, 762836576, 762905240, 763000190, 762936115, 762601137, 762274563, 762188435, 762172759, 762011707, 761827469, 761789799, 761763632, 761535227, 761187971, 760918617, 760657489, 760224998, 759708047, 759317517, 759000838, 758564591, 758065879, 757684350, 757360876, 756920457, 756438434, 756133974, 755944371, 755649209, 755325079, 755266130, 755460620, 755568147, 755465329, 755309582, 755135596, 754838049, 754462600, 754174531, 753960371, 753645241, 753191710, 752720773, 752246022, 751635075, 750894070, 750270486, 749991715, 750074744, 750368834, 750681639, 750856757, 750777304, 750442147, 749976277, 749497771, 748993814]
2516.9G48993814o58453q77916j043797j108050r42528m17471K30431N90682N74827
2535.3G45341539L50297N6803k62916o09934r00984r25422n64396j4246L58463M11212
2555.6G43240416L00765J65284j8239k17796l02434k33352q3625J3590m0293k75314
2576G42549002o73175r62495p20919l0875M59433M58121K67863J23203m887j88530
2596.4G41276741l72231m15802m11987n25236o27876n80311n58793q04484j195729
2614.8G35784292j435935j468718j279474p01546J90079R46641J201212J069606R44197
2633.2G35250354Q60333N90384K37406N9485m470j83821m32551n37097n75543p58469
2653.5G34506011r99868j093447j107514j225710j239300p15255J39594O07788N14448
$$ y = [748993814, 748335361, 747457445, 746413648, 745305598, 744363070, 743945599, 744176030, 744766712, 745341539, 745691836, 745748639, 745485723, 744875789, 743974805, 743049383, 742484987, 742470741, 742829204, 743240416, 743541181, 743706465, 743688226, 743470430, 743167996, 742934644, 742851019, 742864609, 742824316, 742549002, 741875827, 740913332, 740192413, 740161538, 740620971, 741079092, 741346955, 741470158, 741465271, 741276741, 740904510, 740488708, 740076721, 739551485, 738923609, 738343298, 737784505, 736980021, 735784292, 734348357, 732879639, 731600165, 730898619, 731088698, 732035339, 733236551, 734306157, 735250354, 736110687, 736701071, 736938477, 736997962, 736993492, 736809671, 736377120, 735840023, 735264480, 734506011, 733506143, 732412696, 731305182, 730079472, 728840172, 728124917, 728264511, 728872299, 729386747]
2671.9G29386747K36034R179k02834l95715m32790l09706k22563k37584j92643r0122
2692.3G27548003j39594l58283n22912n48899o08087p49170q18968q29518r49264j132607
2712.7G20890701j132786r11832o71089m65810l17216m86434j218259k193749j992524
2731.1G11501002L59714K833605K857566J221359n6505o03259p87258p87318p43925
2749.4G15794981o99938o13510n83947p42495j026333j255333j334667j304090j247227
2767.8G06987441j190007j124263j081824j148045j325488j493693j658201j939952
2784.1F96025968k347112k771378l114521l286123l139079k526403j411676L2663J464725
2802.4F78927064K507210K930522K805769K352834J704872R75847K99036k74658p32720
$$ y = [729386747, 729622781, 729631960, 729429126, 729033411, 728600621, 728290915, 728068352, 727830768, 727638125, 727548003, 727408409, 727050126, 726527214, 725978315, 725370228, 724621058, 723802090, 722972572, 722023308, 720890701, 719757915, 718846083, 718174994, 717709184, 717391968, 716905534, 715687275, 713493526, 711501002, 711860716, 714694321, 717551887, 718773246, 718716741, 718113482, 717326224, 716538906, 715794981, 715095043, 714481533, 713897586, 713155091, 712128758, 710873425, 709538758, 708234668, 706987441, 705797434, 704673171, 703591347, 702443302, 701117814, 699624121, 697965920, 696025968, 693678856, 690907478, 687792957, 684506834, 681367755, 678841352, 677429676, 677462339, 678927064, 681434274, 684364796, 687170565, 689523399, 691228271, 692204118, 692503154, 692228496, 691495776]
2820.8F91495776j077592j402140j757145k070725k327621k554059k691030k707541
2837.1F74907923k697706k746404k844631k936304k948523k751588k260685j721084
2853.4F54000998j549900j829088k335489k873778k918959j350045K297342O311655
2869.7F49752736Q009911O721496M042030J528918m31656j932741k879321l193677
2886.1F61617696l040313k586544j830935q85547j71125N4777j669j55568n35488j341403
2906.5F51123881k685368m594326o969750r172380r271621m886628L161788R523273
2922.8F26228869R928107O038904K149046M5717j422704m133045r231270j6268611
2939.1F13335013k0847916j5100956J772880J7328203K0550013J4318049O550192M37022
$$ y = [691495776, 690418184, 689016044, 687258899, 685188174, 682860553, 680306494, 677615464, 674907923, 672210217, 669463813, 666619182, 663682878, 660734355, 657982767, 655722082, 654000998, 652451098, 650622010, 648286521, 645412743, 642493784, 641143739, 643441081, 649752736, 657762647, 664484143, 668526173, 670055091, 669623435, 667690694, 664811373, 661617696, 658577383, 655990839, 654159904, 653274357, 653103232, 653158009, 653156340, 653000772, 652465284, 651123881, 648438513, 643844187, 636874437, 627702057, 618430436, 613543808, 616705596, 626228869, 636156976, 642195880, 644344926, 644390643, 642967939, 638834894, 629603624, 613335013, 592487097, 577386141, 579159021, 596487224, 617037237, 631355286, 637905478, 638342500]
2955.4F38342500m325509q432448j1576951j1785507o980360J613856R310663J2388825
2971.7F18555069J1034369P704139M500628K260685R63270L31819p8678o90877j514495
2990.1F43065929k266764k735853k757550j980304k20180J870871L080606K798140
3006.4F40854895J520872J65820o13093p02739o15954r76145j936079l202021m427373
3024.7F30068183n517900o492019o912887n877733l503144j712620k016783l339708
3041.1E94695389l505528k081275o63042o30259j708329k960086l869831m294813m250407
3059.4E70731819l822983l057658j918972l45707J588226L582716N246937O266534
3075.7E78270912O546557O164193N334318M366457L383220K289652J047075l64244
$$ y = [638342500, 634016991, 625584543, 614007592, 602222085, 595241725, 596855581, 606166244, 618555069, 629589438, 637293577, 641794205, 644054890, 645018160, 645349979, 645271301, 644580424, 643065929, 640799165, 638063312, 635305762, 633325458, 633105278, 634976149, 638056755, 640854895, 642375767, 642541587, 641928494, 641225755, 640609801, 639633656, 637697577, 634495556, 630068183, 624550283, 618058264, 611145377, 605267644, 601764500, 600051880, 598035097, 594695389, 591189861, 589108586, 588445544, 587815285, 586106956, 583146870, 579277039, 574982226, 570731819, 566908836, 563851178, 561932206, 561586499, 563174725, 566757441, 572004378, 578270912, 584817469, 590981662, 596315980, 600682437, 604065657, 606355309, 607402384, 607038140]
3092.1F07038140j985848l773749n656898p223248p499218n987525l910899l246665
3108.4E67754090m478634o425678p874012q324921p647276n780340k734482J164973
3124.7E25653720N061567P972121R398282R434402Q474648P062017N571366M085600
3141E82713723K768934J733124Q60512Q6368o20306j390457k143741k667248l028274
3159.4E78312635l387570l799558m285335m847527n429566n957126o409943o749988
3175.7E37446022o901443o710768o051957m889250l183961r62198J577914M040658
3192E14365017N949855O939650O883144N950988M523396K964675J491964J90735q62658
3210.3E48396766j639068k202868k631307k988398l315032l671646m133284m730701
$$ y = [607038140, 605052292, 601278543, 595621645, 588398397, 580899179, 574911654, 571000755, 567754090, 563275456, 556849778, 548975766, 540650845, 533003569, 527223229, 524488747, 525653720, 530715287, 538687408, 548085690, 557520092, 565994740, 573056757, 578628123, 582713723, 585482657, 587215781, 588076293, 588162661, 587542355, 586151898, 584008157, 581340909, 578312635, 574925065, 571125507, 566840172, 561992645, 556563079, 550605953, 544196010, 537446022, 530544579, 523833811, 517781854, 512892604, 509708643, 508746445, 510324359, 514365017, 520314872, 527254522, 534137666, 540088654, 544612050, 547576725, 549068689, 549259424, 548396766, 546757698, 544554830, 541923523, 538935125, 535620093, 531948447, 527815163, 523084462]
3226.7E23084462n452574o271243p115125p893682q518457q906871r046197q949638
3243D60930675q619994q040398p164687n861670m020512j753300N99086K500057L305644
3261.3D31874901K641499P66635j571655l585905m830182n277365n268902n290448
3277.7D09458578n548358n903334o026149n611240m547239k761125l17604K429992
3294C81173521N117476P549495R599894J1152715J2164235J2673676J2845218J2810439
3310.3D65086669J2533992J1918932J0904998R607375Q403957P791698Q056640Q887828
3326.6E43192089R470939R381831Q824766Q028864P123650O300270N644739N048334
3342.9F03015482M443527L848135L284395K791226K334952J900613J562953J290083
$$ y = [523084462, 517631888, 511360645, 504245520, 496351838, 487833381, 478926510, 469880313, 460930675, 452310681, 444270283, 437105596, 431243926, 427223414, 425470114, 426069200, 428569257, 431874901, 434516400, 435283035, 433711380, 430125475, 425295293, 420017928, 414749026, 409458578, 403910220, 398006886, 391980737, 386369497, 381822258, 379061133, 378743529, 381173521, 386290997, 393840492, 403440386, 414593101, 426757336, 439431012, 452276230, 465086669, 477620661, 489539593, 500444591, 510051966, 518455923, 526247621, 534304261, 543192089, 552663028, 562044859, 570869625, 578898489, 586022139, 592322409, 597967148, 603015482, 607459009, 611307144, 614591539, 617382765, 619717717, 621618330, 623181283, 624471366]
3359.2F24471366R55999O40333N06520M16637J73866j37090k93970k73288k65956l02374
3379.6F25892043l06606l12030l41356k96891j70291k03013m36544n26727l19063j59264
3400F22820258m06980p16985o21557m20928m30882n29408o18100o05524m41313l46184
3420.4F17682397m01973l58820j84298j12355j81615j08004O2645n3585l11434k98202
3440.8F15734756p2658J18494K40147K84195K73287L00467L79444M52399M73439M35889
3461.2F18619859N05269P47859Q08239M82083J36435J63674M19796O43491O68288M51266
3481.6F23646259L25322M15802M91620N23746N75304N81562N70059N76198N79357N84960
3502F28870189N12719M72784N71907P04884Q78275R20296P51614O61731P93874R48787
$$ y = [624471366, 625427365, 626067698, 626574218, 626990855, 627164721, 627027631, 626733661, 626460373, 626194417, 625892043, 625585437, 625273407, 624932051, 624635160, 624464869, 624261856, 623825312, 623298585, 622979522, 622820258, 622413278, 621696293, 621074736, 620653808, 620222926, 619693518, 619075418, 618469894, 618028581, 617682397, 617280424, 616921604, 616737306, 616624951, 616443336, 616335332, 616397977, 616344392, 616032958, 615734756, 615662098, 615780592, 616020739, 616304934, 616578221, 616878688, 617258132, 617710531, 618183970, 618619859, 619125128, 619872987, 620681226, 621163309, 621299744, 621463418, 621883214, 622526705, 623194993, 623646259, 623971581, 624387383, 624879003, 625402749, 625978053, 626559615, 627129674, 627705872, 628285229, 628870189, 629382908, 629855692, 630427599, 631132483, 632010758, 632931054, 633682668, 634344399, 635138273, 636087060]
3522.4F36087060P87497M96566N37574P85947R43780R88007Q61406P16150Q09371R15468
3542.8F43928826Q18372O67512O81698P60496P62045Q22545R08315Q94785Q07166O14881
3563.2F51666641M37856O94990J201451J253188J024961R43899R95577J117467J228214
3581.5F60564244J134097Q41856Q13783J222431J302600J018346J013934J231551J209617
3599.9F70352459J079500R98318P78139O83367Q85427J007974J003623Q55684P59244
3618.3F78403735J057029J170695P73132K34484J51515Q39174J121998Q55982O68407
3636.6F85276151N62250M44293K93911J2934l14712j53900N03540O22571K91228L18825
3657F87857091N37515L27289m17j57177m25876o72102l87787l36647o76871k44617
$$ y = [636087060, 636874557, 637371123, 637908697, 638694644, 639638424, 640626431, 641487837, 642203987, 643013358, 643928826, 644747198, 645414710, 646096408, 646856904, 647618949, 648441494, 649349809, 650244594, 651051760, 651666641, 652104497, 652799487, 654000938, 655254126, 656279087, 657222986, 658218563, 659336030, 660564244, 661698341, 662540197, 663353980, 664576411, 665879011, 666897357, 667911291, 669142842, 670352459, 671431959, 672430277, 673208416, 673891783, 674777210, 675785184, 676788807, 677644491, 678403735, 679460764, 680631459, 681404591, 681639075, 681790590, 682629764, 683751762, 684607744, 685276151, 685838401, 686282694, 686576605, 686589539, 686274827, 686120927, 686624467, 687247038, 687538266, 687857091, 688394606, 688721895, 688721478, 688564301, 688138425, 687466323, 687078536, 686741889, 686065018, 685820401]
3677.4F85820401L02016L90947M06623K72989O3658N6505L28124N61416N06580K35975
3697.8F88945234n6327j32322L6717M0948k17497m36366j96040L51727M07756L5107
3718.2F88778937k73287l32058k41756p8142N4121j27912n18381n22852N2512M40597
3738.6F87231779O1691p37906r12606k16544j62423k71082L20495N35130J30773j48535
3759F85830772q583J8477j97470k59638j82330n0724J3769p0155j38283j48058j34408
3781.4F84673369j17064q8870l8207j0132q6248l11971m24922l26097m45842m38214
3801.8F82385802l8266o6817j71184L755j02937n30005o74546l39806k12848o199K13146
3824.3F80460095R835j29640j84596k78532l42906n06937n16653j29879J73271K19166
$$ y = [685820401, 686122417, 686513364, 686919987, 687192976, 687256634, 687313139, 687641263, 688202679, 688709259, 688945234, 688888907, 688756585, 688793302, 688834250, 688616753, 688180387, 687984347, 688336074, 688743830, 688778937, 688505650, 688173592, 687931836, 687853694, 687907815, 687779903, 687261522, 686738670, 686791182, 687231779, 687293470, 686555564, 685642958, 685426414, 685263991, 684992909, 685313404, 685848534, 685979307, 685830772, 685822189, 685840666, 685643196, 685383558, 685201228, 685150504, 685164273, 685094118, 684955835, 684807777, 684673369, 684556305, 684467435, 684429228, 684419096, 684332848, 684020877, 683595955, 683269858, 682824016, 682385802, 682347536, 682280719, 682109535, 682113290, 682010353, 681480348, 680805802, 680465996, 680253148, 680246949, 680460095, 680469930, 680340290, 680155694, 679877162, 679534256, 679027319, 678510666, 678380787, 678554058, 678773224]
3844.6F78773224Q2910k54392p55787j053810k29776N93424L81231o5267l09289k50995
3865F76911473k49028m56572l28779l0696P1525l993k88010l04341j51277j92403j19567
3887.5F74858332j23561j86681j8657l4153l58761n51223m02868m5419L20494L77000
3907.9F73834503J42634m2975j81616l54767l44455k13682k36452k82347j49906q3268
3928.3F72087669j85251j30415M2677K7657j16766k42233k45214j18017o3240j09196
3948.7F70947671j22130n3167J5795k9862j33693j53542r1016n1022n6207n7041q7023
3971.1F70128763j33515j08063r2685j30177j32680j20163j35302j58668j61111j52588
3991.5F68803811j75834k00688j82152
$$ y = [678773224, 678856134, 678601742, 677845955, 676792145, 676562369, 677155793, 677537024, 677471757, 677162468, 676911473, 676662445, 676205873, 675877094, 675846398, 675917923, 675913930, 675625920, 675321579, 675170302, 674977899, 674858332, 674734771, 674548090, 674529433, 674495280, 674136519, 673585296, 673182428, 673137009, 673457503, 673834503, 673977137, 673934162, 673752546, 673397779, 673053324, 672839642, 672603190, 672320843, 672170937, 672087669, 671902418, 671772003, 671814680, 671842337, 671725571, 671483338, 671238124, 671120107, 671056867, 670947671, 670825541, 670772374, 670788169, 670758307, 670624614, 670471072, 670380056, 670329034, 670272827, 670215786, 670128763, 669995248, 669887185, 669794500, 669664323, 669531643, 669411480, 669276178, 669117510, 668956399, 668803811, 668627977, 668427289, 668245137]
3997.6F68245137
$$ y = [668245137]
##END=$$ End of the data block
