##TITLE=Julia - 3 - dimetil $$ Begin of the data block
##JCAMP-DX=5.00 $$ ACD/SpecManager v 10.08
##SPECTROMETER/DATA SYSTEM=Alpha
##DATE=22 Oct 2014 10:39:34
##DATA TYPE=INFRARED SPECTRUM
##DATA CLASS=XYDATA
##ORIGIN=
##OWNER=
##NPOINTS=1765
##FIRSTX=399.76428223
##LASTX=3997.64306641
##MAXX=3997.64306641
##MINX=399.76428223
##MAXY=0.84676659
##MINY=0.21439563
##XFACTOR=1.0000000000
##YFACTOR=1.000000000000000e-9
##FIRSTY=0.81251538
##DELTAX=2.03961372
##XUNITS=1/CM
##YUNITS=ARBITRARY UNITS
##XYDATA=(X++(Y..Y))
399.8H12515378m970253o414532p136166o932020p440687r797692j1593163r427905
416.1G48802960k357960P743597J3058126J3194621R406745M796982K940357K239048
432.4G99824476J088798m22299j419544j011014R0420m95672l068685l379524J902461
450.8G93109417Q437157R590685N757153N26130k716064k551735l22342R85921n40435
469.1H12275887l775478n963266n714297n820692p546663o790042k797842j833141
485.4G72034466o986916j0808766k226889J2123287J3323247L653586m939854j3579368
501.7G62592793k4492026k9765189j7800808P542551J9370735O273031j0539889o711126
518.1G06470072J6021192L1908989K8928876J6945482O858825K794564K838194L280104
$$ y = [812515378, 807545125, 801130593, 793994427, 787062407, 779621720, 769824028, 758230865, 748802960, 746445000, 754188597, 767246723, 780441344, 789848089, 794645071, 797585428, 799824476, 800913274, 800490975, 799071431, 798060417, 798150837, 797655165, 794586480, 791206956, 793109417, 801546574, 811137259, 816894412, 817420542, 814704478, 812152743, 811830401, 812816322, 812275887, 808500409, 802537143, 796822846, 791002154, 783455491, 776665449, 773867607, 772034466, 765047550, 754238784, 752011895, 764135182, 777458429, 781112015, 776172161, 762592793, 738100767, 708335578, 690534770, 698077321, 717448056, 723721087, 713181198, 706470072, 722491264, 754400253, 783329129, 800274611, 807133436, 809928000, 812766194, 816046298]
534.4H16046298J860797q98361k386093j278937P79450J271903n35071l086984m462778
552.7H07310224n213142n873203k578259L935874N877554L464341K319456K066493
569.1H11309338M89592j542151k074063p05897R54151Q98957r34243k633333k590359
587.4H03171992j418650j340806k719522l023684r14991J782716L066897K364755J50263
605.8H01118970j966178k128542m62353P83264P511k162218l328801j794815R81808
624.1G91048646J802146l42547l644288n998194o329477o521165j1515320j8975973
640.4G39523828j2422800J1678636K8163612K3314595J1028648K951026k52724k78771
656.8H03706050P99119R27866l34919j474261j910627j206338L26991K68698j028359
$$ y = [816046298, 817907095, 817008734, 814622641, 813343704, 814123154, 815395057, 814859986, 811773002, 807310224, 802097082, 796223879, 793645620, 797581494, 803459048, 806923389, 809242845, 811309338, 811798930, 810256779, 808182716, 807476819, 808430970, 809329927, 808395684, 805762351, 803171992, 801753342, 800412536, 797693014, 794669330, 793754339, 795537055, 798603952, 800968707, 801118970, 799152792, 797024250, 796561897, 797345161, 797352672, 795190454, 791861653, 790066838, 791048646, 792850792, 792508245, 788863957, 782865763, 776536286, 770015121, 758499801, 739523828, 727101028, 738779664, 766943276, 790257871, 801286519, 804237545, 803984821, 803706050, 804505169, 805433035, 805098116, 803623855, 801713228, 800506890, 800833881, 801102579, 800074220]
675.1H00074220k058447j576245j17182N64456l42846j836240k453626j658916n82874
693.5G90012300p21395k238691l964960n255819p394373j1716187j2205899j643777
709.8G44871199Q830547P381678M255891O079793N331635N08726l764689o191552o908416
728.1G60394812o922245r197712r843886r09031R735346R390354J992166m595220r425044
746.5G40619540j3736486j8978477k3153484j5391230J0518729L5119236L6527097
760.8G51524925K2163093R125293J504182k552151l864587l386259k994120m387736
777.1G67132640p500947j0999739j5384078k5483906l9419234l4170210o280840N225241
793.4F33118927O06001J8992960M3141485L6720991J4584481Q68500m880071r956121
$$ y = [800074220, 798015773, 796439528, 796322346, 796886802, 796543956, 794707716, 792254090, 790595174, 790012300, 789290905, 787052214, 783087254, 777831435, 770437062, 758720875, 746514976, 744871199, 753701746, 761083424, 765339315, 771419108, 776750743, 777259469, 773494780, 767303228, 760394812, 753472567, 744274855, 734430969, 733521938, 743257284, 752647638, 754639804, 750044584, 740619540, 726883054, 707904577, 684751093, 669359863, 679878592, 714997828, 751524925, 773688018, 782813311, 784317493, 781765342, 777900755, 774514496, 771520376, 767132640, 759631693, 748631954, 733247876, 707763970, 668344736, 634174526, 627893686, 633118927, 633724928, 652717888, 695859373, 732580364, 747164845, 748033345, 743153274, 733197153]
809.7G33197153j8579126l3181071n2209139n5172145j4866650M4376432O5034211
824F68599665M4092834J9907713Q489370M701794L235817K067744R14574L18229L70562
842.4G52698302L67642m19081j678347k302170j747370n24699Q6724n14268j630605
860.7G44336128k147019j763940j113593j123011j927614k805949l091693k679169
877G27684140k342343k847612m227698n945384p947266j1051059j3919652p343530
893.4F72059596J0674357J9906819J1317551J140833k259493l171742l923654m296601
909.7G01447666m147709m130542m961669o665886q563042j0324657j2639939j6955674
926F33058548k4352551l3662021l8908422k9430687m172087J5266478J5241802K0493388
$$ y = [733197153, 714618027, 681436956, 629227817, 574055672, 559189022, 603565454, 668599665, 712692499, 732600212, 741089582, 745791376, 749027193, 751094937, 752009511, 752327740, 752698302, 753065944, 752646863, 750968516, 748666346, 746918976, 746394277, 746481001, 745966733, 744336128, 742189109, 740425169, 739311576, 738188565, 736260951, 733455002, 730363309, 727684140, 725341797, 722494185, 718266487, 712321103, 704373837, 693322778, 679403126, 672059596, 682733953, 702640772, 713958323, 715099156, 712839663, 709667921, 705744267, 701447666, 697299957, 693169415, 688207746, 681541860, 672978818, 662654161, 650014222, 633058548, 608705997, 575043976, 536135554, 506704867, 502532780, 517799258, 533041060, 553534448]
942.3E53534448M4015885N4510831L7826360J6698002M988730l06725k614737l414929
958.6G05237865l839910m737496o160617p156849n998730l546477m354715j0202050
974.9F59241021j2581826j324236J2942791J2412965K658367l631413o129920p711887
991.3F55875862r576500j3389230j6953945q348047P901370O516516o133258n288959
1007.6F10603809L517688N269706N9724n831182r810150j2848258j5483797j6607165
1023.9E58870375j3944447o211102M488051J4169216K0018399J9916296J4255047P122278
1040.2F18684113J757443j659036l804147m831910m942715m796148n128502n861521
1056.5E89417577o164730n327701l610909k121270j679719k189457l008008l644466
$$ y = [553534448, 597550333, 652061164, 689887524, 706585526, 711574256, 711267531, 708652794, 705237865, 701397955, 696660459, 690499842, 683342993, 677344263, 673797786, 669443071, 659241021, 646659195, 645334959, 658277750, 670690715, 673349082, 669717669, 663587749, 655875862, 646299362, 632910132, 615956187, 607608140, 615509510, 622026026, 615892768, 610603809, 614121497, 619391203, 619450927, 613619745, 603809595, 590961337, 575477540, 558870375, 544925928, 538714826, 543202877, 557372093, 577390492, 597306788, 611561835, 618684113, 620441556, 618782520, 614978373, 610146463, 605203748, 600407600, 595279098, 589417577, 583252847, 577925146, 574314237, 572192967, 570513248, 568323791, 565315783, 561671317]
1072.8E61671317m061222m571796n334735o222904o975889p452130p812739q272886
1089.2E10967016q697390q659363p859767o514549n397767n147785n762368o752282
1105.5D56175745p666767q485377r612709j1536926j4180213j6608418j7811417j8020243
1121.8C52253675j8540382j9399255j7767758r934753L771246J6255229K1287322K3280383
1138.1C51205707K9335826L3830047K4541855K171904j9739896l2108605l6210448
1152.4C53026390l5869837l2113880k4611294j4412269l531009O962642J6794980K4930030
1168.7B91175753K9437095K8552949K1659374J0292471j632124r411901r615452j389503
1185C59068662J2877285K8105647L8997650M2807877L9753556L2437206K4985432J9388318
$$ y = [561671317, 557610095, 553038299, 547703564, 541480660, 534504771, 527052641, 519239902, 510967016, 502269626, 493610263, 485750496, 479235947, 473838180, 468690395, 462928027, 456175745, 448508978, 440023601, 430410892, 418873966, 404693753, 388085335, 370273918, 352253675, 333713293, 314314038, 296546280, 286611527, 290382773, 306638002, 327925324, 351205707, 380541533, 414371580, 438913435, 441085339, 421345443, 389236838, 353026390, 317156553, 285042673, 260431379, 246019110, 242488101, 249450743, 266245723, 291175753, 320612848, 349165797, 370825171, 381117642, 379485518, 370073617, 360458165, 359068662, 371945947, 400051594, 439049244, 481857121, 521610677, 554047883, 579033315, 598421633]
1201.3E98421633J3104022M069507l815711m807114l62814K451778M921317J4150858
1217.7F28133476K3767888K1130503P989883m385889q763730o459296n030930r216428
1234F47165477j5501678j7292440j0946452R10341R766162J0188103N975484K623857
1250.3F32888854n71073p152259j7106116k5711238k5554001j1140883J0501921K1623492
1266.6E77778697J5270650J288176j0435104j8099666k4035633l0641615l7980795
1280.9D73144710m4006854m5848817m0056109k3525030K731353L1535745N4013014
1295.2D07988012O5454304O5814316N6974054M2126178K6032210J3060868M577875
1309.4F82027817p88331m556477o900490p895827q367896r453476j3522148k2462010
$$ y = [598421633, 611525655, 615595162, 611779451, 606972337, 606609523, 609061301, 613982618, 628133476, 651901364, 673031867, 681021750, 676635861, 667872131, 661412835, 656381905, 647165477, 631663799, 614371359, 603424907, 604335248, 614101410, 624289513, 630264997, 632888854, 632317781, 625165522, 608059406, 582348168, 556794167, 545653284, 556155205, 577778697, 593049347, 594337523, 583902419, 565802753, 541767120, 511125505, 473144710, 429137856, 383289039, 343232930, 319707900, 322439253, 353974998, 407988012, 473442316, 539256632, 596230686, 638356864, 664389074, 677449942, 682027817, 681239486, 676683009, 669782519, 661886692, 653518796, 644065320, 630543172, 608081162]
1325.8F08081162l2703757l2361150j3707399Q314549J3497293M311622m831255o706714
1342.1E43894351m168332l265381o202280j1041046j5499353j9342840k2679597k5281757
1358.4D36413765k8484941l3147096l4847170l1865239k6492596j4949322K381921
1372.7B69009322J4944583J1495590O441117J8543094L8317144M8501968M5672059
1386.9D52924877K6632846j265198k3909807l4274400k6421487j1946887P98494J5527516
1403.3C98065954L4062744M3033719K6529938l667921p241786K2968799M8712611M9249173
1419.6F11713231K9534280J3309419M977167j664996r377182j6976714k1117807k4528801
1435.9E85868597k0527065l455519J3320803K1943450J8692136O771922n454600j0214031
$$ y = [608081162, 575377405, 543016255, 529308856, 537623405, 551120698, 555432320, 550601065, 543894351, 539726019, 536460638, 530258358, 519217312, 503717959, 484375119, 461695522, 436413765, 407928824, 374781728, 339934558, 308069319, 281576723, 266627401, 269009322, 283953905, 295449495, 301890612, 320433706, 358750850, 407252818, 452924877, 479557723, 478292525, 454382718, 420108318, 393686831, 381739944, 382538438, 398065954, 432128698, 475162417, 501692355, 498024434, 490782648, 513751447, 562464058, 611713231, 641247511, 654556930, 659534097, 657869101, 648491919, 631515205, 610397398, 585868597, 565341532, 561886013, 575206816, 597150266, 615842402, 622614324, 617159724, 606945693]
1452.2F06945693p563173J235127J2585581J4024198J0151863N365073r69290n756557
1468.5F36018515r979129j7120779k2166431k2861957k3304105k4605274k6003182
1482.8D89977658k6271433k8228193l3325196l6219239l1032592k7004510k7145326
1497.1B80751169k4420440j9587279j4357135p990688K443195J1856600J6669795K0835683
1513.4B66200900K5090158K8752118L0620993L5545319L5312086L0537367K7385354
1527.7D79444295J9427061Q822650n046904j7040521k1286696j8846989J95772J8347173
1544D64015841K4828047K5684983K5811672K4796486K3872912K3694574K9043615K9882670
1560.3F71630800J6104400J1284232J0797143J0196686J0081410Q572161Q141458P963300
$$ y = [606945693, 599382520, 600617647, 613203228, 627227426, 637379289, 642744362, 641775072, 636018515, 626039386, 608918607, 586752176, 563890219, 540586114, 515980840, 489977658, 463706225, 435478032, 402152836, 365933597, 334901005, 307896495, 280751169, 256330729, 236743450, 222386315, 214395627, 216838822, 228695422, 245365217, 266200900, 291291058, 320043176, 350664169, 386209488, 421521574, 452058941, 479444295, 498871356, 507694006, 502647102, 485606581, 464319885, 445472896, 445668668, 464015841, 488843888, 514528871, 540340543, 565137029, 589009941, 612704515, 641748130, 671630800, 687735200, 699019432, 709816575, 720013261, 730094671, 738666832, 746808290, 754771590]
1576.6G54771590L967285M173l007293o642997j0427952j3009906j3859928j3958633
1593F97836339j4849305j6651094j8682956k1171630k4448752k7086854k6550532j9666552
1609.3E28728664o467581Q379698K6198029M5165897M4170797L6022246L1870126K2955537
1625.6G37023413J4688850R771406O170869M240513J741827k093018k438128k26080
1641.9G68879652K123237L022968J560867K42234k65897k558410m188061m126727m626513
1660.3G60063350m970729m088521k934098m346729p264793p581114r199143j2701392
1676.6G06976831j3888717j4079332j8638849l1397999l6998033m1078031n0821841
1690.9E00074029n1216066m7654867l5262555q905441J5345365K7078092L7343502
$$ y = [754771590, 758738875, 758743048, 755735755, 749092758, 738664806, 725654900, 711794972, 697836339, 682987034, 666335940, 647652984, 626481354, 602032602, 574945748, 548395216, 528728664, 522261083, 530640781, 556838810, 602004707, 646175504, 682197750, 714067876, 737023413, 751712263, 761483669, 767654538, 771895051, 773636878, 771543860, 769105732, 768879652, 771002889, 774025857, 775586724, 775828958, 775563061, 773004651, 768816590, 764689863, 760063350, 755092621, 751004100, 748070002, 743723273, 736458480, 728877366, 719678223, 706976831, 693088114, 679008782, 660369933, 628971934, 591973901, 550895870, 500074029, 448857963, 401203096, 365940541, 357035100, 372380465, 399458557, 436802059]
1705.1D36802059M7507704M7931105M4440269L8558245L0961633K2537887J0854423
1719.4F79593325J20699n983293o837547o84798Q252860J4631688J8901467J7759085
1735.7G25753486J3177514J2737096J1894345R271622Q311331Q363187Q899570Q333206
1752H06741357O710768N719482M762769L627777L004969K569377K509117K907634K846718
1770.4H41399968K269089J107097M39643K62857j73271o99878q44955m08471M02451
1788.8H43754530J153588R09865L0399k84851j20103n7459j36078q0764J23024L76582
1809.2H45668733M38452L71337K41935M6134k06470k01583j3113J4841j26064l96609
1829.6H45837593o94275o05106k76387k30551l17037l01003m59492q96514j044750
$$ y = [436802059, 484309763, 532240868, 576681137, 615239382, 646201015, 668738902, 679593325, 679714024, 673730731, 666893184, 666208386, 674461246, 689092934, 707994401, 725753486, 738931000, 751668096, 763562441, 772834063, 781145394, 789508581, 798408151, 806741357, 813452125, 819171607, 823934376, 827562153, 830567122, 833136499, 835645616, 838553250, 841399968, 843669057, 844776154, 845215797, 845478654, 845305383, 844605505, 843760550, 843352079, 843754530, 844908118, 845817983, 845848382, 845563531, 845443428, 845385969, 845249891, 845169127, 845292151, 845668733, 846107185, 846478522, 846720457, 846766591, 846560121, 846358538, 846345425, 846360266, 846234202, 845837593, 845143318, 844538212, 844261825, 844031274, 843714237, 843413234, 842953742, 842057228, 841012478]
1847.9H41012478j055658j157284j187801j081228q68500p39932p18057p02739n72741
1866.3H32928538n79118q32737r99272j156330j418829j523077j341760j057446o94991
1884.6H23324978j20580N52178Q75532Q07166N78344J75119k40267n05984o17682o27041
1905H24201763p02918j036942j420975j384496q36552k68578o6757j24157l57687o60062
1925.4H17342639q15868r43184j229346j568794j655817j187385k20775N99623O49631
1943.8H10970724J50501l31044n47588m04417n8413J29402j2457k89143m73260n23091
1964.2H08611214n57661o61015p03574n70774l56674k05398k11060l69489n61714o27875
1984.6H03785980n45919n01514o81758j108646j564860j819909j655102r73820l23952
$$ y = [841012478, 839956820, 838799536, 837611735, 836530507, 835662007, 834922075, 834204018, 833501279, 832928538, 832349420, 831516683, 830517411, 829361081, 827942252, 826419175, 825077415, 824019969, 823324978, 823204398, 823756576, 824632108, 825439274, 826017618, 826192737, 825952470, 825446486, 824828804, 824201763, 823498845, 822461903, 821040928, 819656432, 818819880, 818551302, 818484545, 818360388, 818002701, 817342639, 816526771, 815583587, 814354241, 812785447, 811129630, 809942245, 809721470, 810321093, 810970724, 811121225, 810790181, 810242593, 809838176, 809779763, 809909165, 809896708, 809607565, 809134305, 808611214, 808053553, 807392538, 806688964, 806118190, 805761516, 805556118, 805345058, 804975569, 804413855, 803785980, 803240061, 802738547, 802056789, 800948143, 799383283, 797563374, 795908272, 794934452, 794610500]
2002.9G94610500j79350m7326L98755O26385L07620k39969o09099o71864n45502m71592
2023.3G93178558n13196n94079o27995n26845l79324l36051l71158l95477m30584m94301
2043.7G88509548n65946o53387p49766p15614m63545o8724L03387M52281L47435J33395
2064.1G86529064l4988j18851j73390k77043m10914n09381n46515n24164m98473n43475
2084.5G82891870o35624o44505n55754m60208m41551n08845n76138n27024l82066k80559
2104.9G77879596k79248l52561m19736m19856l54647l19958l93629n35309o28233o08921
2125.3G73567498n16832m27723m27306m91202m92751l65496k08080j58310k72572m32372
2145.7G69774854m54187l46065k89082l95596n75960o81221o26624m90308m23670m75466
$$ y = [794610500, 794431150, 794383824, 794782579, 795408964, 795716584, 795476615, 794867516, 794195652, 793650150, 793178558, 792665362, 792071283, 791443288, 790916443, 790537119, 790201068, 789829910, 789434433, 789003849, 788509548, 787943602, 787290215, 786540449, 785824835, 785361290, 785292566, 785595953, 786048234, 786395669, 786529064, 786494076, 786375225, 786201835, 785924792, 785513878, 785004497, 784457982, 783933818, 783435345, 782891870, 782256246, 781611741, 781055987, 780595779, 780154228, 779645383, 779069245, 778542221, 778160155, 777879596, 777600348, 777247787, 776828051, 776408195, 776053548, 775733590, 775339961, 774804652, 774176419, 773567498, 773050666, 772622943, 772195637, 771704435, 771211684, 770846188, 770638108, 770479798, 770207226, 769774854, 769320667, 768974602, 768685520, 768289924, 767713964, 767032743, 766406119, 765915811, 765492141, 765016675]
2166.1G65016675n12540l61085p5221J10149M4405k04622m46975n12898l89576k38479
2186.5G62429833k27391l25919l49462k12192l0220Q35j37508k66135k68400j90258
2206.9G60423183j60336k62082m30226n36442n37216m89474m97937o17981p85828q73088
2227.3G55232573q23498p15256o79553p37190p31289m92573q1897K39849K71857N6744
2247.7G51539767j73390k57433k40266k69830m19080n87583o36280n52356m14550k93315
2268.1G47695684j95682p6115N5790J16348J14859N0246j23143k94030l67701l44455
2288.5G46631801k82943l17752m12524m36068l86715l10957k88129l69966n23031o61373
2308.9G42642343o89030o20007n53787n40376n72741n78224m72844l46065l07261l17097
$$ y = [765016675, 764504135, 764143050, 764067829, 764177978, 764222383, 764017761, 763570786, 763057888, 762668312, 762429833, 762202442, 761876523, 761527061, 761314869, 761284649, 761285484, 761147976, 760881841, 760613441, 760423183, 760262847, 760000765, 759570539, 759034097, 758496881, 758007407, 757509470, 756891489, 756105661, 755232573, 754409075, 753693819, 753014266, 752277076, 751545787, 751053214, 750971317, 751211166, 751483023, 751539767, 751366377, 751108944, 750868678, 750598848, 750179768, 749592185, 748955905, 748403549, 747988999, 747695684, 747500002, 747423887, 747479677, 747596025, 747710884, 747761130, 747637987, 747343957, 746976256, 746631801, 746348858, 746031106, 745618582, 745182514, 744795799, 744484842, 744196713, 743826747, 743303716, 742642343, 741953313, 741333306, 740779519, 740239143, 739666402, 739088178, 738615334, 738269269, 737962008, 737644911]
2329.3G37644911k78294j63496j9073P5459K1815j59025m35710o26564m45127j76907
2349.7G35437989j41978k81572m19796m60386m08292m14371m66705m96626n23209n02944
2370.1G31322110m18127l83437m64797n47826m84288k75373p1347l3021j80661l86775
2390.4G28076458n52416o44028o91831p78318q85009q51810o32465l91841k54452j59264
2410.8G22235024K9743L52084O90222Q25346O51300K78115q1599k53379k43664k63751
2431.2G24219441m39584o40869p32839o95944o05643n94437p13885q45909q33750o76810
2451.6G17439771n08666m47333m84586m96387l70503j63197m7267q6129j58429j48892
2472G14528382o8665K2829L6537m2200j18851j19627q1062j11997k60949m46856n41211
$$ y = [737644911, 737366617, 737203121, 737184048, 737259507, 737281322, 737122297, 736686587, 736060023, 735614896, 735437989, 735296011, 735014439, 734594643, 734134257, 733725965, 733311594, 732844889, 732348263, 731825054, 731322110, 730903983, 730520546, 730055749, 729507923, 729023635, 728748262, 728676915, 728643894, 728463233, 728076458, 727524042, 726880014, 726188183, 725409865, 724524856, 723673046, 723040581, 722648740, 722394288, 722235024, 722264767, 722616851, 723307073, 724132419, 724783719, 725061834, 724980235, 724726856, 724483192, 724219441, 723779857, 723138988, 722406149, 721710205, 721104562, 720510125, 719796240, 718950331, 718116581, 717439771, 716931105, 716483772, 715999186, 715502799, 715132296, 714969099, 714921832, 714835703, 714677274, 714528382, 714459717, 714482546, 714519083, 714476883, 714358032, 714238405, 714157343, 714045346, 713784397, 713337541, 712796330]
2494.5G12796330n22732m81725n17488o39379p47621p28368o15895n45263n65649o01649
2514.9G06830561n26249l41773k08736k19226l20792m22418m63545l93689k47002j22487
2535.3G03564644p0632p9333q4043m8578J550L2544J5140m6134q4222q8334p8022l7670
2559.7G02996910n8532j82927k87473l24607l49998l89398m24087m40478m38928m02868
2580.1F99697614l28541k31862j30475m4048M4108J20163J16169j073j97708l55959
2600.5F98688388l96609m01378m47095n35130o46651p13408p10487o94633p27176q21174
2620.9F92594647r08076r14455q15451o74725n98192n50568m01616j32620J34706K79904
2641.3F88013554K80618J59443p75j10865j88350k94269m43637n94497p22229q44360
$$ y = [712796330, 712273598, 711791873, 711274385, 710635006, 709887385, 709159017, 708543122, 707997859, 707432210, 706830561, 706304312, 705962539, 705753803, 705534577, 705213785, 704791367, 704327822, 703934133, 703687131, 703564644, 703494012, 703414679, 703330636, 703282058, 703283608, 703316152, 703331292, 703285158, 703200936, 703112602, 703034580, 702996910, 702938378, 702755451, 702467978, 702143371, 701793373, 701403975, 700979888, 700539410, 700100482, 699697614, 699369073, 699137211, 699006736, 698962688, 699006796, 699126959, 699243128, 699242055, 699044347, 698688388, 698291779, 697890401, 697443306, 696908176, 696261525, 695548117, 694837630, 694142997, 693415821, 692594647, 691686571, 690772116, 689956665, 689281940, 688683748, 688133180, 687731564, 687598944, 687733650, 688013554, 688294172, 688453615, 688452840, 688341975, 688153625, 687859356, 687415719, 686821222, 686098993, 685254633]
2661.7F85254633r53614j016200j008749q60512n05150p0989K02001K34305J68026
2680.1F81443751J85788L17335M80055N91875O13391N88000N44190M80175M27723L22879
2700.5F85995162J11997p6950j57356k19107l68118n70595p01130p53999p68482p22826
2720.9F81768596o70790o68049o27995m93288l53455k57791j62661j09970j74880k89500
2741.2F77960217l22938k75671k33174j86264j06335l9756n2929j67489k29240q0764
2761.6F76265657J11639R2090j26243m06086o98090r15527r48131q10326n81860m21286
2782F71561837m77850o78718q46029r21070r78232j112997j327098j526594j634359
2800.4F62058890j607657j378536r30726m03285k3544R0539k205j85371m09841o59585
$$ y = [685254633, 684301019, 683284819, 682276070, 681415558, 680910408, 680839419, 681041420, 681275725, 681443751, 681629539, 681946874, 682426929, 683018804, 683632195, 684220195, 684764385, 685244560, 685672283, 685995162, 686107159, 686030209, 685872853, 685653746, 685285628, 684715033, 684013903, 683259904, 682491422, 681768596, 681097806, 680429757, 679801762, 679308474, 678955019, 678697228, 678534567, 678424597, 678249717, 677960217, 677637279, 677361608, 677128434, 676942170, 676835835, 676796079, 676743150, 676575661, 676346421, 676265657, 676377296, 676469386, 676343143, 675937057, 675238967, 674323440, 673375309, 672564983, 671983123, 671561837, 671083987, 670405269, 669559240, 668638170, 667659938, 666546941, 665219843, 663693249, 662058890, 660451233, 659072697, 658141971, 657738686, 657715142, 657805681, 657803476, 657618105, 657208264, 656548679]
2820.8F56548679q44240q64148p07269m12703r3102J22070J67370J9252l40819q54790
2841.2F52740300j290262j507103j595974j609683j471401j188934q35836m05132J3470
2859.5F42849445K99871M73857N10693L64721J27077j55032m80950o99699o81460m93765
2879.9F42114758l00645k37882l39449n18143o61194p30277p58111p93099q57950r20832
2900.3F35997176r19044q12948o42836m89056l84092l49879l67642l52084k56002j26422
2920.7F31297171n3048q1599j59263k81454m62710m41611R3579J009047J659095J542032
2941.1F34121239P97570p8499n01573q5295R44913J815080J972855J593708J092434
2959.5F41672432O48857L24905Q8751k11537o66976j299143k283931l789782m838348
$$ y = [656548679, 655704439, 654840291, 654133022, 653720319, 653627217, 653749287, 653916657, 653935909, 653595090, 652740300, 651450038, 649942935, 648346961, 646737278, 645265877, 644076943, 643241107, 642835975, 642849445, 643149316, 643623173, 644133866, 644498587, 644625664, 644470632, 643989682, 643289983, 642608523, 642114758, 641814113, 641576231, 641236782, 640718639, 640057445, 639327168, 638569057, 637775958, 636918008, 635997176, 635078132, 634265184, 633622348, 633133292, 632749200, 632399321, 632031679, 631679595, 631423593, 631297171, 631244123, 631162524, 631003261, 630721807, 630259097, 629817486, 629911065, 630920112, 632579207, 634121239, 634918809, 634840310, 634338737, 634253442, 635198355, 637013435, 638986290, 640579998, 641672432, 642321289, 642646194, 642734945, 642523408, 641856432, 640557289, 638273358, 634483576, 629645228]
2977.8F29645228k725482L211499Q003354P106006K846599j12832l67463N93305Q49724
2996.2F49049938J35123m39167n1021R68277J434565Q09669k52902j100719j544297
3014.5F49009466j301527k08795J112938J727223J453400P63178P5936l74973n56945
3032.9F51699901n40615m02033k43187p5996J13368K33889J54316j26183m28140o14166
3053.3F49771154p05361p21336o77764o76692p37846p74920p96735q56161r55284j061558
3073.7F41807497j096368r75311o66738k85267n0009p868m7862J6451L93033R98974
3094.1F40086532J512944J632572J272261P08759L40640L45588O08146Q60155R16063
3112.4F48283660P43092L91185K3305k96473n84781o74665n34058l85761l83675m75049
$$ y = [629645228, 626919746, 630131245, 638134599, 645240605, 648087204, 647974372, 647606909, 648200214, 649049938, 649185061, 648745894, 648694873, 649663150, 651097715, 651907384, 651654482, 650553763, 649009466, 647707939, 647499144, 648612082, 650339305, 651792705, 652555883, 652631819, 652256846, 651699901, 651159286, 650757253, 650514066, 650438070, 650551438, 650785327, 650939643, 650813460, 650385320, 649771154, 649065793, 648344457, 647666693, 646990001, 646252155, 645477235, 644680500, 643824339, 642869055, 641807497, 640711129, 639735818, 639069080, 638783813, 638733804, 638725936, 638678074, 638694525, 639087558, 640086532, 641599476, 643232048, 644504309, 645213068, 645553708, 645899296, 646507442, 647367597, 648283660, 649026752, 649417937, 649441242, 649144769, 648559988, 647885323, 647351265, 646965504, 646581829, 646106780]
3132.8F46106780m72427k97427k11179l76046n20885n19574m69625l11851j36197k33888
3153.2F42557681m79758n20706m18067l55542l47197l82543m43220m93467n12778n00083
3173.6F38104320m73381m75585n18203n73873n80013n18441m80414n22077o05345o60359
3194F32696629o29068n64277n60701n75125n71489n84960o09398o11604n80906n82457
3214.4F26826644o11186o09517n99384n93782n92172o38068p07865o90460o13928o28888
3234.8F20541394p31707p74801p12692o05226m95017m97996o60420p42256o07431m63844
3255.2F14250004m91321o03556o50049o06358m78685k64942j14441k89619o16670p00772
3275.6F09433591o28888n77748n50151n48363n62548n27382l90530l44634n47707q09312
$$ y = [646106780, 645634353, 645336926, 645125747, 644749701, 644228816, 643709242, 643239617, 642927766, 642791569, 642557681, 642077923, 641557217, 641139150, 640783608, 640436411, 640053868, 639610648, 639117181, 638604403, 638104320, 637630939, 637155354, 636637151, 636063278, 635483265, 634964824, 634484410, 633962333, 633356988, 632696629, 632067561, 631503284, 630942583, 630367458, 629795969, 629211009, 628601611, 627990007, 627409101, 626826644, 626215458, 625605941, 625006557, 624412775, 623820603, 623182535, 622474670, 621784210, 621170282, 620541394, 619809687, 619034886, 618322194, 617716968, 617221951, 616723955, 616063535, 615321279, 614713848, 614250004, 613758683, 613155127, 612505078, 611898720, 611420035, 611155093, 611040652, 610751033, 610134363, 609433591, 608804703, 608226955, 607676804, 607128441, 606565893, 606038511, 605647981, 605303347, 604755640, 603946328]
3296F03946328r48787q90076n97715l60012n35488r81570j278281j247167j050353
3314.4E96056879r76265j026094j010835r17614q81195j040637j262009j316309j266480
3332.7E86359441j175523j055955j141072j412630j586258j611889j462221j243055
3349E75670838j313090j636326j773536j658500j559436j601815j666010j594841j532555
3367.4E61334729j639306j797855j820088j711726j596689j479149j318812j177609
3383.7E48793495j164317j204014j191855j195550j234829j282513j368702j439631
3400E38712084j443207j429319j364589j159906q26657n30005l60787k48074k05398
3418.4E31144142l09884m39287m24981l02613j85072j85847j86980p7486p9155j82152
$$ y = [603946328, 602997541, 602107465, 601509750, 601149738, 600614250, 599632680, 598354399, 597107232, 596056879, 595080614, 594054520, 593043685, 592126071, 591244876, 590204239, 588942230, 587625921, 586359441, 585183918, 584127963, 582986891, 581574261, 579988003, 578376114, 576913893, 575670838, 574357748, 572721422, 570947886, 569289386, 567729950, 566128135, 564462125, 562867284, 561334729, 559695423, 557897568, 556077480, 554365754, 552769065, 551289916, 549971104, 548793495, 547629178, 546425164, 545233309, 544037759, 542802930, 541520417, 540151715, 538712084, 537268877, 535839558, 534474969, 533315063, 532488406, 531958401, 531597614, 531349540, 531144142, 530834258, 530394971, 529969990, 529667377, 529482305, 529296458, 529109478, 529031992, 528952837, 528770685]
3438.8E28770685j48535j2219J02103J50740J59264K39611L38256L60250M03762N03242
3459.2E30867159N04434M75109N90265O40392M02332J41143K14875M46558O29544O58453
3479.6E35570264M35889L72171N67973N70416M40657M97759O14881O15061N61594O18577
3500E40865242O63341M19676K77698N06639P21395P86424P00832N42819N75721Q02875
3520.4E46862662R86516Q42035N32210M82678O37472Q32379J002252R21071P14361
3538.7E53813636Q47161J137972J022518N53786M23968O59466P24256O84381P92741
3557.1E60659885R60768J012504R37402Q57949Q21591P82489P50065Q19624R50157
3575.4E68552434J033128J120746J258612J392185J268029Q22068P36475J022279J058519
$$ y = [528770685, 528622150, 528609931, 528712034, 528862774, 529022038, 529261649, 529599905, 529960155, 530363917, 530867159, 531371593, 531846702, 532436967, 533077359, 533479691, 533620834, 533835709, 534282267, 534911811, 535570264, 536006153, 536378324, 536946297, 537516713, 537957370, 538455129, 539070010, 539685071, 540246665, 540865242, 541528583, 541948259, 542225957, 542732596, 543453991, 544240415, 544941247, 545484066, 546059787, 546862662, 547849178, 548691213, 549223423, 549706101, 550343573, 551175952, 552178204, 553099275, 553813636, 554660797, 555798769, 556821287, 557375073, 557799041, 558458507, 559182763, 559867144, 560659885, 561620653, 562633157, 563570559, 564428508, 565250099, 566032588, 566782653, 567602277, 568552434, 569585562, 570706308, 571964920, 573357105, 574625134, 575447202, 576183677, 577205956, 578264475]
3593.8E78264475R89258J089633J103699R88603J016497J024127R10044Q99076R71496
3612.1E87256908J021684R92119Q53479P62105P67052Q29101Q50558N88775L97622
3630.5E94319403N54860N74171M68076M17947M12941N21779P48396Q07643M70102l0637
3650.9E99264681r6678J11103K47717K44796K6047j48177N6684L00467J21415n0545
3671.3F00077510O1333k78532n36800j99675M1246K38061N05567N93423O8546m91858
3691.7F00078821k76267O4432R2984j8836j47521j02103J61708L08394O9380l82245
3712.1E99848747l60906m4048P3970J7464j24037k64526k77698m5180K48968L12269
3732.5E99385023M8518k83718k71916o1155j47819m31657j54614N1021l59237n09679
$$ y = [578264475, 579253733, 580343366, 581447065, 582435668, 583452165, 584476292, 585386336, 586285412, 587256908, 588278592, 589270711, 590124190, 590886295, 591653347, 592482448, 593333006, 593921781, 594319403, 594874263, 595448434, 595916510, 596334457, 596747398, 597269177, 598017573, 598825216, 599295318, 599264681, 599168003, 599279106, 599526823, 599771619, 599797666, 599649489, 599706173, 600006640, 600128055, 600077510, 600138843, 599860311, 599323511, 599123836, 599165082, 599403143, 599908710, 600502133, 600570679, 600078821, 599802554, 599866986, 599959970, 599941134, 599793613, 599691510, 599853218, 600161612, 600230992, 599848747, 599487841, 599443793, 599517763, 599535227, 599411190, 599146664, 598868966, 598823786, 599072754, 599385023, 599433541, 599149823, 598877907, 598816752, 598668933, 598237276, 598082662, 598133683, 597774446, 597264767]
3752.9E97264767j39714L0935j55210k69771j32143n0545o3479k13981l90708k70844
3773.3E95609307Q881J60814l9280l25322l26574k55167j70231r2745r0718m3333J0014
3795.7E94445646L7253p5102l54052k78949j97709l77655k55704K8908P6056l8803
3816.1E93009889O5982q7499n41747m21583k01762j34289k3902O8188K02298L5822
3836.5E91971397m28855m45008k95699l10719j29938K24471L13640l97444j013041
3854.8E89488804l77953J02759J65641M888k06769j53840j97470l66866l02613j50859
3875.2E88005722j79q6010k15053o1572j14560k46227j52945k41101k88010k7954R0420
3897.7E86662531n4062k66730m09544l42071j74403j23620r9838l6418p4506j95325
$$ y = [597264767, 597125053, 597155988, 597000778, 596731007, 596598864, 596548319, 596484840, 596270859, 595880151, 595609307, 595618188, 595779002, 595739722, 595414400, 595087826, 594832659, 594662428, 594569683, 594478965, 594435632, 594445646, 594482899, 594407797, 594053745, 593774796, 593577087, 593199432, 592943728, 592972636, 593048692, 593009889, 593075871, 592988372, 592446625, 592025042, 591823280, 591688991, 591665089, 591733277, 591935575, 591971397, 591542542, 591097534, 590801835, 590491116, 590361178, 590585649, 590899289, 590501845, 589488804, 589110851, 589213610, 589379251, 589384139, 589177370, 589023530, 588826060, 588459194, 588156581, 588005722, 588005543, 587919533, 587704480, 587642908, 587528348, 587282121, 587129176, 586888075, 586600065, 586572111, 586662531, 586608469, 586341739, 585932195, 585590124, 585415721, 585292101, 585192263, 585155845, 585081339, 584886014]
3918.1E84886014k05755j58250j82510j60098o5684p4506k21789k95996k21610j07766
3938.5E83192050l7729j26481k29717j79112j02877j02818j37568j58131j69039j24633
3958.9E81823945p4506j10388j52170j62602j76787j66655j33812j02758j03772j51992
3979.3E80488503j72615j29521j30534k17080k37465j40190p4446j03057j60634
3997.6E79122961
$$ y = [584886014, 584680259, 584522009, 584339499, 584179401, 584113717, 584039211, 583817422, 583521426, 583299816, 583192050, 583154321, 583027840, 582798123, 582619011, 582516134, 582413316, 582275748, 582117617, 581948578, 581823945, 581749439, 581639051, 581486881, 581324279, 581147492, 580980837, 580847025, 580744267, 580640495, 580488503, 580315888, 580186367, 580055833, 579838753, 579601288, 579461098, 579386652, 579283595, 579122961]
##END=$$ End of the data block
