##TITLE=Julia - 2 - Benzaldeido $$ Begin of the data block
##JCAMP-DX=5.00 $$ ACD/SpecManager v 10.08
##SPECTROMETER/DATA SYSTEM=Alpha
##DATE=22 Oct 2014 10:39:34
##DATA TYPE=INFRARED SPECTRUM
##DATA CLASS=XYDATA
##ORIGIN=
##OWNER=
##NPOINTS=1765
##FIRSTX=399.76428223
##LASTX=3997.64306641
##MAXX=3997.64306641
##MINX=399.76428223
##MAXY=0.88708776
##MINY=0.20763749
##XFACTOR=1.0000000000
##YFACTOR=1.000000000000000e-9
##FIRSTY=0.86305046
##DELTAX=2.03961372
##XUNITS=1/CM
##YUNITS=ARBITRARY UNITS
##XYDATA=(X++(Y..Y))
399.8H63050461j301348l645718k288759J099586K451241K29001k556741k485871O3359
$$ 863050461 861749113 858103395 855814636 856914222 859365463 859594464 857037723 854551852 854615211
418.1H54615211J676560p12156l818632m282355k755582l349006q055985j4998079
$$ 854615211 856291771 855579615 851760983 847478628 844723046 841374040 833318055 818319976
434.4H18319976j8239021j0652840K555251R562194P286251m43399j2179494k5010407
$$ 818319976 800080955 789428115 791983366 801545560 808831811 808388412 796208918 771198511
450.8G71198511k4573028p52330K7486980L3591807J9069254N527020o37949O62446
$$ 771198511 746625483 745873153 773360133 806951940 826021194 831548214 830910265 831572711
467.1H31572711N264104O945729M677355M20034l482282m542529j712740J816571J591682
$$ 831572711 836836815 843782544 848459899 848879933 845397651 840855122 839142382 840958953 842550635
485.4H42550635k662897o255626l331721M952848R452939P141530L064454P23541j19687
$$ 842550635 839887738 833632112 830300391 835253239 844706178 851847708 854912162 855635703 855516016
503.8H55516016o08980j531184k609074k733469j670063q56936o28232L53753K033293
$$ 855516016 854907036 853375852 850766778 848033309 846363246 845506310 844878078 845231831 847265124
522.1H47265124L011585K661585J169801j419902m254460n631626n796909r630501
$$ 847265124 850276709 852938294 854108095 852688193 848433733 842802107 837005198 827374697
538.5H27374697k4341762m5781732l9601684J2503326N4857314M5645773J8932701
$$ 827374697 803032935 757251203 717649519 730152845 785010159 830655932 849588633
552.7H49588633N209922K064228K157808J528024l28719j537264q34465P81238J170815
$$ 849588633 854798555 856862783 859020591 860548615 860219896 858682632 857848167 858629405 859800220
571.1H59800220m41194k504647k897382r73045M93288r83000k355576n26130J592696
$$ 859800220 859359026 856854379 853956997 852983952 853477240 852494240 850138664 849612534 851205230
589.4H51205230J073599p56562k175450l776908n753637l914237L385842Q126438N652487
$$ 851205230 852278829 851522267 849346817 845569909 839816272 835902035 839287877 847414315 853066802
607.8H53066802J960039Q53002j55031k167106k200186J02639O17146k151012p395506
$$ 853066802 855026841 855879843 855724812 853557706 851357520 851460159 852077305 849926293 842530787
626.2H42530787j1990488r440898O23226Q194804O376505j080156q149147r703338
$$ 842530787 830540299 821099401 821722627 829917431 836293936 835213780 827064633 817361295
642.5H17361295k389371O974518Q453727M561961L144979N863667R054601Q185208
$$ 817361295 814971924 821946442 830400169 834962130 838107109 843970776 853025377 861210585
658.8H61210585L673970R8646o35445j86086j35362j343489k855301l505528l691911
$$ 861210585 864884555 864983201 864347756 864161670 864026308 862682819 859827518 856321990 852630079
677.2H52630079n604267r726405j4548779j7961979j6376853o401598K410471q326352
$$ 852630079 847025812 837299407 822750628 804788649 788411796 782010198 784420669 776094317
693.5G76094317k8301537k1510362R910226K5225937Q664787k3120463n0681710n0189734
$$ 776094317 747792780 726282418 736192644 761418581 770083368 746962905 696281195 646091461
709.8F46091461n333662N0319374O6804349M7968567K6880264J4806867P672965K839327
$$ 646091461 640757799 691077173 757881522 805850089 832730353 847537220 855210185 858049512
726.1H58049512K99036j58548n4955q86918k111792j277149K527237O596208P454455
$$ 858049512 858348548 858190000 858135045 857248127 855136335 853859186 856386423 862982631 870437086
744.5H70437086M818678J382648j11281O65128J513302K85685k709925n187035n919814
$$ 870437086 875255764 876638412 876527131 877192259 878705561 878991246 876281321 871094286 865174472
762.8H65174472o206333r487629j9092381l1520427k7422785N302191L6597549L5606325
$$ 865174472 858968139 849480510 830388129 798867702 771444917 776747108 813344657 848950982
779.1H48950982J7222822N230248J960993J349747p71165m668474q513928j0578751
$$ 848950982 866173804 871404052 873365045 874714792 873943627 869275153 860761225 850182474
795.4H50182474q768618k214432M874348P060707M117668p63178l455758k027929q07107
$$ 850182474 841413856 839199424 844073772 851134479 855252147 854488969 851033211 849005282 848198175
813.8H48198175m525899q254827k961874Q995951J4879703J1106909N918920L228485
$$ 848198175 843672276 835417449 832455575 841451526 856331229 867438138 873357058 876585543
830.1H76585543L70085m604220r955943j1422097n422056L342211N755484J846314
$$ 876585543 876955628 872351408 862395465 850973368 845551312 848893523 854649007 856495321
846.4H56495321j811743l603697j0148406k9601872m6140671j9761025L2037079M2750120
$$ 856495321 854683578 851079881 840931475 811329603 765188932 745427907 777464986 820215106
862.8H20215106J0741949k6666343n7166219n2133381R154856O5504849O0573935K7994991
$$ 820215106 830957055 804290712 747124493 694991112 704145968 769650817 830224752 858219743
879.1H58219743Q698880K567590n22971o443322j7400921l0977249l1837344r289443
$$ 858219743 866918623 869486213 868963242 862519920 845118999 814141750 782304406 773014963
895.4G73014963J2571752J3956129J2273312J3056159K814472j7486394l1016707k1434486
$$ 773014963 785586715 799542844 811816156 824872315 827686787 810200393 779183686 757749200
911.7G57749200N71847J4043987J5750408Q223831J551450N288005J1697650J2807786
$$ 757749200 758321047 772365034 788115442 796339273 797890723 803178728 814876378 827684164
928H27684164R774268N587160K826393L317237N794525O496072L743887m05848k982617
$$ 827684164 837458432 843045592 845871985 849189222 854983747 861479819 865223706 864817858 861835241
946.4H61835241l422260k820373k273321j745820p75397n36501l161788r537518j8511295
$$ 861835241 858412981 855592608 853319287 851573467 850798070 850261569 847099781 837562263 819050968
964.7H19050968k6311040k4658919p473945J4745176K3595392J7736495Q684635K327323
$$ 819050968 792739928 768081009 760607064 775352240 798947632 816684127 825368762 827696085
981.1H27696085m75347N27203J433253j220405m938125q750678j4332771j8873274
$$ 827696085 827220738 827747941 829181194 827960789 823022664 814271986 799939215 781065941
997.4G81065941j7869294j5587747j9290388k5662601k4890542j5107095j0396242
$$ 781065941 763196647 747608900 728318512 702655911 677765369 662658274 652262032
1011.6F52262032j8368602k3020386j5311003j0099113j3226569j979291L4361362
$$ 652262032 633893430 610873044 595562041 585462928 572236359 570257068 604618430
1025.9F04618430O4892292O2798798M1077197K2595763J3444603Q685350L800452j387000
$$ 604618430 669510722 732309520 773386717 795982480 809427083 818112433 821912885 820525885
1042.2H20525885o604016j3722897k1821797k1404028p495164L930270k628743k0884276
$$ 820525885 813921869 800198972 778377175 756973147 749477983 753408253 750779510 729895234
1058.6G29895234l8435519m3724477k3404300J4282822L5364151K6145518Q338571
$$ 729895234 691459715 647735238 624330938 638613760 673977911 700123429 708462000
1072.8G08462000k736151j1558295j2701809O344140L2168030L9911807K9891610J7789006
$$ 708462000 705725849 694167554 681465745 687809885 719977915 759889722 789781332 807570338
1089.2H07570338J0073722M474640j101494o288588j0382116j4122367j8451274k1312475
$$ 807570338 817644060 822118700 821017206 814728618 804346502 790224135 771772861 750460386
1105.5G50460386j8129527j0769606p559240n965769M343331J9255340K6449501K4335623
$$ 750460386 732330859 721561253 714002013 708036244 712379575 731634915 758084416 782420039
1121.8G82420039J8567980J2603759P498265M092156K626122K175450J496255R8348
$$ 782420039 800988019 813591778 821090043 825182199 827808321 829983771 831480026 831578374
1138.1H31578374j419783k173900k125860k310097l976464o392121o263316m028142
$$ 831578374 830158591 827984691 825858831 823548734 819572270 813180149 806916833 802888691
1154.4H02888691l854811n439341o476521p730007j0428906j4580190k0111799k5713563
$$ 802888691 799033880 793594539 787118018 779388011 768959105 754378915 734267116 708553553
1170.7G08553553k6539803j9233406j0584712r713113j4692545k1253288l0567944
$$ 708553553 682013750 662780344 652195632 642482519 627789974 606536686 575968742
1185E75968742l4080982j6973018N648076K814472j9683779l4887671l4629643k3894131
$$ 575968742 541887760 524914742 530562818 533377290 513693511 478805840 444176197 420282066
1201.3D20282066p379294R676665K2991092L2864630L8642525L6842287K9057860K0744503
$$ 420282066 412902772 422579437 445570529 478435159 517077684 553919971 582977831 603722334
1217.7F03722334J3755262Q047104M305422J314580l782272r949386j0047078n60105
$$ 603722334 617477596 625524700 629830122 631144702 627362430 617413044 607365966 606805861
1234F06805861J0451972J4276922J2987137J2690485J3865947J1607766L083945q220852
$$ 606805861 617257833 631534755 644521892 657212377 671078324 682686090 685770035 677549183
1250.3F77549183j5549838j5468538j4753878k4016917l9825320m1713595j5960575
$$ 677549183 661999345 646530807 631776929 607760012 567934692 526221097 510260522
1264.6E10260522K3920358M9035132M6082556K6760876P412732o275654j6047597k3681641
$$ 510260522 534180880 583216012 629298568 656059444 663472176 657196522 641148925 617467284
1280.9F17467284k9002905l1209409k9778898k3225069j3311654q845359j5012115
$$ 617467284 588464379 557254970 527476072 504251003 490939349 482093990 467081875
1295.2D67081875k5059760k9928058k8782547k6290119k5042861k2886336j8109352
$$ 467081875 442022115 412094057 383311510 357021391 331978530 309092194 290982842
1309.4B90982842j1927634m389077O338894J9168407K9699653L4997910L6778033L8147509
$$ 290982842 279055208 274666131 281005025 300173432 329873085 364870995 401649028 439796537
1325.8D39796537M0046930M1524739M0540754L6743760L0080200J8138289K210200
$$ 439796537 479843467 521368206 561908960 598652720 628732920 646871209 649081409
1340F49081409l922761P007421K0616293K4326145K1264792J7983615J5299559J1837065
$$ 649081409 645158648 652166069 672782362 697108507 718373299 736356914 751656473 763493538
1356.4G63493538P420838L066182r46522n851149j2875379j9517958j6167044m163504
$$ 763493538 770914376 773980558 773034036 767182887 754307508 734789550 718622506 714459002
1372.7G14459002l878713k2882342l7880123m2237579m1629196j7295420K8706193
$$ 714459002 710580289 687697947 649817824 607580245 565951049 548655629 577361822
1386.9E77361822L7859261k631605k3982286K502918M3076754O1588704N0622762K8709173
$$ 577361822 615221083 612589478 588607192 591110110 634186864 695775568 746398330 775107503
1403.3G75107503J6753912J1582434R193540Q189976O864190N130768L817797K952337
$$ 775107503 791861415 803443849 812637389 820827365 827691555 832822323 836640120 839592457
1419.6H39592457J733064J79708j923859m146516n236089l035665P54774K801657K055406
$$ 839592457 841325521 841505229 839581370 835434854 830198765 827163100 827917874 830719531 832774937
1437.9H32774937J52469j673162m171491p421970j0980308j2575865j3226807j2307346
$$ 832774937 832927406 831254244 827082753 819660783 808680475 796104610 782877803 770570457
1454.3G70570457N77152K1711707J9089997R254932O352186O599367P037103P287145
$$ 770570457 771147609 792859316 811949313 821204245 827556431 834155798 841192901 848480046
1470.6H48480046P088363N222380L440321K374231J316429J56343q23558j852095l520250
$$ 848480046 855568409 860790789 864231110 866605341 867921770 868078113 867254555 865402460 861882210
1488.9H61882210n811036r033441j7180443k1297753L01123K2413492K0767450J1292875
$$ 861882210 856071174 847037733 829857290 808559537 808860660 831274152 852041602 863334477
1505.2H63334477N504012K420485J237750Q27134N18262M90904P25269Q89600N03659
$$ 863334477 868838489 871258974 872496724 873323858 873842120 874333024 875058293 875947893 876451552
1523.6H76451552j03474l56436j70707j0610k05099m69566o36339q90136p54356n59688
$$ 876451552 876348078 875991642 875820935 875810325 875605226 875135660 874499321 873609185 872854829 872295141
1544H72295141q36015j115798j153589q93950o58751q36193k276838l928185l304422
$$ 872295141 871459126 870343328 869189739 868295789 867637038 866800845 864524007 860595822 857291400
1562.4H57291400l764927n117416o659448p226348l937543J238942N552650L162503
$$ 857291400 853526473 848409057 841749609 834523261 830585718 831824660 837377310 840539813
1578.7H40539813l863275j0440290j2007177p285535l759206n057215o574095n705058
$$ 840539813 836676538 826236248 814229071 806943536 803184330 798127115 791553020 785847962
1595G85847962m207969m631519o563485n997300j568854L198147N588293N307734L606260
$$ 785847962 781639993 777008474 770444989 764447689 762878835 766076982 771665275 776973009 780579269
1613.4G80579269K535939K909720L524840M358768N608678N565703M730582M114509
$$ 780579269 783115208 786024928 789549768 793908536 799517214 805082917 809813499 813928008
1629.7H13928008L318667K817750K650023K067447J747787J886785J987874K126456
$$ 813928008 817246675 820064425 822714448 824781895 826529682 828416467 830404341 832530797
1646H32530797K260804J833319J969219K470195J587808R53853R56297J249015J276672
$$ 832530797 834791601 836624920 838594139 841064334 842652142 843605995 844562292 845811307 847087979
1664.3H47087979P84397j17778r64940j286685j559318j941442k022326k228796l066481
$$ 847087979 847872376 847754598 846789658 845502973 843943655 842002213 839979887 837751091 834684610
1682.7H34684610m647910m992128n298972o501436o627798p473707p950664q093536
$$ 834684610 830036700 825044572 819745600 813244164 806616366 799142659 791191995 783098459
1699G83098459j0693431j1308431j2381852j5071034j7032564j9997835k3063243k5346756
$$ 783098459 772405028 761096597 748714745 733643711 716611147 696613312 673550069 648203313
1715.3F48203313k7717948k5615334k3143172k8540790l8122535m7626525n7081670
$$ 648203313 620485365 594870031 571726859 543186069 505063534 457437009 400355339
1729.6D00355339o3180953o9367081m9065322j1104494R908229K2496104L2884509
$$ 400355339 337174386 267807305 218741983 207637489 217545718 240041822 272926331
1743.9B72926331M1319429N0215513O1231852O1023384M4835150L1706274K3633778
$$ 272926331 314245760 364461273 425693125 486716509 531551659 563257933 586891711
1758.2E86891711J4112949L495813r119332k2249103l4258366m0072351l7287176j7802119
$$ 586891711 601004660 604500473 595381141 573132038 538873672 498801321 461514145 443712026
1774.5D43712026O675869J9269765J8471032P315695m580945q870810l076881J3490468
$$ 443712026 450387895 469657660 488128692 495444387 490863442 481992632 478915751 492406219
1790.8D92406219L7007839M7150671M4030249M0604532L5666883K8095663K1240711
$$ 492406219 529414058 576564729 620594978 661199510 696866393 724962056 746202767
1805.1G46202767J7061651J4133811J1496603Q802593O727993N685091M962564M150271
$$ 746202767 763264418 777398229 788894832 797697425 804425418 810110509 815073073 819223344
1821.4H19223344L476024L303647L230274L414690L312230K727270K397478K515793
$$ 819223344 822699368 826003015 829233289 832647979 835960209 838687479 841084957 843600750
1837.7H43600750K659619K539217K372265K011061J634955J480103J420379J154720
$$ 843600750 846260369 848799586 851171851 853182912 854817867 856297970 857718349 858873069
1854H58873069Q06690N57303N26130N38051M43161M11331N40019P17818O55890M88758
$$ 858873069 859679759 860237062 860763192 861301243 861744404 862155735 862695754 863413572 864069462 864558220
1874.4H64558220K00987o4612j52766L039L02971O16550R11355J079798J053631Q93474
$$ 864558220 864759207 864694595 864541829 864544868 864847839 865464389 866375744 867455542 868509173 869402647
1894.8H69402647P92801P10667N97417L81350J72675Q5116J55031L21627L96609L53575
$$ 869402647 870195448 870906115 871503532 871884882 872057557 872142673 872297704 872619331 873015940 873369515
1915.2H73369515K70247K60532J71781p987j29879L279L35693N10156L54707J23799
$$ 873369515 873639762 873900294 874072075 874064088 873934209 873937488 874273181 874783337 875138044 875261843
1935.6H75261843J07825J31428j07646p05480j117647n32210R09090J835525J563907
$$ 875261843 875369668 875501096 875393450 874687970 873570323 873038113 873947203 875782728 877346635
1954H77346635P57396J19686j49846k90274n19634o03258n5433P91014J135945R17792
$$ 877346635 878104031 878223717 878073871 877783597 877263963 876660705 876605272 877396286 878532231 879450023
1974.4H79450023N70893L51549K88605L67582M33624L51727J62721L2305R8765L12984
$$ 879450023 880020916 880372465 880661070 881028652 881462276 881814003 881976724 882009029 882107794 882420778
1994.8H82420778M23849L10898J22547Q6903K44141L69251K75671M0949j09792p9334
$$ 882420778 882844627 883155525 883278072 883364975 883609116 883978367 884254038 884294987 884185195 884105861
2015.2H84105861L3975M6789j00076k63214k57730j01745m77o914m3154k5571J05739
$$ 884105861 884139836 884186625 884086549 883823335 883565605 883463860 883463383 883456469 883413315 883387744 883493483
2037.6H83493483K58625K26318P16j46866p8082P2181J17064p16j64449j96397o7115
$$ 883493483 883752108 883978426 883979142 883832276 883754194 883826375 883943439 883942723 883778274 883581877 883514762
2060H83514762O5386M9353r5308j81019j08481K2412L7133j20282k77936k84970j44541
$$ 883514762 883580148 883629501 883534193 883353174 883244693 883267105 883304238 883183956 882906020 882621050 882476509
2082.5H82476509M1246J21236Q7499J32442L15130M59552L97265J66475m2319q4519
$$ 882476509 882517755 882638991 882726490 882858932 883174062 883633614 884030879 884197354 884155035 884070516
2102.9H84070516J3172O2824l6180k11597l04341k39015j19269j31488k82824l54707
$$ 884070516 884083688 884146512 884110332 883898735 883594394 883355379 883236110 883104622 882821798 882467091
2123.3H82467091j89543J34170L60549L53992K43544K39909L74258N06401M55737K42233
$$ 882467091 882277548 882411718 882772267 883126259 883369803 883609712 883983970 884490371 884946108 885188341
2143.7H85188341J03712J76847L46303L50177J72139L1948N9008K02477K89023J67787
$$ 885188341 885292053 885468900 885815203 886165380 886337519 886369467 886428475 886630952 886919975 887087762
2164.1H87087762p3313j82152o8307J25289J51813j7881j74046j39594q94K8133j04844
$$ 887087762 887014449 886832297 886763990 886889279 887041092 887023211 886849165 886709571 886708677 886736810 886631966
2186.5H86631966k29478j47462N7340J69873R7930o5446j40547l7671J02580O6042
$$ 886631966 886402488 886255026 886312366 886482239 886580169 886514723 886374176 886336505 886439085 886505127
2206.9H86505127j22130k60174k42234j27077p6651k18034l90828l50594j57952l3558
$$ 886505127 886382997 886122823 885880589 885753512 885676861 885458827 885067999 884717405 884559453 884525895
2227.3H84525895p3016k54511l86477k63750J2755J73032J02163l8088o2167L0636
$$ 884525895 884452879 884198368 883811891 883548141 883560896 883733928 883836091 883798003 883735836 883766472
2247.7H83766472Q5533L278j23620j89602j75297j18256j43647l13819m47333l76403
$$ 883766472 883852005 883855283 883731663 883542061 883366764 883248508 883104861 882791042 882343709 881967306
2268.1H81967306j57773K5868P3791J9788o55J21474K55942K01345m8757k42471j92047
$$ 881967306 881809533 881835401 881909192 881928980 881928325 882049799 882305741 882507086 882458329 882215858 882023811
2290.5H82023811j2755J01566M3571j21712k46704l06904l70264m16935m35769m65036
$$ 882023811 882011056 882112622 882156193 882034481 881787777 881480873 881110609 880693674 880257905 879792869
2310.9H79792869m08351k16008n6088l5345k7895J44541M14551N24997M18604K11060
$$ 879792869 879384518 879168510 879112422 879077077 879049182 879193723 879608274 880133271 880551875 880762935
2331.3H80762935K2530p8022j00315r5486n2870J67489N59092O99699L96371r7394
$$ 880762935 880785465 880707443 880607128 880511642 880458772 880626261 881185353 881885052 882281423 882184029
2351.7H82184029n61297p14243m83930k74598k40505j99080j14381N8234K83122L04341
$$ 882184029 881622732 880908489 880424559 880149961 879909456 879710376 879595995 879654229 879937351 880241692
2372.1H80241692J19746J0013J26839M11868N99384M93348K43545J45733K75552M67420
$$ 880241692 880361438 880371451 880498290 880910158 881509542 882002890 882246435 882392168 882667720 883135140
2392.5H83135140N12183L59475J83463J70648K63334K41935O2108j41084k16246j48833
$$ 883135140 883647323 884006798 884190261 884360909 884624243 884866178 884928286 884787202 884570956 884422123
2412.9H84422123r6440j82271l41117l77000k14338J6928J20401L5107j06930j36018
$$ 884422123 884325683 884143412 883802295 883425295 883210957 883227885 883348286 883383393 883276463 883140445
2433.3H83140445n1737n603q9884k00033j67012j4961J09136Q6189p5877k07842j76727
$$ 883140445 883088708 883083105 882993221 882793188 882626176 882611215 882720351 882806540 882730663 882522821 882346094
2455.7H82346094l0935J09136J33097M2141k7121n841L2544l159j07467k05755j98186
$$ 882346094 882315159 882424295 882557392 882599533 882572412 882566571 882599115 882595956 882488489 882282734 882084548
2478.1H82084548p7128J9312k5272j74821k74598k08259l6240L8743n7399j55032r0837
$$ 882084548 882007420 882026732 882001460 881826639 881552041 881343782 881307542 881346285 881288886 881133854 881043017
2500.6H81043017P7724J44542J7762j88053k67565j14203J01388J03950j08659k80380
$$ 881043017 881120741 881265283 881283045 881094992 880827427 880713224 880814612 880918562 880809903 880529523
2521H80529523j91450R1672K80916J97530k9087j10149J8596J38581N1737j73509k65777
$$ 880529523 880338073 880429745 880710661 880908191 880879104 880768955 880787551 880926132 880977869 880804360 880538583
2543.4H80538583p5817K14874K89202P0334j64390j25289J29640K83957J17600k03371
$$ 880538583 880462766 880677640 880966842 881037176 880872786 880747497 880877137 881161094 881278694 881075323
2563.8H81075323l01898q3625J58787J04546k13563l99232j79768J74940K36511%j98603
$$ 881075323 880773425 880689800 880848587 880953133 880739570 880340338 880160570 880335510 880572021 880572021 880373418
2586.2H80373418j21653J35541K65002P1824k51889k90871N5909L90172L28184k6167
$$ 880373418 880251765 880387306 880652308 880724132 880472243 880181372 880237281 880627453 880955637 880929470
2606.6H80929470k33769j7405L56436M06921Q1360k40385k13683P3731J95801p4506
$$ 880929470 880695701 880678296 881034732 881441653 881523013 881282628 881068945 881142676 881338477 881263971
2627H81263971m68135n27501j65403J89305J17600k66731m58777j77026K74003L91960
$$ 881263971 880795836 880268335 880102932 880292237 880409837 880143106 879684329 879507303 879781306 880173266
2647.4H80173266J20819j30177n7161K26081L80754J93477j36018k06649N7399L07381
$$ 880173266 880294085 880163908 880106747 880332828 880713582 880907059 880771041 880564392 880621791 880929172
2667.8H80929172K04742j54853l43919j43945J59621J70350r3936k70010j25467J95324
$$ 880929172 881133914 880979061 880635142 880491197 880650818 880821168 880727232 880457222 880331755 880527079
2688.2H80527079L27230Q3029k76804l24190r238K56180J38521k10165l96431k33412
$$ 880527079 880854309 880937338 880660534 880336344 880327106 880583286 880721807 880511642 880115211 879881799
2708.6H79881799O9678J74820O0k14696j59919J16825K30491K1100k89321m12822k44915
$$ 879881799 879951477 880126297 880126357 879911661 879751742 879868567 880099058 880120158 879830837 879418015 879173100
2731.1H79173100k2411m0412l02375n37812m21107l1054J46270o8367l68476m68731
$$ 879173100 879150689 879110277 878807902 878270090 877848983 877817929 877964199 877895832 877527356 877058625
2751.4H77058625k85983M0054K18094J68443J50024L19601M38153K95580q345k69234
$$ 877058625 876772642 876812696 877030790 877199233 877349257 877668858 878107011 878402591 878394246 878125012
2771.8H78125012l30865k01703r5725j30593j66297q1301N1141J14619L8922j70767
$$ 878125012 877794147 877592444 877496719 877366126 877199829 877118528 877169669 877284288 877323210 877152443
2792.2H77152443l25441k99454k16544k27749l42012m70698m95553l72409k60949k92838
$$ 877152443 876827002 876527548 876311004 876083255 875741243 875270545 874774992 874402583 874141634 873848796
2812.6H73848796l68238l59296k60115j37568p6234j50919l37541m76539m75347m65095
$$ 873848796 873480558 873121262 872861147 872723579 872647345 872496426 872158885 871682346 871206999 870741904
2833H70741904o22332q91984j248956j731634k257228l104031m858911p959008j3532519
$$ 870741904 870119572 869227588 867978632 866246998 863989770 860885739 856026828 848067820 834535301
2851.4H34535301k4665654m2246461n3853273l7136853P114351M3824672M8731030
$$ 834535301 809869647 767623186 713769913 676633060 683747411 727572083 776303113
2865.7G76303113L4064888J9437552J0714412O134569L707290K485037J735806J029313
$$ 776303113 810368001 829805553 840519965 846654534 850361824 852846861 854582667 855611980
2882H55611980M75287J16945k84374r26971j828731l095984n566418j0246635j5116155
$$ 855611980 856087267 856204212 855919838 854992867 853164136 850068152 844501734 834255099 819138944
2900.3H19138944j3886869m410445N494534R106815Q496225P277072O113052M824340
$$ 819138944 805252075 800841630 806336164 815442979 823939204 831216276 837329328 842153668
2916.6H42153668L501892K333105J466692Q94546O17027N65827L52562k15888j049161
$$ 842153668 845655560 847988665 849455357 850349903 850966930 851532757 851885319 851669431 850620270
2935H50620270k133489l503621n116999o667614p267415n783975k163470J779914L792226
$$ 850620270 848486781 844983160 839866161 833198547 825931132 820147157 817983687 819763601 823555827
2953.4H23555827M009426M281997M958570N086422M333497L189623K174973J492739
$$ 823555827 827565253 831847250 836805820 841892242 846225739 849415362 851590335 853083074
2969.7H53083074J196921J102149Q21650K61486m75526j409590k330661k699315k384782
$$ 853083074 854279995 855382144 856203794 856465280 855989754 854580164 852249503 849550188 847165406
2988H47165406k501667n117357j1275887j8065155j8307626q661210L644406J0684014
$$ 847165406 844663739 839546382 828270495 810205340 791897714 783236504 786880910 797564924
3004.4G97564924J2584030J1380971Q118212M621923K193034R23931K01643J14381
$$ 797564924 810148954 821529925 829648137 834270060 836463094 837387025 837588668 837703049
3020.7H37703049J608968L609359L675521J858592l03984k131820l226459k993583
$$ 837703049 839312017 842921376 846596897 848455489 848151505 846019685 842793226 839799643
3037H39799643j201690J396597L432274L789603K575994Q80003r28641l076076m461288
$$ 839799643 838597953 839994550 843426824 847216427 849792421 850672424 849743783 846667707 842206419
3055.3H42206419l138781J58429K186716J951873J167357R58323J230538J453936J313389
$$ 842206419 839067638 839226067 841412783 843364656 844532013 845490336 846720874 848174810 849488199
3073.7H49488199J377046K013087K397895K019107J319766O36518J54436q8871k79843
$$ 849488199 850865245 852878332 855276227 857295334 858615100 859251618 859406054 859317183 859037340
3092.1H59037340l57747j89126J04547K76386K36214J97589K94805K57015m2320j32560
$$ 859037340 858679593 858490467 858595014 858871400 859107614 859305203 859600008 859857023 859814703 859682143
3112.4H59682143J77860L84033K75969j2398l11076l22163q0884Q3089j1265k10345
$$ 859682143 859860003 860244036 860520005 860507607 860196531 859874368 859793484 859876573 859865308 859654963
3132.8H59654963k15232n5671o7532l34740n18322m72903l86119k46882p8619k11775
$$ 859654963 859439731 859384060 859316528 858981788 858463466 857990563 857604444 857357562 857278943 857067168
3153.2H57067168n62787o74606n47468m25339l70801l58581l61502l60191l41654l05593
$$ 857067168 856504381 855829775 855282307 854856968 854486167 854127586 853766084 853405893 853064239 852758646
3173.6H52758646k64645k89261m39405n90921o12855n79893o23525p36355q21829p96616
$$ 852758646 852494001 852204740 851765335 851174414 850561559 849981666 849358141 848621786 847799957 847003341
3194H47003341o41942n16594n49316o47485o82414o19531n67853o07610o68466o84380
$$ 847003341 846361399 845844805 845295489 844648004 843965590 843346059 842778206 842170596 841502130 840817750
3214.4H40817750o45042n63860n45382o54638p83026q21591p41422n86510n71727q91448
$$ 840817750 840172708 839608848 839063466 838408828 837625802 836804211 836062789 835476279 834904552 834013104
3234.8H34013104j158595j013100p82370o87480o06299n66482o26624n93901m35054
$$ 834013104 832854509 831841409 831059039 830371559 829765260 829198778 828572154 827978253 827543199
3253.2H27543199m32610o42479p35164n58734l83317l76701l47674k18511k93195n37992
$$ 827543199 827110589 826468110 825732946 825174212 824790895 824414194 824066520 823848009 823554814 823016822
3273.6H23016822o64949p22647p12871o41108o00159n80847n81444n69462o19829p82371
$$ 823016822 822351873 821629226 820916355 820275247 819675088 819094241 818512797 817943335 817323506 816541135
3294H16541135r31918j092375j176178r44376n84960o25014j134932j635969j761139
$$ 816541135 815609217 814516842 813340664 812396288 811811328 811186314 810051382 808415413 806654274
3312.3H06654274j543283j353621j365066j469970j555383j515627j529336j701772
$$ 806654274 805110991 803757370 802392304 800922334 799366951 797851324 796321988 794620216
3328.6G94620216j817286j869202j863658j729548j744330j997233k254068k460361
$$ 794620216 792802930 790933728 789070070 787340522 785596192 783598959 781344891 778884530
3345G78884530k417564k079189k055943k513409k781749k627253k399087k369583k448976
$$ 778884530 776466966 774387777 772331834 769818425 767036676 764409423 762010336 759640753 757191777
3363.3G57191777k410054k402306k608835k838731k814293k598166k456069k342046
$$ 757191777 754781723 752379417 749770582 746931851 744117558 741519392 739063323 736721277
3379.6G36721277k176463k081752k019465j833141j545012j464963j675606j727044
$$ 736721277 734544814 732463062 730443597 728610456 727065444 725600481 723924875 722197831
3395.9G22197831j424194j185715j366973j582742j398265j182079j202703j185179
$$ 722197831 720773637 719587922 718220949 716638207 715239942 714057863 712855160 711669981
3412.3G11669981j053810r52422r21250r31441q67904o69717m51923l61681m44889
$$ 711669981 710616171 709663749 708742499 707811058 706943154 706273437 705821514 705459833 705014944
3430.6G05014944m96507l40044j67787j54138k02298k49565k09689l576J82509K17498
$$ 705014944 704518437 704178393 704010606 703856468 703654170 703404605 703194916 703191340 703373849 703591347
3451G03591347K17557L43084N89490Q04365Q65280P49588O40571Q50320J377583J819193
$$ 703591347 703808904 704151988 704741478 705545843 706411123 707160711 707801282 708651602 710029185 711848378
3471.4G11848378J887679J673639J448393J409471J465917J281678R48608Q14021Q07881
$$ 711848378 713736057 715409696 716858089 718267560 719733477 721015155 721963763 722777784 723585665
3489.8G23585665P32601N63562M26590M55082O56843R27746J175165J305879J364409
$$ 723585665 724318266 724881828 725308418 725763500 726420343 727348089 728523254 729829133 731193542
3508.1G31193542J496614J742899J956522J964391J868367J852453J958549K012074
$$ 731193542 732690156 734433055 736389577 738353968 740222335 742074788 744033337 746045411
3524.4G46045411J898527J761079J688242J659274J687407J720965J643837J537263
$$ 746045411 747943938 749705017 751393259 753052533 754739940 756460905 758104742 759642005
3540.8G59642005J566410J786232J979828J875937J646042J586020J651704J717746
$$ 759642005 761208415 762994647 764974475 766850412 768496454 770082474 771734178 773451924
3557.1G73451924J758457J748323J744747J868487K099394K097845J928390J943051
$$ 773451924 775210381 776958704 778703451 780571938 782671332 784769177 786697567 788640618
3573.4G88640618K113998K263546K312899K224564K046049K031207K244294K238989
$$ 788640618 790754616 793018162 795331061 797555625 799601674 801632881 803877175 806116164
3589.7H06116164J978039J915694J999080K067327K104700K024531J871646J791656
$$ 806116164 808094203 810009897 812008977 814076304 816181004 818205535 820077181 821868837
3606H21868837J865506J923442J878619J814485J624524J537204J710594J688897J444996
$$ 821868837 823734343 825657785 827536404 829350889 830975413 832512617 834223211 835912108 837357104
3624.4H37357104J220167J245796J433194J343429J242042J145303J022696J005411
$$ 837357104 838577271 839823067 841256261 842599690 843841732 844987035 846009731 847015142
3640.7H47015142J002551R20951Q22246Q77619R00864O17564N45800Q22186Q48234
$$ 847015142 848017693 848938644 849760890 850638509 851539373 852156937 852702737 853524923 854373157
3659H54373157N60999M00186L96847K99931K22206K68698J05858J7404K64168M11033
$$ 854373157 854934156 855334342 855731189 856031120 856253326 856522024 856627882 856645286 856909454 857320487
3679.4H57320487M07458L76880L90589N42462N41747K95818K76744L52800K80797J38581
$$ 857320487 857727945 858104825 858495414 859037876 859579623 859875441 860152185 860504985 860785782 860924363
3699.8H60924363J13428J91808J55925J8359j15574j03056K6643L1650p987K5392N8412
$$ 860924363 861037791 861229599 861385524 861403883 861288309 861185253 861211896 861243546 861235559 861260951 861319363
3722.3H61319363J8895n007l994k8729K6226K14100M22537L67225J1324l17573k23935
$$ 861319363 861338258 861333251 861329257 861300528 861326754 861540854 861963391 862330616 862341940 862024367 861800432
3744.7H61800432Q4996R478n7936J20640J58608L5643j8120M7088O2823N067j08004
$$ 861800432 861885428 861894906 861836970 861957610 862116218 862151861 862133741 862180829 862243652 862248719 862140715
3767.1H62140715j98126j25825m768P1167J61767J54019p272o7353L9160J05441O1631
$$ 862140715 861942589 861816764 861811996 861883163 862044930 862198949 862191677 862124324 862163484 862268925 862330556
3789.6H62330556l2425j37270j48177j18434j83225j31130N96J8537R7275P7307j17957
$$ 862330556 862298131 862160861 862012684 861894250 861711025 861579895 861580491 861599028 861696303 861773610 861655653
3812H61655653k45154j34886K7895l1113q6129m5896l457K2590m649J1325O3121o0439
$$ 861655653 861410499 861275613 861303508 861272395 861186266 861140370 861136913 861159503 861154854 861166179 861229300 861168861
3836.5H61168861k49862j45674R9957J79768L0696j92940l76642m16935q1479J21236
$$ 861168861 860918999 860773325 860873282 861053050 861083746 860890806 860514164 860097229 860015750 860136986
3856.9H60136986L1531l5406q4400j20222j76549k15769p1466Q0109O8187m2200j40905
$$ 860136986 860168517 860133111 860048711 859928489 859751940 859536171 859464705 859544814 859613001 859570801 859429896
3879.3H59429896n3406P6234M0591o7293j19269k2710R8765M3929j03653k11060j93119
$$ 859429896 859376490 859452724 859493315 859426022 859306753 859284043 859382808 859426737 859323084 859112024 858918905
3901.8H58918905j7047J71841J30355m4882j40965j55092j53720j58489j50859j19448
$$ 858918905 858901858 859073699 859204054 859159172 859018207 858863115 858709395 858550906 858400047 858280599
3922.1H58280599o8247l7253j12832k21729j91450o8307l2127q2910j31190j04666
$$ 858280599 858212352 858175099 858062267 857840538 857649088 857580781 857548654 857465744 857334554 857229888
3942.5H57229888j430O4433N5491K1756k6941n9486k324J08778J27018N5134K8730
$$ 857229888 857228458 857292891 857348382 857370138 857343197 857283711 857281387 857390165 857517183 857572317 857601047
3965H57601047O5982Q0168L8326K5690M6908K7001j9967l6419l9577j26720k17974
$$ 857601047 857667029 857747197 857785523 857811213 857858121 857885122 857865155 857828736 857789159 857662439 857444465
3987.4H57444465j83582j17064j24216j67370j49309
$$ 857444465 857260883 857143819 857019603 856852233 856702924
3997.6H56702924
$$ 856702924
##END=$$ End of the data block
