##TITLE=Julia - 1 - Cl $$ Begin of the data block
##JCAMP-DX=5.00 $$ ACD/SpecManager v 10.08
##SPECTROMETER/DATA SYSTEM=Alpha
##DATE=22 Oct 2014 10:39:34
##DATA TYPE=INFRARED SPECTRUM
##DATA CLASS=XYDATA
##ORIGIN=
##OWNER=
##NPOINTS=1765
##FIRSTX=399.76428223
##LASTX=3997.64306641
##MAXX=3997.64306641
##MINX=399.76428223
##MAXY=0.89194417
##MINY=0.24632014
##XFACTOR=1.0000000000
##YFACTOR=1.000000000000000e-9
##FIRSTY=0.86452395
##DELTAX=2.03961372
##XUNITS=1/CM
##YUNITS=ARBITRARY UNITS
##XYDATA=(X++(Y..Y))
399.8H64523947n617082m43816L844201J534641l935814p161915j0069668j3942778
$$ 864523947 858906865 858463049 862307250 863841891 859906077 852744162 842674494 828731716
416.1H28731716j3503850l679871M247903J0004819J7487585J6374231P748246J499712
$$ 828731716 815227866 811547995 815795898 825800717 843288302 859662533 867410779 868910491
432.4H68910491Q12769K539933K622664J08063k637148l265559k050460n88536N36680
$$ 868910491 869723260 872263193 874885857 874993920 872356772 869091213 867040753 866452217 866988897
450.8H66988897M61519q31962j123607k9802r60290m936815q805156q255124j763224
$$ 866988897 867450416 866618454 865494847 865465045 864504755 859567940 850762784 842507660 840744436
469.1H40744436N989253Q998037O393969K707779J249254J891971K426385R24766j729190
$$ 840744436 846733689 855731726 862125695 864833474 866082728 867974699 870401084 871325850 869596660
487.5H69596660l366828l469586l322363l757298m106760o712437j3116121j0960221
$$ 869596660 866229832 862760246 859437883 855680585 851573825 844861388 831745267 820785046
503.8H20785046N818784J6941070J0927558J877487k5034K266169M050433L051937
$$ 820785046 826603830 843544900 854472458 856349945 856324911 858591080 862641513 865693450
520.1H65693450M76301p44045M47154J580834p12692p603228j5399337j3863564j73926
$$ 865693450 866169751 865425706 865872860 867453694 866741002 859137774 843738437 829874873 829700947
538.5H29700947J0420382N913675m904747n237520O501019J4759004J1840642M582762
$$ 829700947 840121329 846035004 841130257 835892737 842393756 857152760 868993402 873576164
554.8H73576164l06844j228631N59330K342284J945972k81572j933813j178921J020670
$$ 873576164 873269320 872040689 872600019 874942303 876888275 876606703 874672890 873493969 874514639
573.1H74514639K136648R07123j379907k236426q40664Q62241M35054k186715m243732
$$ 874514639 876651287 877558410 876178503 873942077 873101413 873963654 874398708 872211993 867968261
591.5H67968261l044665R18031M526377M606843J480579j173854j275658R0658J198590
$$ 867968261 864923596 865841627 870368004 874974847 876455426 875281572 874005914 874096572 875295162
609.8H75295162J137376k19166j355767p00713K45214o96540k070487j330316M37200
$$ 875295162 876432538 876213372 874857605 874156892 874402106 873705566 871635079 870304763 870741963
628.2H70741963R05514o24418m104138o721437n550980k901614q79049K640188P205009
$$ 870741963 871647477 871023059 866918921 860197484 854646504 851744890 850865841 853506029 860711038
646.6H60711038Q592546O434679M462838L954292L087043R75848j013637j167178J6391
$$ 860711038 869303584 875738263 880201101 884155393 887242436 888218284 887204647 886037469 886053860
664.9H86053860J094163R47594j298308l822029n033970l268718j369655k609492k665579
$$ 886053860 887148023 888095617 886797309 882975280 877941310 874672592 873302937 870693445 868027866
683.3H68027866J645386M626691L100217J61588j740217k003074N45561M736305O138742
$$ 868027866 869673252 874299943 877400160 877561748 875821531 873818457 874364018 879100323 885239065
701.6H85239065L473282n85139k725303j481057j97112j764238j608968J880050L139376
$$ 885239065 888712347 888127208 885401905 883920848 883723736 881959498 880350530 882230580 885369956
720H85369956K149582K056063J355052j821816o979525j2576700j4491856o644964
$$ 885369956 887519538 889575601 890930653 889108837 882129312 869552612 855060756 848415792
736.3H48415792P022023J2723804P944107K075970j27614K72692J372695J436948O64890
$$ 848415792 855437815 868161619 876105726 878181696 878054082 878326774 879699469 881136417 881801307
754.7H81801307J015723K464235K946794J584709l43323r72033J90437J699865J556456
$$ 881801307 882817030 885281265 888228059 889812768 889469445 888497412 888687849 890387714 891944170
773H91944170l28183k117098k224326j160860q22484l007829q184612j6077399k1789551
$$ 891944170 891615987 889498889 887274563 886113703 885291219 882283390 874098778 858021379 836231828
791.4H36231828j3823629L973425J3236046J2701749J0146857O443560J996398l612519
$$ 836231828 822408199 826381624 839617670 852319419 862466276 868909836 870906234 867293715
807.7H67293715r404957j2349963j1083007p268548r609878k6602685l3581794j814186
$$ 867293715 857888758 845538795 834455788 827187240 817577362 790974677 757392883 755578697
824G55578697K9761195J8862247n354344o583572Q166611J9194722K0007074J1465013
$$ 755578697 785339892 804202139 798847795 792264223 800430834 819625556 839632630 851097643
840.3H51097643j947164j3442397j2595713L712117J7439664J5304088K753020j0857284
$$ 851097643 849150479 835708082 823112369 826824486 844264150 859568238 862321258 851463974
856.6H51463974j0568798P002115J8680990J3824999N331099l19719n076826j1673510
$$ 851463974 840895176 847897291 866578281 880403280 885734379 885414660 880337834 868664324
873H68664324j7379522q421600J2700915K0219386J0925412K870262M11808j964509
$$ 868664324 851284802 842863202 855564117 875783503 886708915 889579177 889990985 888026476
889.3H88026476p772386j4704526j3755321j223326R887755P167876l420174q453489
$$ 888026476 880254090 865549564 851794243 850570917 860458672 867626548 864206374 855752885
905.6H55752885m064023M6730q94904J475513N375564J269460m275322k189696M79042
$$ 855752885 851688862 851735592 850840688 852316201 857691765 858961225 854685903 852496207 852975249
923.9H52975249m952728j5907169k4769902k4246097j1961519N210638J8646955K4722755
$$ 852975249 848022521 832115352 807345450 783099353 771137834 776348472 794995427 819718182
940.3H19718182K3462117J7699301J1530936O519258K284467n59509j573562k318204
$$ 819718182 843180299 860879600 872410536 878929794 881214261 880654752 879081190 876762986
956.6H76762986m193544m270017j415611j489579n903840r408176j0009826o915569
$$ 876762986 872569442 868299425 866883814 865394235 859490395 850082219 840072393 833156824
972.9H33156824N29945P620215J0108054R193599O656349L002048m08888k065480k247691
$$ 833156824 833686769 841306984 851415038 860608637 867264986 870267034 869858146 867792666 865544975
991.3H65544975k947033o142556j1900306j7643571j9980907j9109428j8250883j9024193
$$ 865544975 862597942 856455386 844555080 826911509 806930602 787821174 769570291 750546098
1007.6G50546098j5815735m928947J536429k78413K056599O000101q3446r047210n213500
$$ 750546098 734730363 729801416 731337845 731059432 733116031 739116132 739032686 729985476 724771976
1025.9G24771976P094324J2990117J4794469J9953549K2760451J9023955J3332307
$$ 724771976 731866300 744856417 759650886 779604435 802364886 821388841 834721148
1040.2H34721148Q565545M423022R04799j719773m259705p078708p219493k108872
$$ 834721148 843286693 847709715 848614514 846894741 842635036 835556328 828336835 826227963
1056.5H26227963L856838M566431M88460n410850j2365103j9289255k1162510j3471842
$$ 826227963 830084801 834651232 835139692 829728842 817363739 798074484 776911974 763440132
1072.8G63440132k466142J614571M01258j705885r150624k0905018k0990670j689672
$$ 763440132 760973990 762588561 762989819 761283934 752133310 731228292 710237622 708547950
1089.2G08547950J8189788K3278415K1875501K1019339J7019034Q945465J200437j365304
$$ 708547950 726737738 750016153 771891654 792910993 809930027 818875492 820075929 818710625
1105.5H18710625J967251N257130K753616m216612j0664940j2511253q877397j635611
$$ 818710625 820677876 825935006 828688622 824472010 813807070 801295817 792418420 790782809
1121.8G90782809P373631J4162958J4590144J1027753P905782N830645L796399J716196
$$ 790782809 798156440 812319398 826909542 837937295 845843077 851673722 855470121 857186317
1138.1H57186317L44634J93000P00772P24554j66595j413703k114355k037883j909256
$$ 857186317 857530951 857723951 858424723 859149277 858982682 857568979 855454624 853416741 851507485
1156.5H51507485k602637m098892n567372o483197p340312r339392j3650895k1005988
$$ 851507485 848904848 844805956 839238584 832755387 825415075 816075683 802424788 781418800
1172.8G81418800k9043853l0596197k1943748j2474775j3464391k2418976l1166315
$$ 781418800 752374947 721778750 699835002 687360227 673895836 651476860 620310545
1187.1F20310545l5817981l3069134j8577158L291786J5907645J1249304K346813K925575
$$ 620310545 584492564 551423430 532846272 536138058 552045703 563295007 565641820 568567395
1203.4E68567395J0234595J6233861K0791471K5556982K6828229K1173894J0591925
$$ 568567395 578801990 595035851 615827322 641384304 668212533 689386427 699978352
1217.7F99978352J118123j221537L066003P131219O998658M794180L836453N792678
$$ 699978352 701096475 699874938 702940941 710072160 717070818 721864998 725701451 731494129
1234G31494129R598732J1553466J0226369Q850217R359240Q819282M503966j820565
$$ 731494129 741092861 752646327 762872696 771722913 781082153 789901435 794405401 792584836
1250.3G92584836o755828r233952r925723r882987j1567533j6352117j8184542q122862
$$ 792584836 785829008 776595056 766669333 756786346 745218813 728866696 710682154 702559292
1266.6G02559292R620369J8055916R321272q157969k4927079l6517382l4568250j4436483
$$ 702559292 712179661 730235577 739556849 731398880 706471801 669954419 635386169 620949686
1282.9F20949686L531217m924357k8955877l9529621k6397407p987K3391366L1942546
$$ 620949686 624480903 619556546 590600669 551071048 524673641 524665654 548057020 579999566
1299.2E79999566K0929217n530417k8209924k9755831k1559656k1636277k5758445
$$ 579999566 600928783 595398366 567188442 537432611 515872955 494236678 468478233
1313.5D68478233k2369981j0136187O832242K4237394L6354989L8461149L2578528
$$ 468478233 446108252 435972065 442804307 467041701 503396690 541857839 574436367
1327.8E74436367K7087330K7551175L2066702L4149647L0310333K2751629J5123487
$$ 574436367 601523697 629074872 661141574 695291221 725601554 748353183 763476670
1342.1G63476670J0325670Q615613Q133769P007420M714429K221942L31641j338601
$$ 763476670 773802340 782417953 790551722 797559142 802273571 804495513 804827154 803488553
1358.4H03488553m297078r875357j6723812k0631790j6654909l197252Q884608O605447
$$ 803488553 799191475 789316118 772592306 751960516 735305607 732108355 740992963 747598410
1374.7G47598410j4235199l8015008l8454890j2792766J5032589L2023907K8978944
$$ 747598410 733363211 695348203 656893313 644100547 659133136 691157043 720135987
1389G20135987O393254j3331354j4972091N667806L0981600L0839741J0335088L753782
$$ 720135987 726529241 713197887 698225796 703893602 734875202 765714943 776050031 779803813
1405.3G79803813J2990951J5560269R038806L076613J34290p94113K680123P970869
$$ 779803813 792794764 808355033 817393839 820470452 820604742 819810629 822490752 830461621
1421.6H30461621R630502Q309841N413770K440036Q6367j021207l81052J440585K145648
$$ 830461621 840092123 848401964 853815734 856255770 856342137 855320930 854939878 856380463 858526111
1440H58526111J774013J185476Q02637J121997J474381O04868j289189l745735m061997
$$ 858526111 860300124 861485600 862288237 863410234 864884615 865489483 864200294 860454559 856392562
1458.3H56392562j547753j73867R75668K527595K628386J485169J000702J043976l57807
$$ 856392562 854844809 854670942 855646610 858174205 860802591 862287760 863288462 864332438 863974631
1476.7H63974631l919363j0856807k0838082k4179757j2795746K452254K827942k168715
$$ 863974631 860055268 849198461 828360379 804180622 791384876 793837130 796665072 794496357
1493G94496357N573631K1493792K4857223J4511109N875468J778424J765847L359556
$$ 794496357 800069988 821563780 846421003 860932112 866807580 868586004 870351851 873711407
1509.3H73711407L109575J988232P12275K32995O04510J323998J476884N03600k60592
$$ 873711407 876820982 878809214 879521489 879754484 880358994 881682992 883159876 883663476 883402884
1527.7H83402884l35515j74343K37226J27852j300215k655685j182318P98404R66132
$$ 883402884 883067369 882893026 883130252 883258104 881957889 879302204 878119886 878918290 879884422
1546H79884422j47462j559615k344072k727926l480315o141722p459402k498269K890706
$$ 879884422 879736960 878177345 875833273 873105347 869625032 863483310 856023908 853525639 856416345
1564.4H56416345N992412M011810q58188m797458q872807j4097035j6306937j9774556
$$ 856416345 862408757 866420567 865562379 860764921 851892114 837795079 821488142 801713586
1580.7H01713586k3092151j2451768R522677K1421969J5941441M860043k879739n900025
$$ 801713586 778621435 766169667 775692344 797114313 813055754 817915797 815036058 809136033
1597H09136033n609572m527628m268766n845070r785652j4337301j5053570j1252523
$$ 809136033 803526461 798998833 794730067 788884997 779099345 764762044 749708474 738455951
1613.4G38455951r898066j5168131j6758978o436527J6056836L3942997L3296109K3638725
$$ 738455951 728557885 713389754 696630776 690194249 706251085 740194082 773490191 797128916
1629.7G97128916J3050735P540822O647944N804718M065454L014624K380490K796173
$$ 797128916 810179651 817720473 824368417 830173135 834238589 837253213 839633703 842429876
1646H42429876L991664L097176K018214K855479K979338K319634K164662K337814K024531
$$ 842429876 846421540 849518716 851536930 854392409 857371747 859691381 861856043 864193857 866218388
1664.3H66218388Q43048q5473K76506P04110M46081q226p89821j810908k664089k498150
$$ 866218388 867061436 866975963 867252469 867956579 868402660 868394434 867604613 865793705 863129616 860631466
1684.7H60631466j581550k143860l539979m433811o273508p733106p855297p990717
$$ 860631466 859049916 856906056 853366077 848932266 842658758 834925652 827070355 819079638
1701.1H19079638o697000p304847r176075j0458231j2981832j6662777k0969271k6237786
$$ 819079638 812382638 805077791 795901716 785443485 772461653 755798876 734829605 708591819
1717.4G08591819k6455045k4964094l1376839m2293608n3133249o3371450o9717705
$$ 708591819 682136774 657172680 625795841 583502233 530368984 466997534 397279829
1731.7C97279829p9341203o1560720j0057763M1161463P9789937Q8468521P6102883
$$ 397279829 317938626 256377906 246320143 287481606 367271543 455740064 531842947
1745.9E31842947N5914819L7667394K2639096J2912810Q692920L927350n394459j6329050
$$ 531842947 587757766 625425160 648064256 660977066 669669986 673597336 668202877 651873827
1762.2F51873827k4384081l0458391l1253338j2457967K0231605L5397470K5924206
$$ 651873827 627489746 597031355 565778017 553320050 573551655 608949125 634873331
1776.5F34873331J3442039O440163Q212924J7981887K6244402K6053071K3991644K3140907
$$ 634873331 648315370 654755533 662968457 680950344 707194746 733247817 757239461 780380368
1792.8G80380368J8025637J1974513R260118Q835257Q895158P945299O321252M566431
$$ 780380368 798406005 810380518 819640636 828475893 837371051 845316350 851637602 856204033
1809.2H56204033L389180K862632K533436K192378J727402J290798J133680J510203
$$ 856204033 859593213 862455845 864989281 867181659 868909061 870199859 871333539 872843742
1825.5H72843742J620770J398265J132250P81834O65009R76384J043439M72665J7166
$$ 872843742 874464512 875862777 876995027 877776861 878441870 879418254 880461693 880934358 880951524
1843.8H80951524K28047O65546Q44538P66158L30090j05202k10821L039J18435k18332
$$ 880951524 881179571 881845117 882689655 883455813 883785903 883680701 883469880 883472919 883591354 883373022
1864.2H83373022p56264p42793K21849R92119J040995O89388L03864J12772J89364
$$ 883373022 882616758 881873965 882095814 883087933 884128928 884818316 885122180 885234952 885424316
1882.6H85424316L41415J98484k84612p26760p99477m08888M05967Q21412N03242J6093
$$ 885424316 885765731 885964215 885679603 884952843 884153366 883744478 884150445 884971857 885475099 885491192
1903H85491192p9989J44005L07858J32024l25203n48661k08497M43459O11722L10481
$$ 885491192 885411203 885555208 885863066 885995090 885669887 885121226 884912729 885356188 885967910 886278391
1923.4H86278391o2227l42191l14951K0981K93076L28780L04818K44736L24130O21975
$$ 886278391 886216164 885873973 885559022 885580003 885873079 886201859 886506677 886751413 887075543 887697518
1943.8H87697518P11977M09782L9459r9659R1850L89397M16399J33276j84834k47419
$$ 887697518 888409495 888819277 888858736 888759077 888850927 889240324 889656723 889789999 889605165 889357746
1964.2H89357746q107L23177L43740K3663k45869j85073J39654L75926K36988j36077
$$ 889357746 889349639 889672816 890016556 890040219 889794350 889609277 889748931 890124857 890361845 890225768
1984.6H90225768l22282j76609J34826L36945J61886k33233l52919p2658K32399K39908
$$ 890225768 889903486 889726877 889861703 890198648 890360534 890127301 889774382 889701724 889934123 890174031
2005H90174031j4007k62379k72453n4002J24514Q1837j16706k98977k79605l8564J71542
$$ 890174031 890160024 889897645 889625192 889571190 889695704 889777541 889660835 889361858 889082253 889043689 889215231
2027.4H89215231Q9109j91271l20495j36554J38819J98603n305k67207l22700j61230
$$ 889215231 889304340 889113069 888792574 888656020 888794839 888993442 888988137 888720930 888398230 888237000
2047.8H88237000n246n1021k69473l87847k12312J51813M16577L99768J81794M888
$$ 888237000 888231754 888180733 887911260 887523413 887311101 887462914 887879491 888279259 888461053 888465941
2068.2H88465941K1756J72376K45452J21355p8618j57416k7478J81139K37822O9201
$$ 888465941 888487697 888660073 888905525 889026880 888948262 888790846 888763368 888944507 889182329 889251530
2088.6H89251530j36316j64985m232J66774J82867O1929o4373n5790P5996J70767J03653
$$ 889251530 889115214 888950229 888945997 889112771 889295638 889357567 889293194 889237404 889313400 889484167 889587820
2111H89587820q2851k51114k48373p9036L4214l7313k02656k90572k15412j8239J42455
$$ 889587820 889504969 889253855 889005482 888926446 888960660 888923347 888720691 888430119 888214707 888196468 888338923
2133.5H88338923J47403L6180L338J58965L43383L54707J71482l6001q5175O9082K62558
$$ 888338923 888486326 888522506 888525844 888684809 889028192 889382899 889554381 889518380 889433205 889502287 889764845
2155.9H89764845K93434J44601j8716k3186J24335K38478J82689K3543j04546p1764
$$ 889764845 890058279 890202880 890184164 890160978 890285313 890523791 890706480 890730023 890625477 890553713
2176.3H90553713Q6009J68622M3094j76489k72453j80662R179J00315j1921j97530
$$ 890553713 890639722 890808344 890851438 890674949 890402496 890221834 890231013 890331328 890319407 890121877
2196.7H90121877k32100q5712P0036R3162l6598k03490k22802o3181Q3506M7028j57773
$$ 890121877 889889777 889804065 889874101 889967263 889930665 889727175 889504373 889441192 889524698 889571726 889413953
2219.1H89413953l09944k22147n483R8109J4663j49549k09867p4983J05381J32382
$$ 889413953 889104009 888881862 888876379 888974488 888989151 888839602 888629735 888554752 888660133 888792515
2239.5H88792515j1862j70111k23756j61648n7399l8982j42812k40088j78337N424
$$ 888792515 888780653 888610542 888386786 888225138 888167739 888128757 887985945 887745857 887567520 887572944
2259.9H87572944J37508J01388o3479k01881j85490o3181M17p7724k23279k79248j65462
$$ 887572944 887710452 887811840 887748361 887546480 887360990 887297809 887298226 887220502 886997223 886717975 886552513
2282.3H86552513L636P1644J9849r7514j50442p1883q345o2584j75476k93077l40640
$$ 886552513 886556149 886627793 886647642 886550128 886399686 886327803 886319458 886256874 886081398 885788321 885447681
2304.8H85447681k50161j30355j10328j62065k00093j94311j08719L5167R2744J9253
$$ 885447681 885197520 885067165 884956837 884794772 884594679 884400368 884291649 884326816 884419560 884438813
2325.2H84438813q9765q1241R5487K18928J47819L2306J1742J31845M29750O65366
$$ 884438813 884349048 884267807 884363294 884582222 884730041 884762347 884774089 884905934 885335684 886001050
2345.6H86001050M26591q1956m45784n20706l43442j17898j16825l13938l41176m4406
$$ 886001050 886427641 886345685 885899901 885379195 885035753 884917855 884801030 884487092 884145916 884101510
2366H84101510L09050M11809K57194P7366P2003K29180L80516L41356J56879L5703
$$ 884101510 884410560 884822369 885079563 885156929 885228932 885458112 885838628 886179984 886336863 886372566
2386.4H86372566Q0049K16365K72930J30534r8288j62661J0013K35975K66791O1035
$$ 886372566 886452615 886668980 886941910 887072444 886974156 886811495 886821508 887057483 887324274 887385309
2406.8H87385309j62423j57535N2214K08854J32919j16945k85506j97768M2021J75119
$$ 887385309 887222886 887065351 887117565 887326419 887459338 887342393 887056887 886859119 886901140 887076259
2427.2H87076259O4850j54615k37167r5486J02698J14084n8234k03610j82449j4007
$$ 887076259 887141109 886986494 886749327 886653841 886756539 886870623 886812389 886608779 886426330 886412323
2447.6H86412323J28507Q0288j19687k46942j59859K9087R8407k7895k12252k78354
$$ 886412323 886540830 886621118 886501431 886254489 886094630 886123717 886222124 886194229 885981977 885703623
2467.9H85703623j64747K5034R9659j6451j59383j57118l5166O5744J6331j63078k87294
$$ 885703623 885538876 885563910 885663569 885647118 885487735 885330617 885295451 885361195 885377526 885214448 884927154
2490.4H84927154k26975m1187J30296J31547k8789j34050o4910O6579R0062N186p0513
$$ 884927154 884700179 884658992 884789288 884920835 884892046 884757996 884693086 884759665 884849727 884854913 884784400
2512.8H84784400p6890n9J18732J30773K6882m0949k6703J0848K6346K265q1242j73807
$$ 884784400 884707510 884707451 884826183 884956956 884983838 884942889 884916186 884927034 884953380 884955645 884874403 884700596
2537.3H84700596j73866p6294J4126J5140n7936j24157r8109n305K9922o7771k27272
$$ 884700596 884526730 884450436 884464562 884479702 884421766 884297609 884199500 884194195 884224117 884156346 883929074
2559.7H83929074l08335k22385m947J83403J99795P5042k1815j430N6386N2392k5451
$$ 883929074 883620739 883398354 883393407 883576810 883776605 883851647 883829832 883828402 883884788 883937180 883911729
2582.2H83911729j15693j41680o8069L5763M7744o3539j66297j18136J8894Q8990O5506
$$ 883911729 883796036 883654356 883586287 883622050 883669794 883606255 883439958 883321822 883340716 883429706 883495212
2604.6H83495212K4259K5451Q8096J52885J45793O5983l2425o3062k9862j3709o4313
$$ 883495212 883519471 883544922 883633018 883785903 883931696 883997679 883965254 883902192 883872330 883858621 883794308
2627H83794308j46032j53184o9737J4067L6180M232o4016j30415j27434p4208k7418
$$ 883794308 883648276 883495092 883425355 883439422 883475602 883479834 883415818 883285403 883157969 883083761 883056343
2649.5H83056343N066j6570p4625q6367m4286J7464M5180K9623n066l7730k1696l636
$$ 883056343 883061409 883044839 882970214 882883847 882839561 882857025 882902205 882931828 882926762 882889032 882867336 882863700
2673.9H82863700l7253o0558n7757p8916p6652j9252R537l5882j01507j05024m0829
$$ 882863700 882826447 882765889 882708132 882629216 882552564 882533312 882542849 882506967 882405460 882300436 882259607
2696.4H82259607j78l3677q3625j02938o9737K9266O5207l8027j35363j20341j5617
$$ 882259607 882259429 882225752 882142127 882039189 881969452 881998718 882063925 882025898 881890535 881770194 881754577
2718.8H81754577Q2791P1228n0605j85430j97112n0784P9573M5418j13964k67088k97845
$$ 881754577 881837368 881908596 881857991 881672561 881475449 881424665 881504238 881549656 881435692 881168604 880870759
2741.2H80870759j98841j12235j83702l68833m53592k65598P9274K71857K02298N2691
$$ 880870759 880671918 880559683 880375981 880007148 879553556 879287958 879367232 879639089 879841387 879894078
2761.6H79894078J788L3975O6340K1457j06752k10702k05755j13845o9201j38819k06948
$$ 879894078 879895866 879929841 879996181 880017638 879910886 879700184 879494429 879380584 879311383 879172564 878965616
2784.1H78965616j55449j4305N8472M232r4771j81496k32041k04206j06752p8618j41680
$$ 878965616 878810167 878795862 878854334 878858566 878763795 878582299 878350258 878146052 878039300 877960682 877819002
2806.5H77819002j54078j33694j51276j78397k10166k41697k40504j76907j11341j38224
$$ 877819002 877664924 877531230 877379954 877201557 876991391 876749694 876509190 876332283 876220942 876082718
2826.9H76082718k16186k60114k59936k15650j64449l24428o92904r22144r26196r63509
$$ 876082718 875866532 875606418 875346482 875130832 874966383 874641955 873949051 873026907 872100711 871137202
2847.3H71137202j279235j866639k754569m494309p757068j1875391j2987971o654859
$$ 871137202 869857967 867991328 865236759 860742450 852985382 841109991 828122020 821467161
2863.6H21467161M231155J0898233J0521352P396459M682124K794564J713335J166284
$$ 821467161 825698316 836596549 847117901 854514360 859196484 861991048 863704383 864870667
2879.9H64870667Q21591O12080M30644J53243j69814l59058l68118m83453r17256j571715
$$ 864870667 865692258 866304338 866734982 866888225 866718411 866359353 865991235 865507782 864590526 863018811
2900.3H63018811k471626l528833l848076k578914m31061J118600J723349J923681
$$ 863018811 860547185 857018352 853170276 850591362 850160301 851278901 853002250 854925931
2916.6H54925931J918315J638592J227319P93576M52697L01719R6083k69354o71148
$$ 854925931 856844246 858482838 859710157 860503733 860956430 861258149 861354232 861084878 860413730
2935H60413730j140654j680732k053320k076328j857102j416743o49273K55644Q54612
$$ 860413730 859273076 857592344 855539024 853462696 851605594 850188851 849539578 849795222 850649834
2953.4H50649834J150429J458168J641870J522064J302361J259983J320362J185655
$$ 850649834 851800263 853258431 854900301 856422365 857724726 858984709 860305071 861490726
2969.7H61490726Q10981L44694o9857l70681r37700k546072n269468o700099l156244
$$ 861490726 862301707 862646401 862576544 862205863 861268163 858722091 853452623 846752524 843596280
2988H43596280L224432N260646J981676j581371k906978k819121k640784k873301k957702
$$ 843596280 846820712 852081358 854063034 852481663 849574685 846755564 844114780 841241479 838283777
3006.4H38283777j518130K084970N698383O599784N095363L074407J543343P66278
$$ 838283777 836765647 838850617 844549000 851148784 856244147 859318554 860861897 861628175
3022.7H61628175N88655O53744P79688P94113O43134L93808J88291K58863L19660L2365
$$ 861628175 862216830 862870574 863650262 864444375 865087509 865481317 865669608 865928471 866248131 866280496
3043.1H66280496l46780m69923l78191m64261p54416q37624o14703j59800M05074P21335
$$ 866280496 865933716 865463793 865085602 864621341 863866925 863029301 862414598 862254798 862659872 863381207
3063.5H63381207O57916L40283j6332j34349j5497J34349Q6129k50519m81188l55243
$$ 863381207 864039123 864379406 864363074 864228725 864213228 864347577 864433706 864183187 863701999 863346756
3083.9H63346756k47419k71440l17216l84688k73526k0325K9981l43800r46164j265466
$$ 863346756 863099337 862827897 862510681 862125993 861852467 861832142 861862123 861518323 860572159 859306693
3104.3H59306693j094580o26027m0353O90401J299143J265406P29323J35124k84732
$$ 859306693 858212113 857586086 857545733 858236134 859535277 860800683 861530006 861665130 861380398
3122.6H61380398l33488o2227K25484K55585R7752L7253J02102M3512k16961l59714
$$ 861380398 861046910 860984683 861210167 861465752 861563504 861600757 861702859 861746371 861529410 861169696
3143H61169696k94387k57731j77920K2412j3054l00467m31478m10020m08769l77774
$$ 861169696 860875309 860617578 860439658 860462070 860449016 860148549 859717071 859307051 858898282 858520508
3163.4H58520508k78890k05338k41042l71336n14687n27858l92020k88010l39865m69387
$$ 858520508 858241618 858036280 857795238 857423902 856909215 856381357 855989337 855701327 855361462 854892075
3183.8H54892075n26607m80652m50611m76777n24581n70655n29826m00841k92539k71201
$$ 854892075 854365468 853884816 853434205 852957428 852432847 851862192 851332366 850931525 850638986 850367785
3204.2H50367785l64066m89115m88997m08232l61204l74973m81188o16908o22809m97163
$$ 850367785 850003719 849514604 849025607 848617375 848256171 847881198 847400010 846783102 846160293 845663130
3224.6H45663130m14371m27723m63903n34594o64354o89268n70774n50568o40988o56128
$$ 845663130 845248759 844821036 844357133 843822539 843158185 842468917 841898143 841347575 840706587 840050459
3245H40050459n88834n56052n82278n95927n92530o09934n38647l90828l71397m32491
$$ 840050459 839461625 838905573 838323295 837727368 837134838 836524904 835986257 835595429 835224032 834791541
3265.4H34791541l56734j66654j75417l75449n38230o60718o64830n37515m27127m11272
$$ 834791541 834434807 834268153 834092736 833717287 833179057 832518339 831853509 831315994 830888867 830477595
3285.8H30477595m64856m79579m74215n31018o48617q22127r06289p41482m91678n33760
$$ 830477595 830012739 829533160 829058945 828527927 827879310 827057183 826150894 825409412 824917734 824383974
3306.2H24383974r38594j363695j536012j434683j248002j099825j015246j029849
$$ 824383974 823445380 822081685 820545673 819110990 817862988 816763163 815747917 814718068
3322.5H14718068j143635j397371j599848j562059j478255j414776j325965j468777
$$ 814718068 813574433 812177062 810577214 809015155 807536900 806122124 804796159 803327382
3338.8H03327382j756013j805723j782536j786292j670360j762092k107501k189637
$$ 803327382 801571369 799765646 797983110 796196818 794526458 792764366 790656865 788467228
3355.2G88467228k003729j927257k058386k089978j808345j624644j950621k493382
$$ 788467228 786463499 784536242 782477856 780387878 778579533 776954889 775004268 772510886
3371.5G72510886k569377k142668j805723j747310j813173j820147j611114j238286
$$ 772510886 769941509 767798841 765993118 764245808 762432635 760612488 759001374 757763088
3387.8G57763088q92937r19342j336694j500666j110614p71284j017749j390159j281858
$$ 757763088 756870151 755950809 754614115 753113449 752002835 751231551 750213802 748823643 747541785
3406.1G47541785r84668q71480q27372q08299q34763q06987p27713n96702l81589j77801
$$ 747541785 746557117 745685637 744858265 744049966 743215203 742408216 741680503 741083801 740702212 740524411
3426.5G40524411j24275k55049k87592p7665M3035n9128j29164q5711P15J34111K41995
$$ 740524411 740400136 740145087 739857495 739779830 739822865 739763737 739634573 739548862 739549577 739683688 739925683
3449G39925683K73585K55406K36392L03268N02169P51377Q71598Q14855Q11994R78053
$$ 739925683 740199268 740454674 740691066 740994334 741496503 742247880 743119478 743934333 744746327 745724380
3469.4G45724380J101732J026631P54714M67837M47690P25925R45628R46343Q86500
$$ 745724380 746826112 747852743 748607457 749075294 749522984 750248909 751194537 752140880 753027380
3487.7G53027380P77244O94573P66516R59217J100540J124263J171768J285791J361668
$$ 753027380 753804624 754499197 755265713 756224930 757325470 758449733 759621501 760907292 762268960
3506.1G62268960J410604J468897J449883J309573J198054J247525J323581J322388
$$ 762268960 763679564 765148461 766598344 767907917 769105971 770353496 771677077 772999465
3522.4G72999465J215578J126229J285732J534760J561225J421511J321554J293123
$$ 772999465 774215043 775341272 776627004 778161764 779722989 781144500 782466054 783759177
3538.7G83759177J274526J246273J250923J255989J167059J100600J248717J434863
$$ 783759177 785033703 786279976 787530899 788786888 789953947 791054547 792303264 793738127
3555G93738127J423478J312017J168430R73642J001716J575708J977325J636445J287997
$$ 793738127 795161605 796473622 797642052 798615694 799617410 801193118 803170443 804806888 806094885
3573.4H06094885J339853J530528J649499J606345J306176J054287J403689J944483
$$ 806094885 807434738 808965266 810614765 812221110 813527286 814581573 815985262 817929745
3589.7H17929745J810074J479804J479328J639843J737416J766562J559317J133800
$$ 817929745 819739819 821219623 822698951 824338794 826076210 827842772 829402089 830535889
3606H30535889J049041J309097J460970J512766J296699J145124J549780J648605J026929
$$ 830535889 831584930 832894027 834354997 835867763 837164462 838309586 839859366 841507971 842534900
3624.4H42534900L69906N71847J498520J586795J283408J128852R50813P35879M37021
$$ 842534900 842904806 843476653 844975173 846561968 847845376 848974228 849925041 850660920 851097941
3642.7H51097941r000l25858L56316J567364J348734O53386P69436J025081O53326
$$ 851097941 851088941 850763083 851119399 852686763 854035497 854688883 855458319 856483400 857136726
3661.1H57136726J51873j95503n27680m95911K802l2425l2068P28906R80079P33018
$$ 857136726 857288599 857093096 856565416 856069505 856072307 856039882 856007814 856736720 857716799 858449817
3681.5H58449817M48882J07706q0705J14799N65707P99954N87225J36733j51455J4484
$$ 858449817 858898699 859006405 858925700 859040499 859606206 860406160 860993385 861130118 860978663 860993147
3701.9H60993147L45886J58548l69251n53608L696N94258M36604j2755k51234k21014
$$ 860993147 861339033 861497581 861128330 860574722 860578418 861172676 861609280 861596525 861345291 861124277
3722.3H61124277q4281R7513R9779k93077p11262m66943M44711O95646r4116p84219
$$ 861124277 861039996 861137509 861237288 860944211 860232949 859766006 860210717 860906363 860812247 860028028
3742.7H60028028m48942J06454j45078N6685Q71121P95782J78814k2113J89483J40786
$$ 860028028 859579086 859685540 859540462 859597147 860468268 861264050 861442864 861420751 861610234 861751020
3763.1H61751020r0420j57118k5094K48790K86043M9650j02937l8266N0902l0219m7147
$$ 861751020 861660600 861503482 861478388 861727178 862013221 862062871 861959934 861921668 861972570 861942351 861895204
3785.5H61895204J06990J71840j5199l69728n51223m82440m43638j07527L00229J84953
$$ 861895204 862002194 862174034 862158835 861789107 861237884 860755444 860311806 860204279 860504508 860689461
3805.9H60689461K41697L36111p2599n33163m85599k46168k11715K36511N51760K79844
$$ 860689461 860931158 861267269 861194670 860661507 860175908 859929740 859718025 859954536 860506296 860786140
3826.3H60786140l1889k85029l42786k18213k61724k27272J67310M65691M92513J62661
$$ 860786140 860754251 860469222 860126436 859908223 859646499 859419227 859586537 860052228 860544741 860707402
3846.7H60707402n28216j239002j145244L90411J061618M58002j61469l77476j98901
$$ 860707402 860179186 858940184 857794940 858185351 859246969 859704971 859543502 859166026 858967125
3865H58967125j72674k55108N3048L16381K50638n1379l83735k16544R7156J72973
$$ 858967125 858794451 858539343 858592391 858908772 859159410 859108031 858724296 858507752 858604908 858777881
3885.4H58777881J64807n3168m6432K18153Q35n09024o64175l26395K01524O09159
$$ 858777881 858942688 858889520 858843088 859061241 859062076 858553052 857888877 857562482 857764006 858373165
3905.8H58373165N83768K34187q9944l06129l38555j39534J5378j4842l7193l159j14977
$$ 858373165 858956933 859191120 859101176 858795047 858456492 858316958 858332336 858317494 858280301 858277142 858162165
3928.3H58162165k08080J6987K36213J07348j30474k30551j47343k0444l0339j2696
$$ 858162165 857954085 857971072 858207285 858314633 858184159 857953608 857806265 857785821 857755482 857742786
3948.7H57742786J22786J75714J14561L3915l6478l8147M3630P6294K3246k6166k7955
$$ 857742786 857865572 858041286 858155847 858189762 858153284 858115137 858158767 858235061 858258307 858232141 858204186
3971.1H58204186l1292l0697N782J4722O5267P8202j03832k23815j58489r4950q1957
$$ 858204186 858172894 858142197 858147979 858162701 858227968 858306170 858202338 857978523 857820034 857725084 857643127
3993.5H57643127j01745j33872
$$ 857643127 857541382 857407510
3997.6H57407510
$$ 857407510
##END=$$ End of the data block
