##TITLE=Juan - Speek $$ Begin of the data block
##JCAMP-DX=5.00 $$ ACD/SpecManager v 10.08
##SPECTROMETER/DATA SYSTEM=Alpha
##DATE=25 Aug 2016 08:17:10
##DATA TYPE=INFRARED SPECTRUM
##DATA CLASS=XYDATA
##ORIGIN=
##OWNER=
##NPOINTS=1765
##FIRSTX=399.77209473
##LASTX=3997.72216797
##MAXX=3997.72216797
##MINX=399.77209473
##MAXY=1.00686598
##MINY=0.67692333
##XFACTOR=1.0000000000
##YFACTOR=0.000000010000000
##FIRSTY=1.00000000
##DELTAX=2.03965425
##XUNITS=1/CM
##YUNITS=ARBITRARY UNITS
##XYDATA=(X++(Y..Y))
399.8 100000000 99865675 100000000 99816120 99212605 99077469 99484414 99582785 99273652 99266684 99557638
420.2 99557638 99398208 99100107 99281722 99540675 99265295 98875147 98943251 99023569 98655170 98334020
440.6 98334020 98408246 98380005 98007357 97828430 97971112 97834450 97300112 96957338 96937877 96680975
461 96680975 96195823 96025950 96090662 95854872 95419002 95296580 95337248 95056999 94663239 94590169 94599509
483.4 94599509 94328713 94080806 94154733 94190109 93913925 93722898 93859291 93926013 93742251 93738043 94077790
505.8 94077790 94342095 94336104 94383693 94549417 94442099 94037616 93812054 93847990 93757713 93537891 93589205
528.3 93589205 93888861 94110435 94382060 95075047 96017128 96700740 97067177 97355050 97443020 97071332
548.7 97071332 96487069 96123713 95916057 95603502 95303577 95244598 95295894 95225120 95152158 95272946 95408523
571.1 95408523 95327491 95194310 95218062 95231378 95068538 94909847 94887537 94803268 94532609 94273293 94111538
593.5 94111538 93827724 93357462 92932200 92648935 92344761 91978824 91719079 91586936 91381454 91054136
613.9 91054136 90721476 90341347 89821553 89338189 89216471 89508879 89997935 90596294 91361725 92182988
634.3 92182988 92889977 93545145 94277018 94965398 95432186 95780838 96218330 96734554 97217667 97700727
654.7 97700727 98190248 98464382 98343998 97966516 97471303 96609378 95539117 95015633 94630879 94031310
675.1 94031310 93366104 92931265 92853987 92980164 93207002 93654263 94365543 95142585 95824862 96400923
695.5 96400923 96722448 96452111 95509225 94283009 93259889 92694414 92688596 93321246 94495797 95830870
715.9 95830870 96941972 97749096 98305011 98587018 98669916 98744190 98834658 98805135 98663139 98577094 98577970
738.4 98577970 98523909 98386586 98262995 98087138 97659993 96974152 96212834 95403719 94392395 93170792
758.8 93170792 91911459 90710819 89643842 89030379 89246893 90238893 91518879 92690742 93735391
777.1 93735391 94712526 95580941 96451104 97535616 98721039 99593401 99961710 100000000 99859655 99463469
797.5 99463469 98871964 98287940 97745192 97093779 96338153 95649058 95015746 94255173 93376040 92579341
817.9 92579341 91896909 91167152 90374309 89666700 89022458 88262391 87414020 86714119 86248308 85904747
838.3 85904747 85673970 85663098 85812157 85890949 85828412 85770744 85746944 85611749 85373157 85226011 85204828
860.7 85204828 85171050 85187405 85543507 86398685 87723053 89566714 91970223 94537055 96593583
879.1 96593583 97930151 98888201 99647689 100000000 99897707 99564224 99114406 98476720 97765839 97234696
899.5 97234696 96872813 96467769 95987546 95510179 94863367 93744779 92167318 90428257 88675201
917.8 88675201 86834043 84919673 83133852 81740314 81065762 81566411 83686471 87430161 91957432
936.2 91957432 95875883 98191071 98782480 98127615 96972865 95973217 95346451 95034158 95099115 95624888
956.6 95624888 96349972 96839571 96988934 97006989 97003126 96954316 96951783 97108090 97305846 97344697 97254854
979 97254854 97180986 97077847 96815968 96456933 96141833 95816368 95339191 94749534 94146454 93419677
999.4 93419677 92357504 90896374 89107704 87213314 85713679 85117280 85397458 85844845 85544127
1017.8 85544127 84159422 82260877 80760157 80213094 80745101 82214797 84267014 86492646 88610291
1036.1 88610291 90404856 91620892 92133349 92128092 91893393 91539347 91074204 90587437 90159625 89717239
1056.5 89717239 89157814 88512290 87843472 87084579 86127490 84977341 83663034 82147276 80504501
1074.9 80504501 79045302 78113484 77853614 78264362 79322165 80872637 82518035 83816475 84562325
1093.3 84562325 84787619 84609044 84187740 83719814 83315659 82938772 82539117 82162386 81874901 81674415
1113.7 81674415 81524801 81388062 81187469 80845702 80403191 80000919 79715627 79500616 79282236 79025769
1134.1 79025769 78685653 78169388 77440679 76607984 75836110 75231147 74823701 74553549 74250132 73756373
1154.4 73756373 73152691 72761494 72868699 73552150 74723172 76053584 76965731 77085555 76599753
1172.8 76599753 75929070 75277448 74642169 74048120 73606604 73389530 73382992 73573500 73940533 74346262
1193.2 74346262 74583906 74583489 74447012 74270302 74060810 73815030 73546535 73231268 72828907 72380072
1213.6 72380072 71985257 71680254 71435511 71264619 71218801 71286821 71407408 71572471 71824002 72154444
1234 72154444 72506976 72875917 73288071 73678267 73917520 73972303 73931265 73870754 73809296 73793775 73895025
1256.4 73895025 74109328 74382693 74730271 75219291 75831914 76438200 76914757 77196813 77241540 77062786
1276.8 77062786 76799333 76637352 76653397 76823318 77162755 77731121 78480166 79233736 79822010 80123657
1297.2 80123657 80017459 79486746 78760648 78148937 77753502 77492636 77343661 77391952 77667063 78114778
1317.6 78114778 78740066 79599911 80682993 81920451 83303428 84879643 86600971 88305300 89898157
1336 89898157 91451246 93007183 94412637 95580810 96609497 97542471 98305625 98871297 99338675
1354.3 99338675 99742407 99970865 99999285 99989456 100000000 99878424 99586660 99246329 98898834 98494732
1374.7 98494732 98043889 97570521 97001368 96251720 95403743 94539744 93533432 92212826 90511143
1393.1 90511143 88641393 87023574 85776466 84912825 84404677 84071487 83701682 83210623 82707334
1411.4 82707334 82312745 82086575 82345957 83644783 85771531 88161510 90371847 91909826 92727906
1429.8 92727906 92909986 92595690 92020673 91385794 90689379 89806587 88787693 87683290 86428571
1448.2 86428571 85064036 83646661 82115555 80178100 78027540 76374221 74973470 73548335
1464.5 73548335 72367662 71667647 71365434 71511006 72168833 73226333 74473912 75529295 75874060
1482.8 75874060 75216937 73790741 72236085 71339881 71363366 72098434 73212659 74149293 74749595
1501.2 74749595 75237495 76062000 77961510 80509496 83142918 85737449 88037473 90001476 91589230
1519.6 91589230 92988282 94086140 94817388 95371825 95662886 95681846 95594227 95402455 94973981 94373262
1539.9 94373262 93863428 93408704 92813748 92009592 91021568 89950007 88780791 87490678 86002791
1558.3 86002791 84567672 83460063 82234913 80827546 79393214 78020859 76908064 75990129 75192237
1576.7 75192237 74582565 73995757 73303026 72553253 71809959 71096468 70428658 69836318 69357526 69050324
1597.1 69050324 68989277 69246095 69804960 70525205 71301198 72178578 73201585 74282235 75484049
1615.4 75484049 76755226 77523488 77727795 77605438 77256876 76735771 76078397 75332016 74528402 73731744
1635.8 73731744 73115236 72626948 72150195 71697044 71340251 71132898 70999485 71047956 71490651 71975052
1656.2 71975052 72411567 72975814 73802584 74817294 75825137 77073830 78680223 80220008 81843370
1674.6 81843370 83621675 85091090 86227971 87404948 89020348 90429103 91386068 92223424 92864066
1692.9 92864066 93446982 94046956 94657087 95475304 96116871 96563333 97076988 97518373 97804803 97961020
1713.3 97961020 98105526 98477364 98950762 99224836 99383402 99526757 99601227 99585766 99513972 99622381
1733.7 99622381 99877691 99944800 99951440 100000036 100000000 99973810 99920017 99955767 100091708 100134802 100085878 100025785
1758.2 100025785 99948549 99912161 99871045 99735236 99540979 99357396 99293786 99314892 99255085 99136806 99040121
1780.6 99040121 98975867 98937476 98899370 98797035 98706049 98787481 98930430 98991114 99035966 99152029 99310684
1803.1 99310684 99430990 99497235 99558461 99665999 99787933 99874443 99941796 100000000 100034738 100027573 100035703
1825.5 100035703 100045931 100091696 100195396 100250852 100254357 100257432 100209308 100093603 100052416 100118613 100129676
1847.9 100129676 100073457 100000000 99916291 99817640 99719518 99640590 99560875 99429882 99246287 99113935 99063200
1870.4 99063200 98975617 98821586 98662305 98519117 98379332 98242652 98118871 97994781 97874790 97789568
1890.8 97789568 97719657 97655249 97596681 97526914 97452819 97374123 97267824 97139972 97036159 96965766 96880484
1913.2 96880484 96767765 96705931 96714872 96724224 96751559 96828467 96924776 97021216 97121912 97242993 97378033
1935.6 97378033 97483236 97545367 97632879 97779077 97912991 98004395 98084652 98156869 98196542 98206836 98219609
1958.1 98219609 98234940 98219609 98171401 98139828 98149341 98155963 98140949 98139489 98157382 98161370 98140621 98118842
1982.6 98118842 98099667 98053128 97971851 97900063 97862321 97805774 97699636 97581363 97468472 97338396 97188425
2005 97188425 97045743 96916461 96768880 96582574 96381968 96199077 96023577 95840806 95676291 95588279
2025.4 95588279 95620567 95728117 95855469 96005309 96163356 96310800 96468014 96649808 96826106 96974158
2045.8 96974158 97110558 97243047 97347277 97409767 97449201 97471607 97457427 97401297 97332436 97272342 97209024
2068.2 97209024 97151268 97148728 97223216 97342908 97483504 97649926 97831267 97993159 98121631 98236775
2088.6 98236775 98352134 98444688 98496538 98530811 98567390 98593003 98606879 98637819 98699415 98774141 98847246
2111.1 98847246 98930234 99032599 99135172 99222249 99309826 99409103 99500191 99570525 99639297 99719763 99795312
2133.5 99795312 99850839 99897867 99949062 99992436 100017142 100033915 100051033 100056100 100042033 100025165 100014591 99999756
2158 99999756 99977559 99960947 99952990 99938893 99916476 99906015 99914020 99922872 99924946 99934548 99959093 99984801 100004649
2184.5 100004649 100031483 100072289 100110817 100128937 100133145 100138462 100134361 100109386 100082541 100067210 100050211 100022578
2209 100022578 99996918 99983799 99973524 99958754 99950552 99953145 99955243 99951667 99951160 99959022 99967551 99973720 99984300 100000000
2237.5 100000000 100011718 100011885 100005901 99998587 99982882 99953479 99917555 99880087 99836677 99785888 99736875 99696797
2262 99696797 99661022 99628472 99609584 99605089 99603146 99600649 99605024 99619526 99633259 99635601 99628901 99619085 99608743
2288.5 99608743 99599713 99595761 99592239 99575895 99544394 99505442 99456465 99379885 99266642 99136519 99012363 98900372
2313 98900372 98793846 98675841 98548651 98448825 98400146 98355979 98261589 98150879 98082912 98037207 97975165
2335.4 97975165 97915417 97890931 97939330 98143882 98471314 98566735 98272282 97828209 97481436 97251409
2355.8 97251409 97087598 96984607 96946436 96977842 97068089 97199118 97348094 97497571 97642738 97772205
2376.2 97772205 97871900 97937059 97963947 97955447 97925365 97896528 97885430 97886401 97886086 97888243 97895932 97889209 97851878
2402.7 97851878 97789842 97708857 97599685 97457212 97293258 97121805 96945864 96769869 96612108 96492666
2423.1 96492666 96415019 96372908 96372980 96423268 96511710 96615916 96728921 96854103 96981150 97099692 97218299
2445.5 97218299 97343940 97467750 97582495 97695857 97817737 97938669 98045266 98147678 98258477 98367250
2465.9 98367250 98465645 98562133 98660243 98755538 98848414 98945189 99052435 99169594 99286896 99398088 99500799
2488.4 99500799 99580926 99628180 99655682 99671215 99662209 99624246 99567592 99502099 99430150 99354768 99296474 99277735
2512.8 99277735 99296814 99336708 99387187 99449039 99514240 99566740 99609923 99657786 99710971 99760228 99799788 99829900
2537.3 99829900 99848258 99849981 99836504 99811590 99771053 99703205 99609923 99506825 99394369 99268454 99144471
2559.8 99144471 99040502 98954511 98874915 98804891 98753220 98709434 98659050 98608279 98568380 98537081 98503888
2582.2 98503888 98467720 98435825 98403811 98358977 98305547 98259389 98222244 98189622 98165774 98162955 98185217 98221350
2606.7 98221350 98269236 98338073 98423433 98513162 98610479 98718607 98828733 98940343 99063885 99202305 99343222
2629.1 99343222 99473572 99593163 99703521 99797058 99870944 99932021 99985266 100027585 100053382 100068307 100083709
2651.5 100083709 100101912 100116324 100125051 100136113 100147736 100149691 100142086 100125206 100097966 100066209 100035667 100013053
2676 100013053 100000000 99997604 99993515 99994332 99997240 99995607 99991918 99990135 99992424 99995923 99995571 99988532 99973762 99949646
2704.6 99949646 99915534 99880695 99849957 99814761 99774355 99738765 99709725 99682188 99658650 99641144 99618328 99584752
2729 99584752 99551469 99517298 99476296 99435997 99399590 99367672 99346769 99344623 99357420 99366224 99365622 99372154 99394190
2755.6 99394190 99424428 99455160 99481744 99503046 99519110 99527699 99525893 99515307 99501199 99476421 99436462 99395472
2780 99395472 99361873 99333054 99308747 99285114 99252653 99210465 99168319 99135047 99110341 99091446 99084198 99090028
2804.5 99090028 99101269 99118131 99137551 99143362 99134749 99122971 99105471 99075699 99035513 98995721 98962069 98927164
2829 98927164 98889190 98854560 98825383 98792082 98733497 98642689 98535407 98420501 98296326 98171353 98066425
2851.4 98066425 97993672 97946215 97912115 97875249 97818774 97746831 97679597 97628349 97602457 97608632 97617137 97603631
2875.9 97603631 97593743 97603911 97620291 97636819 97655016 97673041 97691482 97716212 97745603 97763789 97770643 97786766
2900.4 97786766 97818702 97855794 97888017 97914320 97937518 97951442 97938716 97900283 97863424 97849125 97865450 97907805
2924.8 97907805 97965288 98026568 98074567 98107576 98138666 98168290 98192900 98217100 98239583 98248166 98230898 98195755
2949.3 98195755 98160642 98117799 98053128 97975051 97892386 97800756 97693896 97578645 97464848 97349977 97237122
2971.7 97237122 97130227 97027206 96940851 96879822 96822274 96750194 96670181 96590865 96518219 96450406 96386343
2994.2 96386343 96337390 96302897 96274334 96253812 96238327 96221125 96205986 96193284 96160966 96077979 95938003
3016.6 95938003 95747501 95500600 95191354 94799256 94288343 93659920 92942905 92151195 91320699 90562141
3037 90562141 90014333 89727634 89638692 89647663 89671969 89641678 89489436 89202780 88840693 88449311 88049632
3059.4 88049632 87686479 87403542 87221891 87143940 87169409 87318504 87599427 87985551 88417751 88813949
3079.8 88813949 89128089 89352381 89473194 89496648 89439124 89313662 89184719 89122868 89138138 89212722 89332175
3102.3 89332175 89495075 89710361 89957261 90193200 90433311 90715110 91007370 91249871 91421610 91540629
3122.7 91540629 91637188 91724920 91783220 91788590 91756028 91711718 91656995 91572618 91444546 91293406 91147047
3145.1 91147047 91010863 90892440 90789968 90669626 90519339 90368634 90231961 90097684 89953446 89800906
3165.5 89800906 89644223 89474064 89289451 89097071 88899410 88708079 88522059 88323718 88123995 87943578
3185.9 87943578 87774819 87606597 87438941 87274027 87115836 86960053 86797762 86637563 86487776 86337650
3206.3 86337650 86180258 86018664 85862404 85714668 85562009 85405183 85253286 85097414 84932661 84772110
3226.7 84772110 84625226 84496766 84378481 84228843 84049273 83890331 83752513 83618027 83494961 83370888
3247.1 83370888 83223790 83071798 82941043 82817405 82674962 82515502 82356232 82209355 82080090 81968522
3267.5 81968522 81863546 81731987 81563389 81387830 81215829 81045580 80890465 80748481 80605870 80474842
3287.9 80474842 80371588 80269843 80132103 79964942 79796869 79639757 79504794 79392278 79262328 79083025
3308.3 79083025 78868341 78648865 78445607 78254282 78062117 77867651 77678663 77491093 77278697 77043265
3328.7 77043265 76804757 76567763 76353872 76169217 75970519 75735497 75483489 75226361 74984598 74779731
3349.1 74779731 74567914 74305964 74032617 73787475 73566794 73349160 73132843 72953469 72798789 72594649
3369.5 72594649 72315919 72030526 71799141 71606117 71411502 71196604 70982081 70801044 70665365 70568752
3389.9 70568752 70447981 70241159 70031816 69929814 69871134 69717866 69485968 69299507 69178945 69071621
3410.2 69071621 68950456 68802011 68643683 68521345 68439901 68358886 68269682 68205237 68176746 68157512 68142247
3432.7 68142247 68132371 68072563 67937970 67807436 67738372 67723727 67744315 67747122 67714500 67692333 67701089 67739373
3457.2 67739373 67797434 67841810 67880261 67966360 68078905 68117809 68077177 68064678 68120766 68207544 68293661
3479.6 68293661 68355584 68411696 68501645 68604684 68684500 68759793 68868536 69001257 69090492 69153935 69296271
3502 69296271 69449216 69496542 69547468 69704711 69896746 70036858 70125085 70194989 70285881 70441604 70611781
3524.5 70611781 70747697 70902908 71058452 71184045 71356720 71564841 71701187 71786225 71928501 72171181
3544.9 72171181 72401303 72504532 72615671 72824317 73000973 73121089 73269093 73387623 73388922 73538774
3565.3 73538774 74082541 74563175 74675113 74724615 74878758 75079614 75293350 75432676 75455934 75628173
3585.6 75628173 76122665 76473868 76510543 76649243 76950359 77205741 77457410 77677768 77700323 77713197
3606 77713197 78012913 78412151 78695935 78857732 78922921 79303426 79955941 80137956 79775143 79592419
3626.4 79592419 80429929 81489009 81747139 81845468 82077062 82323533 82569659 82634383 82460314 82632202
3646.8 82632202 83823228 85086221 85340625 85546160 86356914 87050760 87456560 87844664 88066739
3665.2 88066739 88312447 89235222 90253311 90794915 92108989 93656498 94270819 94599903 94786584
3683.5 94786584 94824862 95435876 96755755 97628069 97799140 97790903 97767311 97873271 98290527 98536289
3703.9 98536289 98242438 97911775 98216820 99142140 99570411 99266279 98941183 98883492 98983771 99157000
3724.3 99157000 99320877 99114370 98653924 98595661 99204385 100000000 100000393 99039042 98490804 99223828
3744.7 99223828 99433923 99032927 99680471 100445676 100156069 99689436 99795038 99979573 99761343 99569499
3765.1 99569499 99580097 99825621 100168848 100098586 99732566 99580884 99822479 100000000 99938864 99967754
3785.5 99967754 100014150 99935269 99732596 99462992 99337363 99155879 99116462 99709737 99910104 99838042
3805.9 99838042 100232530 100139117 99394107 98970115 99265802 99354529 99475169 100145280 100210476 99847639
3826.3 99847639 99584043 99347442 99183792 98972344 99054110 99646562 100000000 100042284 100017607 99594265
3846.7 99594265 98607463 97755224 98694521 100620592 100686598 99796671 99241608 99243295 99402183 99219424
3867.1 99219424 99296159 99803782 99983245 99852020 99469805 99279600 99430346 99446124 99699473 99816537
3887.5 99816537 99552542 99729049 99894238 99415171 98926389 98931670 99303710 99857110 100201106 100064242
3907.9 100064242 99798697 99604875 99411547 99419242 99678105 99824059 99763942 99768049 99804068 99678910 99642366
3930.3 99642366 99881929 100067174 100012767 99877280 99814618 99913490 100000000 99975795 100049353 100176501 100194490
3952.8 100194490 100155449 100132167 100135314 100180030 100234973 100238597 100215673 100208664 100209641 100216424 100239909 100245416 100217438
3979.3 100217438 100206673 100220454 100203788 100158548 100140476 100147903 100155759 100167966 100178456
3997.6 100178456
##END=$$ End of the data block
