##TITLE=Joseane $$ Begin of the data block
##JCAMP-DX=5.00 $$ ACD/SpecManager v 10.08
##SPECTROMETER/DATA SYSTEM=Alpha
##DATE=04 Nov 2014 09:02:00
##DATA TYPE=INFRARED SPECTRUM
##DATA CLASS=XYDATA
##ORIGIN=
##OWNER=
##NPOINTS=1765
##FIRSTX=399.76428223
##LASTX=3997.64306641
##MAXX=3997.64306641
##MINX=399.76428223
##MAXY=0.85558760
##MINY=0.41768757
##XFACTOR=1.0000000000
##YFACTOR=1.000000000000000e-9
##FIRSTY=0.82197636
##DELTAX=2.03961372
##XUNITS=1/CM
##YUNITS=ARBITRARY UNITS
##XYDATA=(X++(Y..Y))
399.8H21976364O965398J985491j138270j364529q40545k479434o212950r630561j0892331
418.1G98368633n917847J699447M490674N816817Q386672R696900P492662M065514
434.4H34099472K386629K296806J879632O39975k82526j5736P21395Q23141M0292o43789
454.8H41945291l85523R3460l37899j232982j695215j711250j780331k595007l902137
473.2H28398407m085839k757371n36740J816690L463805M079759L842652L114522J894235
491.5H39230120N00083j33693j38938m52936j234234j781463j924813k424717l775775
509.9H27863634o046534r320617j4211297j9783139j9549191p587492J0482668K2088469
526.2G83936501K0921111J3616681P505655L925800K396405J680970Q72195P7605j96099
$$ y = [821976364, 828941762, 830927253, 829788983, 828424454, 827583909, 825104475, 818891525, 809260964, 798368633, 792450786, 794150233, 798640907, 804457724, 812844396, 822541296, 830033958, 834099472, 836486101, 838782907, 840662539, 841302514, 841019988, 841004252, 841725647, 842548788, 842589080, 841945291, 841559768, 841653228, 841315329, 840082347, 838387132, 836675882, 834895551, 832300544, 828398407, 824312568, 821555197, 821018457, 822835147, 826298952, 830378711, 834221363, 837335885, 839230120, 839730203, 839596510, 839457572, 839004636, 837770402, 835988939, 834064126, 831639409, 827863634, 821817100, 812496483, 798285186, 778502047, 758952856, 751365364, 761848032, 783936501, 804857612, 818474293, 825979948, 829905748, 832302153, 833983123, 834855318, 834932923, 834736824]
544.6H34736824P2718L34024q9943q83699j101434q15272p68721j072288j148701o30974
565H28632534O7532r478j019716k167702k976179m118800o778836j1213601j6261637
583.3G84154117j9052923j4588594j011968J3812602J9568741J6459406J1678397Q321643
599.6H19341421O066799M492522L304541K233445J132906K77698N5551L13104K68936
618H37486923m73321j319289j531064j502157k742111n828143j1249661j7938793j0596871
636.4G84305513J5747130K8239429J4787137J443863k307474l584445n234420o502092
652.7H26894641p219315q538246j1586547j6043603j9772053j9637465j6308606k093852
669G25694954J8174768K6989043K6720643J8770218R663879L237725j18256k394438
$$ y = [834736824, 834809542, 835143566, 835053623, 834169924, 833068490, 832253218, 831484497, 830412209, 829263508, 828632534, 828700066, 828690588, 827670872, 825503170, 822526991, 818408191, 811629355, 800415754, 784154117, 765101194, 750512600, 749500632, 763313234, 782881975, 799341381, 811019778, 819341421, 825408220, 829900742, 833205283, 835438728, 836571634, 836849332, 836904883, 837217987, 837486923, 837013602, 835694313, 834163249, 832661092, 829918981, 824090838, 812841177, 794902384, 784305513, 800052643, 828292072, 843079209, 844523072, 842215598, 838631153, 833396733, 826894641, 819675326, 811137080, 799550533, 783506930, 763734877, 744097412, 727788806, 725694954, 743869722, 770858765, 797579408, 816349626, 826013505, 829251230, 829132974, 826738536]
685.3H26738536n964517q526862l071785R278834J6329169J2616754N443394J270175
701.6H54113698M46081P38502K89321p66754r49204J32858Q40009K32875n65231k01225
722H54310930O29663M74811q47995k006293j984119j619160k446473m525185o476640
740.4H35509539q246065r503543m910052O751478J3883591J0543525M143298l99769
756.7H47772002l292858m363418l675818l185034m919231q692920j3807178k2097289
773G83738256l7267685n3184450m0008128J4293969O0288370N7657897L0776858J1806250
789.3H28101337M780889L230154K391279J256585P17342Q53121N48601j059353l019452
807.7H37800503k610445N51164K150059j282394n738497l325045M107058O509840K516568
$$ y = [826738536, 820774019, 812247157, 809175372, 818454206, 834783375, 847400129, 852843523, 854113698, 854559779, 855298281, 855587602, 854820848, 853871644, 854004502, 854844511, 855077386, 854512155, 854310930, 854940593, 855415404, 854567409, 852561116, 850576997, 848957837, 846511364, 841986179, 835509539, 827263474, 817759931, 812849879, 819601357, 833484948, 844028473, 848171771, 847772002, 844479144, 840115726, 836439908, 833254874, 828335643, 819642723, 805835545, 783738256, 746470571, 693286121, 653277993, 667571962, 727860332, 785518229, 816295087, 828101337, 832882226, 836112380, 838503659, 839760244, 840477586, 841330707, 841879308, 840819955, 837800503, 835190058, 835741222, 837891281, 836608887, 830870390, 827545345, 831652403, 838162243, 840678811]
826H40678811j907825l902793l204942p74205J014114M63068k043426n493104j0340274
844.4H14489424j5830278j3304353J236498J1670649O224752n473912j4017403k0136952
860.7G64858425k4310053k0183086j314640K3491800L4329712K5917232J0308385k780437
877H10317338p739008j389742P634461Q639395M196227R74119j54674r87709k343595
895.4H19146812l471077l597378l223062l545761m814982o041706o468236o775201
911.7G81209409q153438j0210812j0345161p470906n099952o170094q962989j0774374
928G14021683j0799587r336174o674468k511144L078580O856084N301178K314150K974331
946.4G05224633O761372J3730407K0396769K0533621J6141534J2478352J0147691O116628
$$ y = [840678811, 838770986, 834868193, 831663251, 830889046, 831903160, 832366228, 830322802, 824829698, 814489424, 798659146, 785354793, 786591291, 798261940, 804486692, 799012780, 784995377, 764858425, 740548372, 720365286, 719050646, 742542446, 776872158, 802789390, 813097775, 810317338, 802578330, 801188588, 808823049, 817462444, 821658671, 822632790, 822478116, 821490407, 819146812, 815675735, 812078357, 808855295, 805309534, 800494552, 794452846, 787984610, 781209409, 773055971, 762845159, 752499998, 745029092, 739929140, 733759046, 724796057, 714021683, 703222096, 693885922, 687211454, 684700310, 687778890, 694634974, 699936152, 702250302, 705224633, 711986005, 725716412, 746113181, 766646802, 782788336, 795266688, 805414379, 811531007]
962.7H11531007l518045j6000211j6402304N03361J5174508J4920354Q873582N311608
979H20393860L983200L020346J798928Q04126M15743J68919p22527k447904m677057
997.4H22737634p710099j2735724j9503415k2745073j4216721N162597K0890832K1868944
1013.7G93748975J2697816L445089P91192N358219R095907O805539K924144J173258
1030H36040139N94557j88947j062632j400888j331866j551091k303183l197849l882587
1048.4H21715653m572570n749822p266879q200288q386970r954392j5107990j9835472
1064.7G42641270j4519632j159787M564583K220035P491589J9613921K3470283J6306042
1081H00628304O314517j930833q205176j1687398q346319K969265J3076782J3978482
$$ y = [811531007, 808012962, 792012751, 775610447, 776113808, 791288316, 806208670, 815082252, 820393860, 824377060, 827397406, 829196334, 830000460, 830416203, 830585122, 829862595, 827414691, 822737634, 815027535, 802291811, 782788396, 760043323, 745826602, 750989199, 771880031, 793748975, 806446791, 809891880, 810683072, 816041291, 825137198, 831942737, 834866881, 836040139, 836634696, 836445749, 835383117, 833982229, 832650363, 831099272, 828796089, 825598240, 821715653, 817143083, 811393261, 804126382, 795926094, 787539124, 777584732, 762476742, 742641270, 728121638, 726961851, 731526434, 733746469, 741238058, 760851979, 784322262, 800628304, 806942821, 805011988, 796806812, 785119414, 776773095, 779742360, 792819142, 806797624]
1097.3H06797624R678185N906641K954841L20911j549661l042996n368113p848561
1113.6H07848871p644058o100416q676707j0883391j005411J4508843J8606961J2355685
1129.9H19010377N923688J898527k48730q04424q28207j524627k834201l796100l978312
1148.3H12817991m040241m828334o198228p377624q297444j0049164j3193011j5718341
1164.6G43115604j2979925l796100L906846K126693o398499j5292585k3911535l1131268
1180.9F55639231k3515940R434820M4313371M9938559L2145620J3295650J585543m470467
1197.3G78366387p762671j0428905j2513578j1755705p625282n130589p919848j2311041
1213.6G02918768j3952673j3781905j5684604k0185233k3441016k3504734k0879627
$$ y = [806797624, 816475809, 822382450, 825337291, 825658202, 824108541, 821065545, 815697432, 807848871, 800204813, 794104397, 785427690, 774544299, 773538888, 788047731, 806654692, 819010377, 824934065, 826832592, 826583862, 825779438, 824951231, 823426604, 820592403, 816796303, 812817991, 808777750, 803949416, 797751188, 790373564, 782076120, 772026956, 758833945, 743115604, 730135679, 726339579, 730246425, 732373118, 725974619, 710682034, 686770499, 655639231, 632123291, 641558111, 685871482, 735810041, 767955661, 781251311, 782836854, 778366387, 770603716, 760174811, 747661233, 735905528, 728280246, 723149657, 715229809, 702918768, 688966095, 675184190, 659499586, 639314353, 615873337, 592368603, 571488976]
1227.9E71488976j3262748K815544K4106026M0313780M4058860L7103176K6995480
1242.1G33619094K0407379J7634987J3799191O544769j155794n634546p237375r825766
1258.4G68151939j5660822k3209572k8353513k4338245p688105J2205660K2693992
1272.7G03801334K4247050K2420943J6974866R020925L993571M007399N692720N874336
1289G96033144M294932K118289N23031n51641k403617n217254o496608l773928o2466
1307.4G84463882j258254p904052j6441346k4304091k9451669k5528550o934225J3844072
1323.7F86485767J6147614L898263l60847O044209J0829866J2729585J4881433J5710830
1340G66366720J4084339J1260927Q456588N975783L860473K018690L56973j529277
$$ y = [571488976, 558226228, 561041772, 585147798, 625461578, 669520438, 706623614, 733619094, 754026473, 771661460, 785460651, 792005420, 790849626, 785215080, 777977705, 768151939, 752491117, 729281545, 700928032, 676589787, 668901682, 681107342, 703801334, 728048384, 750469327, 767444193, 776465118, 780458689, 784466088, 790158808, 796033144, 800328076, 802446365, 802969396, 802417755, 800014138, 794796884, 788300276, 784526348, 784463882, 783205628, 775301576, 758860230, 734556139, 705104470, 679575920, 672641695, 686485767, 702633381, 706531644, 706170797, 712215006, 723044872, 735774457, 750655890, 766366720, 780451059, 791711986, 800168574, 806144357, 810004830, 812023520, 812380493, 810851216]
1356.4H10851216m969001j2423932k1356165j6274512M570961J8478572J2689591l998220
1372.7G87568510k3539842l5660922k7914643l904701K0697654L0909240K6822686
1386.9G74977982J5933931O646156K257824J74046j961470m899442p943452j0873973
1403.3G74311602j4704168j7973840k1129310k5028706k6950240k5262594k0424724
1417.5F22838020j0146558L989995J5979230K4726808K7928829K7529896K2659897
1431.8G35506117J5561283J0418594L528893l883898n808771l575146l624380r499371
1448.1G38623321j1643112m010915K578497l676653k2129536k4501324q600473J6749501
1464.5F83389306L3609510K8785407K1507025J8473089J3850689Q832097N775094L387272
$$ y = [810851216, 805882215, 793458283, 772102118, 755827606, 760398567, 778877139, 791566730, 787568510, 764028668, 728367746, 700453103, 696548402, 717246056, 748155296, 774977982, 790911913, 797558069, 799815893, 799989939, 798028469, 793129027, 785185575, 774311602, 759607434, 741633594, 720504284, 695475578, 668525338, 643262744, 622838020, 612691462, 616681457, 632660687, 657387495, 685316324, 712846220, 735506117, 751067400, 761485994, 765014887, 761130989, 755322218, 751747072, 748122692, 738623321, 726980209, 722969294, 725547791, 721871138, 699741602, 675240278, 666639805, 683389306, 716998816, 745784223, 767291248, 785764337, 799615026, 808447123, 814222217, 817609489]
1480.8H17609489J578689M62532o676n48840j387655j902581l273427p652521j4168740
1499.1G90710270j9080937k2966384l0991018k8708220N013824K5139391K6424647
1513.4G45541573K2685289J9664407J6146898J3318300Q703590M185497K442599J672089
1529.7H34360242J571417J890659J813233J654983J388311K93910j75952K1457L2366
1548.1H42850626l70145p69794o74546j83940k62976j109361m92037N08428R47595
1566.4H40443850O29663l97623j019537o17087Q8811J3351o95526j203179j377464
1584.8H35865259j511693j969695k584040k958417l069580l070116k934038k678693
1601.1H15088987k626478k929569l430724l669441l435611k899468k660096k523303
$$ y = [817609489, 819188178, 819650710, 819644034, 819095194, 817707539, 815804958, 812531531, 804879010, 790710270, 771629333, 748662949, 717671931, 688963711, 693977535, 719116926, 745541573, 768226862, 787891269, 804038167, 817356467, 826060057, 830245554, 832688153, 834360242, 835931659, 837822318, 839635551, 841290534, 842678845, 842972755, 842796803, 842818260, 842850626, 842480481, 841710687, 841036141, 840852201, 840589225, 839479864, 838987827, 839496255, 840443850, 841073513, 840675890, 839656353, 839039266, 839128077, 839141428, 838445902, 837242723, 835865259, 834353566, 832383871, 829799831, 826841414, 823771834, 820701718, 817767680, 815088987, 812462509, 809532940, 806102216, 802432775, 798997164, 796097696, 793437600, 790914297]
1617.4G90914297j714945j489997k302408l000140l218412l140986k142191j072586
1633.7G72832632o44565n62608k19285J26302L47018N33700L44217K7597n21958j378596
1654.1G70884454j149475o07133p97093j739919k565444k510905l022492m558682n156219
1672.5G48777092o424666q287072r282291j0480523j3509154j7870546j5246093j3709903
1688.8F53966844j7533719j9854725k3088217k4156808k1244228k2912622k0175397
1703.1E05001128j9408018k1443873j7816067j2223661o960303m277289m243254r41098
1719.4D17687565Q089244K0866126L1956643L4665495L0640364K4795175K4764001
1733.7E93464613K4285376J9361734J9916714K0097077J6965687J4572501J2492478
$$ y = [790914297, 789199352, 787709355, 785406947, 782406807, 779188395, 776047409, 773905218, 772832632, 772188067, 771625459, 771406174, 771532476, 771879494, 772413194, 772757411, 772785008, 772263050, 770884454, 769734979, 769127846, 768330753, 766590834, 764025390, 761514485, 758491993, 753933311, 748777092, 742352426, 734065354, 724783063, 714302540, 700793386, 682922840, 667676747, 653966844, 636433125, 616578400, 593490183, 569333375, 548089147, 525176525, 505001128, 485593110, 464149237, 446333170, 434109509, 427149206, 422871917, 418628663, 417687565, 425776809, 446642935, 478599578, 513265073, 543905437, 568700612, 593464613, 617749989, 637111723, 657028437, 677125514, 694091201, 708663702, 721156180]
1748G21156180J1204898R574890P460118O599545O103814N050301M487217L967881
1764.3G75604844L511429L409684K992153K686202K264440J959503K001703J969397
1780.6G96399355J672089J511157J529932J291453R27568M99189J71184k15113r73284
1799H02813530j635790o81341J622022L224849L201664K304077J678824J599491J735032
1817.3H15862358J655578J517296J621068J830518J621783J139640P78735P49588R23514
1835.7H27700078Q31664N45681M50909O82235P83979N11468K05338J62363L98636N63562
1856.1H32835913M60744K55644K50995L74019L35753l8087l83973k17438K26855M27485
1876.5H34527910J54376l79563p94649q27908o50108m52399j61648J83284K88367J68920
$$ y = [721156180, 732361078, 741935968, 749396086, 755995631, 762099445, 767149746, 771636963, 775604844, 779116273, 782525957, 785518110, 788204312, 790468752, 792428255, 794429958, 796399355, 798071444, 799582601, 801112533, 802403986, 803331554, 803830743, 804001927, 803786814, 802813530, 801177740, 800496399, 802118421, 805343270, 808544934, 810849011, 812527835, 814127326, 815862358, 817517936, 819035232, 820656300, 822486818, 824108601, 825248241, 826026976, 826776564, 827700078, 828531742, 829077423, 829528332, 830210567, 830994546, 831506014, 831711352, 831873715, 832272351, 832835913, 833296657, 833552301, 833803296, 834177315, 834513068, 834474981, 834091008, 833873570, 834100425, 834527910, 834682286, 834302723, 833508074, 832680166, 832030058, 831577659, 831416011, 831599295, 831887662, 832056582]
1896.9H32056582N2452q6427m60088j139104j766980j563549j34409J405418J925290
1915.2H30289185J738846J427532J147508R03189M98712j42633q87394j482249j429498
1933.6H32063198l88086J040161J753390J667142J314163R17673M87685J05798j3709
1951.9H38947415P5579J08182l1411j57774l2305K59816L87669K38418P5698J21117
1972.3H39992404K66254K81274J34170M5955J54615K86043K21729J3649p9274L7372
1992.7H41354191J96100K03430M7803r3341p2837j2278j42932m03404m82977k47478
2013.1H40346277R6202K43425J28090m053J5676P1526N364j14798q7619J30355L21329
2035.6H41151774K41280k2710j73628j24872q0347j52588k21431j20282R8765J57237
$$ y = [832056582, 832109034, 832022607, 831562519, 830423415, 828656435, 827092886, 826958477, 828363895, 830289185, 832028031, 833455563, 834603071, 835506260, 836004972, 835862339, 834974945, 833492696, 832063198, 831675112, 832715273, 834468663, 836135805, 837449968, 838367641, 838855326, 838961124, 838947415, 839022994, 839131176, 839099765, 838941991, 838909686, 839169502, 839557171, 839795589, 839871287, 839992404, 840258658, 840539932, 840674102, 840720057, 840874672, 841160715, 841382444, 841396093, 841316819, 841354191, 841550291, 841753721, 841801524, 841708183, 841635346, 841623068, 841480136, 841076732, 840593755, 840346277, 840442479, 840685904, 840813994, 840809941, 840825617, 840897143, 840902507, 840787709, 840700090, 840830445, 841151774, 841393054, 841370344, 841196716, 841071844, 840991497, 840838909, 840617478, 840497196, 840595961, 840753198]
2056H40753198n4777l45290m53949l48508k58207l46601m68493m14014j86741R835
2076.4H37886453M1246L4928J66059L70860M21584K59101R4175J59026L58104M32909
2096.8H40224445L30329K60591L84271N21183L96431K9921k78234l21329j94728j41263
2117.1H41211617j94967j32382J05918K37882P1525k01106k42471n37J93179J05560
2137.5H41154218p4506o7055P8499Q7082j65939m52638m50670k24531j49846l93748
2157.9H39340866p07448p89583o73651o15061o42895n08070j18375K19822J83940j17004
2178.3H35572541k96116j47820J53423K79367J66297Q5294J48594J45972n5194k43366
2198.7H35808992j08003K68519M61459K67386k5391k3246K52962M07934K55823N8413
$$ y = [840753198, 840698421, 840353131, 839899182, 839550674, 839292467, 838945866, 838477373, 838063359, 837876618, 837886453, 837927699, 837962627, 838128686, 838499546, 838921130, 839180231, 839274406, 839433432, 839791536, 840224445, 840554774, 840815365, 841199636, 841720819, 842117250, 842147171, 841868937, 841547608, 841352880, 841211617, 841016650, 840884268, 840990186, 841228068, 841299593, 841098487, 840856016, 840855479, 841048658, 841154218, 841079712, 841012657, 841091156, 841178238, 841012299, 840559661, 840108991, 839884460, 839734614, 839340866, 838633418, 837843835, 837170184, 836555123, 835912228, 835404158, 835285783, 835505605, 835689545, 835572541, 835276425, 835128605, 835282028, 835561395, 835727692, 835812986, 835961580, 836107552, 836052358, 835808992, 835700989, 835969508, 836430967, 836698353, 836672962, 836649716, 836902678, 837310612, 837566435, 837624848]
2219.1H37624848R7453K41638J55627j55150l47138k41280p4565j53184m37200n94556
2239.5H36116493m41194j94311j76251l67701m26769j89483M8279n6445l36051l51906
2259.9H33624661q8513K2650k47240o07610o69241m71234l65973m94540n92410l96490
2280.3H29714060o5029O9976o2406k10941j59621m9412j41859m07100n52237m79281
2300.7H27656150m41253o10352p98702p10189l51727n7936r6679l25918m03464k89321
2321.1H23570609k40803m07159o13809n60522k75492k11895n03838o86884m85420j33395
2341.5H19451392Q4698J71423R7871j46866l98219n95450p46906p16984m21226j07110
2361.9H16672623o0916j73390k00391j51395k05994m29332o02961n61714m38631m75108
$$ y = [837624848, 837722301, 837963939, 838119566, 837964416, 837617278, 837375998, 837301433, 837148249, 836711049, 836116493, 835675299, 835480988, 835304737, 834937036, 834510267, 834320784, 834369063, 834312618, 833976567, 833624661, 833536148, 833558798, 833311558, 832703948, 832034707, 831563473, 831197500, 830702960, 830110550, 829714060, 829649031, 829719007, 829656601, 829445660, 829286039, 829236627, 829094768, 828687668, 828135431, 827656150, 827214897, 826604545, 825805843, 825095654, 824743927, 824685991, 824589312, 824263394, 823859930, 823570609, 823329806, 822922647, 822308838, 821748316, 821472824, 821260929, 820757091, 820070207, 819584787, 819451392, 819536090, 819707513, 819805384, 819658518, 819260299, 818664849, 817917943, 817200959, 816779733, 816672623, 816611707, 816438317, 816237926, 816086531, 815880537, 815451205, 814848244, 814286530, 813847899, 813372791]
2382.3H13372791o84977q69453r35793r54866r85384r70662q33213o30081n44011o31094
2402.7H05333257p15673o12676l12627j4841P2837Q94p0572j11640j88946l57092n24402
2425.1H02498519n96284o19233o73354q33630j059294j210690j249671j262962j255811
2443.5G93737590j131296q95560o10113l16024o8366J27911K17438Q4996k29001n53786
2463.9G90363789p77603q90374r36687j028716j214862j366973j409769j453340j575232
2482.2G79710233j684129j689434j620829j526535j403808j251459j058877q30054
2498.5G68645108o29962n20825n44489p17341j004041j304507j474857j416624j222432
2516.9G59810030j107513j155913j312316j497149j657605j856447k121329k300382
$$ y = [813372791, 812687814, 811818361, 810882568, 809927702, 808942318, 807971656, 807138443, 806508362, 805964351, 805333257, 804617584, 804004908, 803692281, 803677440, 803750277, 803751171, 803680599, 803568959, 803380013, 803022921, 802498519, 801902235, 801283002, 800609648, 799776018, 798716724, 797506034, 796256363, 794993401, 793737590, 792606294, 791710734, 791100621, 790784597, 790716231, 790844142, 791061580, 791146576, 790917575, 790363789, 789586186, 788695812, 787759125, 786730409, 785515547, 784148574, 782738805, 781285465, 779710233, 778026104, 776336670, 774715841, 773189306, 771785498, 770534039, 769475162, 768645108, 768015146, 767494321, 766949832, 766232491, 765228450, 763923943, 762449086, 761032462, 759810030, 758702517, 757546604, 756234288, 754737139, 753079534, 751223087, 749101758, 746801376]
2533.2G46801376k263844j996457j535058r12071j89363M42147P64072P42495N44488
2551.6G42397785L49164K12372Q8632n4598j98245l66450o02781q22843r40203r43124
2572G39119709q64447q68439j102746j515567j863003j861513j503050j146614j188398
2590.3G27205932j619100k038718k122640j796842j106799k41756M42803O33836L14355
2608.7G19671071k68221q63612j379728j816273k160072k332271k291739k178192k150535
2627G04230428k003372j328945j61827J054228K028465K665460K831638K479315J797855
2645.4G13593245J112759P20381P65682J142323J497745J534581J322449J103162Q88765
2663.7G23681092N57602J20997k82824n22315o19531p18772q80838j030981j065612
$$ y = [746801376, 744537532, 742541075, 741006017, 740093946, 739904583, 740346730, 741110802, 741853297, 742397785, 742746949, 742959321, 743047953, 742993355, 742795110, 742428660, 741825879, 741003036, 740062833, 739119709, 738255262, 737386823, 736284077, 734768510, 732905507, 731043994, 729540944, 728394330, 727205932, 725586832, 723548114, 721425474, 719628632, 718521833, 718280077, 718722880, 719356716, 719671071, 719402850, 718539238, 717159510, 715343237, 713183165, 710850894, 708559155, 706380963, 704230428, 702227056, 700898111, 700736284, 701790512, 703818977, 706484437, 709316075, 711795390, 713593245, 714706004, 715426385, 716192067, 717334390, 718832135, 720366716, 721689165, 722792327, 723681092, 724238694, 724359691, 724076867, 723554552, 722935021, 722216249, 721335411, 720304430, 719238818]
2682.1G19238818r44019p76112o75916n85378m50611l11732k11000k14518l72648o49512
2702.5G14047372r81927j311659j622916j929998k200544k316475k155363j870513
2718.8F99657977j755119j692652j315117o76751j62185J44780M28021Q06212J327455
2737.2F96762621J973629K602756K929509K749801K185583J531064R98021P34746P93755
2755.5G13261485R06646P92742N08428J46270l08395p38323r40263r17017r10640j121044
2775.9G10679889j390100j406133j186430j037896j077294j177848j294672j394272
2792.2G00715244j435220j526595j731157j954436k121985k294481k436578k412260
2808.6F84802532k368629k497673k730071k947808l018379k858758k618134k542138
$$ y = [719238818, 718294799, 717518687, 716842771, 716257393, 715806782, 715495050, 715284050, 715069532, 714696884, 714047372, 713065445, 711753786, 710130870, 708200872, 706000328, 703683853, 701528490, 699657977, 697902858, 696210206, 694895089, 694218338, 694056153, 694200933, 694628954, 695435166, 696762621, 698736250, 701339006, 704268515, 707018316, 709203899, 710734963, 711732984, 712467730, 713261485, 714168131, 714960873, 715469301, 715615571, 715307176, 714568853, 713628590, 712711573, 711800933, 710679889, 709289789, 707883656, 706697226, 705659330, 704582036, 703404188, 702109516, 700715244, 699280024, 697753429, 696022272, 694067836, 691945851, 689651370, 687214792, 684802532, 682433903, 679936230, 677206159, 674258351, 671239972, 668381214, 665763080, 663220942]
2824.9F63220942k653420k786934k882660l023147l336728l853679m614949n825281
2841.2F34244144p509768r147823r390652o552935r93669L569842L750980J52766m955709
2859.5F03167176j0488689j5168607j5937865j0463357j644790M088283N289793O805837
2875.9E65647781J0298312J1670351R029925M829704J241565j416802l505111n133152
2892.2E92662573n922616n583703m542291l665388l546476m167974n082727n969584
2908.5E54181814o907224p905663q515179q206606o924033m695058j074195L410101
2924.8E13363957O756306P668555O370842L998995J883328P27952N01096J42634k487183
2943.2E38926482p661760j1907756j3153553j3561726j2783020o407291M635036J2521148
$$ y = [663220942, 660567522, 657780588, 654897928, 651874781, 648538053, 644684374, 640069425, 634244144, 626734376, 617586553, 608195901, 601642966, 600649297, 604219139, 607970119, 608122885, 603167176, 592678487, 577509880, 561572015, 551108658, 549463868, 553552151, 558841944, 565647781, 575946093, 587616444, 596646369, 601476073, 602717638, 601300836, 597795725, 592662573, 586739957, 581156254, 576613963, 572948575, 569402099, 565234125, 560151398, 554181814, 547274590, 539368927, 530853748, 522647142, 515723109, 511028051, 509953856, 513363957, 520120263, 527788818, 534159660, 538158655, 540041983, 540769935, 541271031, 541413665, 538926482, 531264722, 519356966, 506203413, 492641687, 479858667, 473451376, 478086412, 490607560]
2959.5D90607560J3026297J0076940J0037422J4250815J7466307J5282154Q903861
2973.8E79651356J727342k366066l60369N340993Q450270O187439J112044j827121
2990.1E97915888K98679M228472M957796K559125J27375p67529o68466n22673n14746
3008.4F07613921n71310j076997k496063m318417m370749p43925M190266O015599M676640
3026.8F08918965L023207J999199J139522K18034p40051j627505k462805k796113j883864
3045.1F05788589O6697K170563L508448L707827L281056K726794K222597J918018J794935
3063.5F27185524J715421J440942R09269M15325R1970j38938n06461j193165j817286
3081.9F28102601j991392j809895j298308o18041j47044K23100O44624R12905Q74877
$$ y = [490607560, 503633857, 513710797, 523748219, 537999034, 555465341, 570747495, 579651356, 581378698, 579012632, 578652263, 583993256, 592443526, 598630965, 599743009, 597915888, 598214567, 602443039, 607400835, 609959960, 610087335, 609319806, 608651340, 608128667, 607613921, 607042611, 605965614, 603469551, 599151134, 594780385, 594036460, 598226726, 604242325, 608918965, 611942172, 613941371, 615080893, 615298927, 614558876, 612931371, 610468566, 607672453, 605788589, 605855286, 608025849, 611534297, 615242124, 618523180, 621249974, 623472571, 625390589, 627185524, 628900945, 630341887, 631251156, 631666481, 631758451, 631619513, 631113052, 629919887, 628102601, 626111209, 624301314, 623003006, 622384965, 622237921, 622461021, 623105645, 624018550, 624893427]
3100.2F24893427O74784O94513R87649J138807R48250R04381J241744J425803J313924
3118.6F34223282J182616J189590J499772J935839K118528J996756J817286J807570
3134.9F47771239J902104J768410J318872J017153J075387J194120J299083J369297
3151.2F58715665J135946P67111O86229P61211P77483P97391Q47578Q51273P64072
3169.6F66103959P00414P41720Q06571Q04066P66874P70509Q22425Q99255R65059R79006
3189.9F74359858R63092R77754J018942J023948R83834R67920J004696J034498J018703
3208.3F83353245R85742R77456R85563R70245R45627Q94606Q01743P53223P68841P88450
3228.7F92224741Q57890R15229O98507L88205L41773M43041N75662P36356P08758M78507
$$ y = [624893427, 625568211, 626262724, 627250373, 628389180, 629337430, 630241811, 631483555, 632909358, 634223282, 635405898, 636595488, 638095260, 640031099, 642149627, 644146383, 645963669, 647771239, 649673343, 651441753, 652760625, 653777778, 654853165, 656047285, 657346368, 658715665, 659851611, 660618722, 661304951, 662066162, 662843645, 663641036, 664488614, 665339887, 666103959, 666804373, 667546093, 668352664, 669156730, 669923604, 670694113, 671516538, 672415793, 673380852, 674359858, 675322950, 676300704, 677319646, 678343594, 679327428, 680295348, 681300044, 682334542, 683353245, 684338987, 685316443, 686302006, 687272251, 688217878, 689112484, 689914227, 690667450, 691436291, 692224741, 693082631, 693997860, 694696367, 695084572, 695426345, 695869386, 696445048, 697181404, 697890162, 698368669]
3249.1F98368669M34339O49511P57218O37948N58675O15298O66917P35223R07242J079798
3269.5G05410838J008690P86125P05064O94155O75142O85096O84261O82056P20859
3287.8G12052286Q21113Q34227O38664L82065J60635O1095K05576L83556K65658p6890
3308.2G15727985l48866m14133l53098l69549m59015m97639m84765n37276p86603j082718
3328.6G10394323j181185j141310j079559j003802j045287j172960j182079j148641
3345G01439500j021505p14242o53028r28522j071632j009702r66549j073063j245558
3363.3F92755699j253366j237333j432061j664698j674355j519858j364351j223802
3379.6F81385875j117051j037896r65952q92580p77721p33257q52227r19521q12590
$$ y = [698368669, 698803008, 699452519, 700209737, 700847685, 701406360, 702021658, 702688575, 703423798, 704331040, 705410838, 706419528, 707205653, 707910717, 708604872, 709280014, 709965110, 710649371, 711331427, 712052286, 712873399, 713707626, 714346290, 714728355, 714888990, 714950085, 715155661, 715539217, 715804875, 715727985, 715379119, 714964986, 714611888, 714242339, 713783324, 713285685, 712800920, 712263644, 711477041, 710394323, 709213138, 708071828, 706992269, 705988467, 704943180, 703770220, 702588141, 701439500, 700417995, 699703753, 699050725, 698122203, 697050571, 696040869, 695074320, 694001257, 692755699, 691502333, 690265000, 688832939, 687168241, 685493886, 683974028, 682609677, 681385875, 680268824, 679230928, 678264976, 677372396, 676594675, 675861418, 675009191, 674089670, 673277080]
3398F73277080p14958p58707q38638p70807o08206n12540m96149m77493m43220m05192
3418.4F67251170l62456l44157k97308j95742p7128K1874O7711R5845K04086L69847
3438.8F66733742M51684M25458M47333N77569O08444N52356O04093P18236Q04782Q64744
3459.2F72788441Q55029Q11159Q83103J028776J041293R05097Q44121R31203J050770
3477.5F81138992J089692R70126Q46266R51350J059115R72569R45985J058579J148701
3495.9F90181375J087248J003325J094401J102805R33230R80794J215220J331031J264095
3514.2G00193524J139939J158536J295805J413941J344442J163781J168788J248836
3530.6G10127592J257300J404942J566886J433850J332819J499534J595378J389801
$$ y = [673277080, 672562122, 671803415, 670964777, 670193970, 669585764, 669073224, 668577075, 668099582, 667656362, 667251170, 666888714, 666544557, 666247249, 666051507, 665974379, 665996253, 666063964, 666159809, 666363895, 666733742, 667185426, 667610884, 668058217, 668635786, 669244230, 669796586, 670400679, 671118915, 671923697, 672788441, 673643470, 674454629, 675337732, 676366508, 677407801, 678312898, 679157019, 680088222, 681138992, 682228684, 683198810, 684045076, 684996426, 686055541, 687028110, 687974095, 689032674, 690181375, 691268623, 692271948, 693366349, 694469154, 695402384, 696383178, 697598398, 698929429, 700193524, 701333463, 702491999, 703787804, 705201745, 706546187, 707709968, 708878756, 710127592, 711384892, 712789834, 714356720, 715790570, 717123389, 718622923, 720218301, 721608102]
3546.9G21608102J164973J225770J386463J387537J353919J410425J397669J286328
3563.2G32221186J410723J816273J775980J334965J279533J554131J700759J738191
3579.5G44831741J747548J685739J774609J921475J641929J377702J605332J853406
3595.8G58439481J785755J634837J534879J444161J444578J624703J662791J548588
3612.1G71119773J511395J371622J448155J613438J235008Q23081Q69036J522421J680911
3630.5G83194840R61184P51555P81954P14719P00951O29544M93288O10173J141667
3648.8G89979875R83298k2829j74701M82619O75678M13120K81334K23517J77861L75151
3669.2G93394923L88503j4364Q9109J46627j53840o1214J53721L43442Q25524J058340
$$ y = [721608102, 722773075, 723998845, 725385308, 726772845, 728126764, 729537189, 730934858, 732221186, 733631909, 735448182, 737224162, 738559127, 739838660, 741392791, 743093550, 744831741, 746579289, 748265028, 750039637, 751961112, 753603041, 754980743, 756586075, 758439481, 760225236, 761860073, 763394952, 764839113, 766283691, 767908394, 769571185, 771119773, 772631168, 774002790, 775450945, 777064383, 778299391, 779122472, 779991508, 781513929, 783194840, 784156024, 784907579, 785689533, 786404252, 787105203, 787734747, 788228035, 788838208, 789979875, 790963173, 790940344, 790765643, 791248262, 791923940, 792337060, 792618394, 792841911, 793019772, 793394923, 793783426, 793769062, 793858171, 794004798, 793850958, 793789744, 793943465, 794286907, 795112431, 796170771]
3689.6G96170771M19736j5855k8670n2034N1260L38912K84194m2498m1484K75909M76003
3712.1G97836244J57714j82390k22504j85073j11818J0848O3777o7413j42693J08897
3732.5G97265589M57704M46678n5492o23584n32270K35081J83046k12491J94371K62141
3752.9G97620773j95443k64824%L6478j79350j54495o3420L2187J02758q1479j94252
3775.3G96658933o5744J5199k69889m58539k63035r6202j7822K4319K324P6890J1087
3797.7G95617521m0889K93195J11580j36852O5148j17004l61562k03669J32442Q344
3818.1G95368254j27494n484k90215l54051j52588j9014J43707J71721J69456K02953
3838.5G95107245j847j33276r4533k23279m40300m59015J72675O74307o2108m73142
$$ y = [796170771, 796590507, 796574652, 796545982, 796493948, 796545208, 796884120, 797168314, 797125816, 797084332, 797360241, 797836244, 797993958, 797811568, 797589064, 797403991, 797292173, 797303021, 797366798, 797299385, 797156692, 797265589, 797723293, 798169971, 798114479, 797490895, 796958625, 797193706, 797376752, 797164261, 797358632, 797620773, 797425330, 797160506, 797160506, 797196984, 797017634, 796863139, 796799719, 796831906, 796934664, 796853185, 796658933, 796593189, 796608388, 796338499, 795879960, 795616925, 795520723, 795502901, 795527220, 795529544, 795606434, 795617521, 795576632, 795869827, 795981407, 795844555, 795909703, 795792699, 795431137, 795227468, 795359910, 795368254, 795240760, 795235276, 794945061, 794591010, 794438422, 794419408, 794563115, 794734836, 794904292, 795107245, 795105398, 794972122, 794877589, 794654310, 794214010, 793754995, 793927670, 794601977, 794539869, 794066727]
3858.9G94066727l11434p3612n8591k73884j04665K10941J5735k37167l92496k25663
3879.3G92615891Q0108K4259P3433n066j56462Q9585O8248k84613l39686j41204K3186
3901.8G92047679J22428M4704j73986k09570j46389j32799m6194M1306j907n6565j8835
3924.2G91469872l1114j50323j19268M6610Q047j64509k15411j73807r9123n8412k7716
3946.6G90484846J7106n9306j87636k49505k29120j57058p0393J0132j490k2232O8664
3969.1G89604008J06096J1564p8738j45137j89066j54197r8348j28269j55032p0214
3989.5G88702667P987n96m3035j04904
3997.6G88562119
$$ y = [794066727, 793755293, 793681681, 793623090, 793349206, 793244541, 793455482, 793471217, 793234050, 792841554, 792615891, 792695999, 792720258, 792793691, 792788625, 792632163, 792721748, 792789996, 792505383, 792165697, 792024493, 792047679, 792170107, 792214811, 792040825, 791831255, 791684866, 791552067, 791505873, 791547179, 791545272, 791488707, 791469872, 791438758, 791288435, 791169167, 791215777, 791223824, 791059315, 790843904, 790670097, 790570974, 790512562, 790484846, 790501952, 790442646, 790255010, 790005505, 789776385, 789619327, 789548934, 789559066, 789557576, 789535344, 789604008, 789710104, 789721668, 789642930, 789497793, 789308727, 789154530, 789056182, 788927913, 788772881, 788702667, 788710654, 788710058, 788667023, 788562119]
##END=$$ End of the data block
