##TITLE=Joseane - Epoxido $$ Begin of the data block
##JCAMP-DX=5.00 $$ ACD/SpecManager v 10.08
##SPECTROMETER/DATA SYSTEM=Alpha
##DATE=28 Apr 2015 09:23:26
##DATA TYPE=INFRARED SPECTRUM
##DATA CLASS=XYDATA
##ORIGIN=
##OWNER=
##NPOINTS=1765
##FIRSTX=399.76428223
##LASTX=3997.64306641
##MAXX=3997.64306641
##MINX=399.76428223
##MAXY=1.00072765
##MINY=0.44919091
##XFACTOR=1.0000000000
##YFACTOR=0.000000010000000
##FIRSTY=1.00000000
##DELTAX=2.03961372
##XUNITS=1/CM
##YUNITS=ARBITRARY UNITS
##XYDATA=(X++(Y..Y))
399.8A00000000L6l67898k21169K53499K96384Q7189K4724p2765l1823j64789l87418
422.2I9415970l16960k68066m92578o49405o60080m03225L73840Q22473M94176J78909
442.6I8495054Q124k06154k16484k34080m70882o56843j211191j958841j203996O20735
463I2965442J717985J553827P87401J42563n4503j57320l46089l68076m32563p32619
483.4I5076048j054090j582563k418434l024733k426959J07068L178382M178423L063041
501.7I5096183J646083O78182R3931q7333k11024m28015n17780p70264j331765k000111
522.1I2168087l397376n776411n829477k04623O866914Q324748M909349J804060N98186
540.5I9463457K02495p5156q5020m4012j70898j54871j07294j94914j10071j8591j15389
$$ y = [100000000, 100000036, 99632138, 99410969, 99664468, 99960852, 100048041, 100072765, 100000000, 99968177, 99803388, 99415970, 99099010, 98830944, 98338366, 97688961, 97028881, 96625656, 96999496, 97821969, 98316145, 98495054, 98503178, 98297024, 98080540, 97846460, 97375578, 96718735, 95507544, 93548703, 92344707, 92965442, 94683427, 96237254, 97024655, 97167218, 97112715, 96955395, 96609306, 96241230, 95808667, 95076048, 94021958, 92439395, 90020961, 86996228, 84569269, 84676337, 87854719, 92033142, 95096183, 96742266, 97420448, 97514379, 97427046, 97216022, 96788007, 96270227, 95499963, 94168198, 92168087, 88770711, 82994300, 77164823, 76960200, 83827114, 92151862, 97061211, 98865271, 99463457, 99665952, 99590796, 99505776, 99461764, 99290866, 99135995, 99028701, 98833787, 98723716, 98705125, 98589736]
562.9I8589736q9109l1918j23948p7963j2696j24615j03044l1239j06734p2593m643
585.4I7811234j03116q4245k1214j07985p7594j6737j20395j34510q8584j83618k02287
607.8I6670949k16192m61542n72580r5386M27705L38251o6865m97233m76152J84631
628.2I5235586N09978J94984j29038l63368m88358n89288r50867j502514k390396l329432
648.6H6197287k124727J638544L828090K438319p5710k155000m147994n128509k215976
667G8254324N342305N816090J883304m7189q48913j992065m355907o862867n552793
685.3G1636289J719481Q171082P029640K166564j078660l078860n560899q430784q123833
703.7F4450020q14611P680446P038826r38166m002517K167809P978934P332885M240000
$$ y = [98589736, 98500627, 98468709, 98344761, 98266798, 98254102, 98129487, 98026443, 97995204, 97888470, 97815877, 97811234, 97708118, 97623873, 97602659, 97494674, 97417080, 97400343, 97279948, 97145438, 97056854, 96873236, 96670949, 96454757, 95993215, 95420635, 95325249, 95752954, 96091205, 96024340, 95527107, 95050955, 95235586, 95745564, 95940548, 95811510, 95448142, 94959784, 94370496, 93419629, 91917115, 89526719, 86197287, 84072560, 85711104, 89539194, 91977513, 91901803, 89746803, 85598809, 80470300, 78254324, 83596629, 89412719, 91296023, 91248834, 90399921, 88407856, 84051949, 77189082, 71636289, 73355770, 81526852, 88556492, 90723056, 89644396, 86565536, 81004637, 72573853, 64450020, 63635409, 71315855, 78354681, 77416515, 73413998, 75581807, 83560741, 90893626, 95133626]
722I5133626K215207J282591P56097L67927J83827O0725n8496q3864j14518j92827
742.4I9550295j39606j06663j57135j51456j91015l39746m10927m80890o60187p96366
762.8I6116304r44143j205039j504547j948756k849531m320645m640216n68092N379576
781.2H3514911O299639K594411n65261k052688l142935m068297m045809k490520j45108
799.5G5898343J704312K773171L083897K371830R62680l01814j168328k377713m303157
817.9G8643221m884673p94267N650073P025069K400869j392847j418573j889413l852040
836.2G9487419l368193j55562L158242N317157N691034M427612K729386J429838O71809
854.6I9388742K93482k0635l46464n89478q12257j034504j159912j326442j365620
$$ y = [95133626, 97348833, 98631424, 99387521, 99755448, 99939275, 100000000, 99941504, 99857640, 99743122, 99550295, 99410689, 99304026, 99146891, 98995435, 98804420, 98464674, 98053747, 97572857, 96912670, 96116304, 95172161, 93967122, 92462575, 90513819, 87664288, 83343643, 78703427, 78135335, 83514911, 89814550, 92408961, 91843700, 89791012, 86648077, 82579780, 78533971, 76043451, 75898343, 77602655, 80375826, 83459723, 85831553, 86794233, 86492419, 85324091, 82946378, 78643221, 73758548, 72964281, 78614354, 85639423, 88040292, 86647445, 85228872, 83339459, 79487419, 76119226, 75963664, 79121906, 84439063, 90130097, 94557709, 97287095, 98716933, 99388742, 99682224, 99661589, 99315125, 98725647, 97913390, 96878886, 95718974, 94392532, 93026912]
873I3026912o16228N83416Q16214k03914j529359k646590l552299m047948l287101
891.3G8543103p10786K437425M194003M223532L423047K473456J745319J280153Q85504
909.7I8494756N55223L46882J80053J02145Q6486o962j29795k83605o80273j525265
930.1I7139645k919615l196215k37876L058528L011328J291222L0559p84236n89621
948.4I6803719O06185J095235N43613O1065j72908l12030k17533n7298p3343j31900
968.8I8144805j87903k87694l48628m62591p67243q65364l50434J17499n7370m55218
989.2I4479859p49797r89097j322281j904250k307337j916743j368927j841730k934963
1007.6G9144734k967667j521641j001066k00087N268079R985888P206702J689988j063001
$$ y = [93026912, 92410684, 92994100, 93810314, 93606400, 92077041, 89430451, 85878152, 81830204, 78543103, 77832317, 80269742, 84463745, 88687277, 92110324, 94583780, 96329099, 97609252, 98494756, 99049979, 99396861, 99576914, 99679059, 99765545, 99758583, 99628788, 99345183, 98664910, 97139645, 94220030, 91023815, 90785939, 93844467, 96855795, 98147017, 98177576, 97393340, 96803719, 97409904, 98505139, 99048752, 99109817, 98936909, 98624879, 98407346, 98350048, 98276705, 98144805, 97956902, 97669208, 97320580, 96857989, 96090746, 95225382, 94874948, 94992447, 94935077, 94479859, 93730062, 92740965, 91418684, 89514434, 87207097, 85290354, 83921427, 82079697, 79144734, 76177067, 74655426, 73654360, 73454273, 78722352, 88708240, 95914942, 97604930, 96541929]
1025.9I6541929r26935M59760J162046P67154K37542O801j34170k76625l59208m51523
1046.3I7026771n84125o86795q95542j328563j951397k600777k181232L57598K883202
1064.7I0039140K683872J008946o4457n87964q92293j005107j377529k420187m265845
1083H3118576o579805p184034l295571L825885Q697927P851684L867442J287353Q56131
1101.4I2445588J073635J211703Q23992o9785r63783j717431k473122k421128k52998
1119.8H7656671K649492L457206K332419J112438M59200K39050J41639K0271m0114
1138.1I8028272q2481j77955k19119k14576k24895j72966j40566k84410n79232p79402
1158.5I5152670l60948M35299N13744q7958o26451j167995j835847j745873o23834
$$ y = [96541929, 95614994, 96074754, 97236800, 98003954, 98241496, 98248297, 98114127, 97837502, 97478294, 97026771, 96442646, 95755851, 94860309, 93531746, 91580349, 88979572, 86798340, 87155938, 90039140, 92723012, 93731958, 93667501, 93079537, 92187244, 91182137, 89804608, 87384421, 83118576, 76538771, 69354737, 66059166, 69885051, 78582978, 86434662, 90302104, 91589457, 92445588, 93519223, 94730926, 95554918, 95485133, 94521350, 92803919, 90330797, 87909669, 87656671, 90306163, 93763369, 96095788, 97208226, 97667426, 97906476, 98048115, 98068386, 98028272, 97945791, 97767836, 97548717, 97334141, 97109246, 96936280, 96795714, 96511304, 95932072, 95152670, 94791722, 95227021, 95740765, 95652807, 95026356, 93858361, 92022514, 90276641, 89652807]
1176.9H9652807L27217J062179J704579J186771k38622j529479k107733j201111P66313
1195.2H9622921J835787J414001N90348j0365l87371n91570p68733r75001j102483
1213.6H9627534j195985j384413j691884k157021k737921l230846l532308l672880
1229.9G0024276l672230l423340k255231M75186L700984N299598M784000L525460K824693
1248.2H1283396K958847L210163K695924J693946J179987J230943J180429P82609K54392
1266.6I6470636j92296m86809p00182q13341o48552j49090M53639Q19850Q02970N59009
1287I6115834L48120J83851q1015n44345j284087j721626j121956l17222k9964M38083
1307.4I1985673R37116Q90541O77240N55557M02856K59894J33997p8583l00228m51237
$$ y = [89652807, 89980024, 91042203, 92746782, 93933553, 93694931, 92165452, 90057719, 88856608, 89622921, 91458708, 92872709, 93463057, 93452692, 93065321, 92473751, 91705018, 90730017, 89627534, 88431549, 87047136, 85355252, 83198231, 80460310, 77229464, 73697156, 70024276, 66352046, 62928706, 60673475, 61148661, 64849645, 70149243, 74933243, 78458703, 81283396, 84242243, 87452406, 90148330, 91842276, 93022263, 94253206, 95433635, 96216244, 96470636, 96278340, 95791531, 95091349, 94278008, 93629456, 93480366, 93934005, 94753855, 95556825, 96115834, 96463954, 96647805, 96566790, 96022445, 94738358, 93016732, 91894776, 91577554, 91547590, 91985673, 92922789, 93813330, 94490570, 95046127, 95448983, 95708877, 95842874, 95764291, 95464063, 95012826]
1327.8I5012826o27613q59338j110137j412648j499462j039767n64218l06403M36782
1346.2H8030022J227379R16773n4574m52113N7101Q03036J111507R64666N49072J18547
1366.6I3271416j39081j84751k22420m81278q14420j105088j452404j710892j960719
1384.9H5200363k722525l735024m146296l590250n80573M461837P462704O369209L696663
1403.3I2416108J905942O93118p8380n61052q68124j021070j434618k261716k592933
1421.6H6197275k972871l626579l625238k628631P7868L254098N489814M994523J960940
1440H9121199l46327k168167m914498p587791l846186M345566Q122689P173478M179412
1458.3I4079375J325912L69000O1649j47372k46668m13257p48497o52421p1299J03021
$$ y = [95012826, 94385213, 93525875, 92415738, 91003090, 89503628, 88463861, 87899643, 87593240, 88030022, 89257401, 90174174, 90119600, 89667487, 89724588, 90527624, 91639131, 92603797, 93152869, 93271416, 93132335, 92947584, 92725164, 92243886, 91429466, 90324378, 88871974, 87161082, 85200363, 82477838, 78742814, 74596518, 71006268, 70425695, 74887532, 82350236, 88719445, 92416108, 94322050, 95015168, 94936788, 94375736, 93507612, 92486542, 91051924, 88790208, 86197275, 83224404, 79597825, 75972587, 73343956, 73421824, 76675922, 82165736, 87160259, 89121199, 88774872, 86606705, 81692207, 74104416, 70258230, 74603796, 82726485, 89899963, 94079375, 95405287, 95774287, 95835936, 95688564, 95441896, 95028639, 94280142, 93627721, 93556422, 93659443]
1478.7I3659443l47126j165306j987404l033519m769385o320929n713862k133114N997980
1497.1G4186778J1618233Q219492L589434J518124O46663K8139l0529M7850J00255
1515.4I9924439P5561j2690j30296k21186k47992k53576j91193j82051k97505k58034
1535.8I8205477j17099k01023l79139l29667k51323j80203k09457k57939j89763k8748
1556.2I6061116j6123l55714l75664l11786l75223o57148j057332j158137k197539
1574.6H9556450m547418k703464K206922L972966J661717j074963k677918m163831
1590.9H2230461m899454k860457J198965L531820L878975L919118L126729J519364
1607.2I1645521K62451l20387n27203o92224q06982m81897j59115j19424k27934l18485
$$ y = [93659443, 93312317, 92147011, 90159607, 87126088, 82356703, 76035774, 70321912, 68188798, 74186778, 85805011, 94024503, 97613937, 99132061, 99778724, 99806863, 99776334, 99824184, 99924439, 100000000, 99987310, 99857014, 99635828, 99387836, 99134260, 98943067, 98761016, 98463511, 98205477, 98088378, 97887355, 97508216, 97178549, 96927226, 96747023, 96537566, 96279627, 96089864, 96061116, 96044993, 95689279, 95313615, 95001829, 94626606, 93969458, 92912126, 91753989, 89556450, 85009032, 82305568, 84512490, 88485456, 90147173, 89072210, 86394292, 82230461, 77331007, 74470550, 75669515, 79201335, 83080310, 86999428, 90126157, 91645521, 91907972, 91587585, 91060382, 90368158, 89561176, 89079279, 88920164, 88800740, 88572806, 88254321]
1627.6H8254321l18259j94371q7291k44391n29444n78004n29051m92543m93580k30712
1648H4556675J95414L27366j9502l43710m13520o31934j216829j717859j734865k176803
1668.4G6824433l017390k864498k523339k402913k625198l739661n674755o761959
1684.7D7214720k295629K507860N032527N369968N410635N669659N725062O227631
1701.1H0862433M331398K928185K487225J643943J166094J106131J217723J254588
1717.4I6997720Q43829M26185L11267K75493K28578K39509K44081J58274Q452j490
1737.8I9731898J0813J8227O0653P9096P9035K0278p5364r0313p2014j13780j28317
1760.2I9520212j48099j72806j16807n991K5243j41323k91395k91103k79415k91442
$$ y = [88254321, 87936062, 87741691, 87654400, 87410009, 86880565, 86302561, 85773510, 85280967, 84787387, 84556675, 84752089, 85079455, 85059953, 84716243, 84302723, 83670789, 82453960, 80736101, 79001236, 76824433, 73807043, 70942545, 68419206, 66016293, 63391095, 59651434, 53976679, 47214720, 44919091, 47426951, 52459478, 57829446, 63240081, 68909740, 74634802, 80862433, 85193831, 88122016, 90609241, 92253184, 93419278, 94525409, 95743132, 96997720, 97841549, 98267734, 98579001, 98854494, 99083072, 99322581, 99566662, 99724936, 99733388, 99731898, 99742711, 99760938, 99821591, 99900687, 99979722, 100000000, 99924636, 99834323, 99762309, 99648529, 99520212, 99372113, 99199307, 99082500, 99076509, 99101752, 98960429, 98669034, 98377931, 98098516, 97807074]
1780.6I7807074k52027j16026J22064L94070O05435O24555L90333J88398R2441N823
1801I9862140n9181j9878M0692L9071P957k4527o2281r1970j18053j51539j64139j46532
1825.5I9111760n7918P0953J06496L5435p963J5646N1689O1119K2101l5065j9080K1553
1850I9376726K1207K5774N7548N7393K4331K169r775P796L0745k2853p3171n5891m8101
1876.5I9393898p6478r0951j01519j21194j09005j19835j99187k51794l03358m28462
1896.9I7592115o01047q69745j201147j109791j40130J015150J194269P14922N74589
1915.2I7169185P20340O10840K65360O908j21438j91200j52606N4187K34532K44033
1935.6I8840141J78081J13160O1094K2161j3697k9099j4067j9717n8049q9478j35678
$$ y = [97807074, 97555047, 97439021, 97561085, 97955155, 98560590, 99185145, 99575478, 99763876, 99856317, 99862140, 99802959, 99783081, 99823773, 99862844, 99870801, 99846274, 99783993, 99692023, 99573970, 99422431, 99258292, 99111760, 99053842, 99124795, 99231291, 99266726, 99258763, 99274409, 99326098, 99387217, 99409318, 99374253, 99355173, 99376726, 99397933, 99423707, 99481255, 99538648, 99562979, 99565148, 99555373, 99563169, 99593914, 99571061, 99497890, 99441999, 99393898, 99317420, 99226469, 99124950, 99003756, 98894751, 98774916, 98575729, 98323935, 98020577, 97592115, 96991068, 96121323, 94920176, 93810385, 93670255, 94685405, 95879674, 96594596, 97169185, 97889525, 98500365, 98765725, 98772633, 98651195, 98459995, 98307389, 98361576, 98596108, 98840141, 99018222, 99131382, 99192476, 99214637, 99200940, 99171841, 99157774, 99138057, 99080008, 98990530, 98854852]
1958.1I8854852j68640q4996N4580P3814m6664k18773m16404n94544n55843j22256
1978.5I6775126M46642O67512M91172K05851l0077k17098k79927j17069J26117K67500
1998.8I8335749K70456J63072N0783R084N72M274J9175P230k5415m0716n6470q8906
2023.3I8648888o9082L3510R7829P2765K5505q315q541N436R77n674j1903k4027j6820
2049.8I8740548l713l553J3012L2311K0540Q893J0574j150q178j609n448p403J490
2076.4I8796314l016o825O259R942R227J8835J2320n013l630l814j3006j0812j1188
2102.9I8795593k3312k6947k9367m3100m8685m2492k4575J8835N6952N4330L9345L0720
2127.3I8757297J8984K0009L1269K4825J2738J4996J1104J705N692P320N269J1909
$$ y = [98854852, 98686212, 98601216, 98655796, 98729610, 98682946, 98464173, 98047769, 97453225, 96897382, 96775126, 97221768, 97889280, 98380452, 98586303, 98556226, 98339128, 98059201, 97942132, 98068249, 98335749, 98606205, 98769277, 98820060, 98829144, 98829716, 98833990, 98853165, 98860395, 98834980, 98794264, 98737794, 98648888, 98579806, 98613316, 98711145, 98783910, 98809415, 98801100, 98792559, 98797995, 98798972, 98793298, 98781395, 98757368, 98740548, 98736835, 98733282, 98746294, 98778605, 98799145, 98808038, 98818612, 98817462, 98809284, 98807675, 98802227, 98794824, 98796314, 98793298, 98786473, 98792732, 98802674, 98811901, 98830736, 98843056, 98838043, 98834413, 98830599, 98817593, 98806781, 98795593, 98772281, 98745334, 98715967, 98672867, 98624182, 98581690, 98557115, 98575950, 98632902, 98687232, 98726577, 98757297, 98776281, 98796290, 98827559, 98852384, 98865122, 98880118, 98891222, 98892927, 98898619, 98905939, 98911208, 98923117]
2151.8I8923117M399j3155p570L720J72J234k360j8752j1778L988m143p909k176r304
2180.4I8859483j7077k8705n0718m4382p075K0785L5846M0304J9455l498j0312k5922
2204.8I8788184m3631m2069l9732l7515k4432k4831l8028l7366k9672j0520L6520P0882
2229.3I8567790O3199M4840K8271J4299J8334J6946p934k4163k9177l4994j9121O783
2253.8I8645073P153K324J3948K0504K0605J3882j9169n6505p5746r2989r3156n6964
2278.3I8328960j1206L6234P6145O4909K4337J4299K1786K1797K9409L8922L7217L3826
2302.7I8716635J5681j9186l7796n3477q5318q2642l9541k9433n4938k3991O1852Q6844
2327.2I8454690L1710m3726j03939j40071j32572l9387J04391J85210J78337J35070
$$ y = [98923117, 98927516, 98914361, 98906791, 98910511, 98910683, 98911917, 98909557, 98890805, 98879027, 98883015, 98878872, 98870963, 98868787, 98859483, 98842406, 98813701, 98762983, 98718601, 98711526, 98732311, 98768157, 98808461, 98827916, 98824418, 98814106, 98788184, 98744553, 98702484, 98662752, 98625237, 98600805, 98575974, 98537946, 98500580, 98470908, 98460388, 98496908, 98567790, 98630989, 98675829, 98704100, 98718399, 98736733, 98753679, 98745745, 98721582, 98692405, 98657411, 98638290, 98645073, 98652226, 98654550, 98668498, 98689002, 98709607, 98723489, 98704320, 98647815, 98572069, 98479080, 98385924, 98328960, 98317754, 98353988, 98430133, 98495042, 98519379, 98533678, 98555464, 98577261, 98606670, 98645592, 98682809, 98716635, 98732316, 98713130, 98675334, 98621857, 98536539, 98453897, 98414356, 98384923, 98329985, 98305994, 98367846, 98454690, 98486400, 98442674, 98338735, 98198664, 98066092, 98026705, 98131096, 98316306, 98494643, 98629713]
2347.6I8629713O4570j6833n8525m9419l7503k5511j8650j6206O258K7841L8714N6302
2372.1I8600751O0684M3374L3361J8072k0522n3966o7568n5689m082M0066K0128k6750
2396.6I8587859n6869o7538l7730K0099M9257N1695N4735M2796K4742K0635Q655n794
2421I8692542L106J0425N656R072L260j7953k5052k2345j6284J3900L9660K9004J1206
2447.6I8736197o128l4880m7267l9118l0279k718L1763L8654M1419M7380L0666J2469
2472I8778158M644j2148j4764K772j413j8108j8561k1970k2495J967K4635L4284M0305
2498.5I8777306K3097k790j96O205j252L391O891r72N758P778j4871k3973j1772k164
2527.1I8772436J1748J7828l51j0127m721j0401j3834j0544k0492j9831m05L28r477
$$ y = [98629713, 98694283, 98677450, 98618925, 98569506, 98532003, 98506492, 98487842, 98471636, 98477894, 98505735, 98544449, 98600751, 98661435, 98704809, 98738170, 98756242, 98735720, 98681754, 98614186, 98558497, 98554415, 98594481, 98614609, 98587859, 98530990, 98463452, 98425722, 98445821, 98495078, 98546773, 98601508, 98644304, 98669046, 98689681, 98698336, 98692542, 98695648, 98706073, 98711729, 98720801, 98724061, 98706108, 98681056, 98658711, 98642427, 98656327, 98695987, 98724991, 98736197, 98730069, 98695189, 98647922, 98608804, 98578525, 98575807, 98607570, 98646224, 98687643, 98735023, 98765689, 98778158, 98782802, 98770654, 98755890, 98758662, 98757249, 98739141, 98720580, 98698610, 98676115, 98678082, 98702717, 98737001, 98777306, 98800403, 98797613, 98797417, 98803622, 98802370, 98805761, 98812652, 98811680, 98817438, 98825216, 98810345, 98786372, 98774600, 98772436, 98784184, 98802012, 98801661, 98791534, 98786813, 98776412, 98762578, 98752034, 98731542, 98711711, 98711306, 98711634, 98702157]
2553.6I8702157j0473k3717l8302l6525m5592o2442n9813m5329j8877K2006M4316M2927
2578.1I8470336M4006L3295N675p683j0872q237J5991K6507K020j5628k6131m9972
2602.6I8479307n8490l9924r048L2247O5344P2104P0542N6851J5241j5700j1069P517
2627I8664922L3760N1850L5411J0842Q9j8978l2258k1577k1696l4410k3329K206J9013
2653.5I8665845K4182M816l1882n4378o1232m7940l498L7485N3686O0057N2095L0661
2678I8729897J2576j0669l2318k1100M006J0305R299L010j3537j6361o759m572K796
2704.5I8666573J3452M262j3322k0533k5201k5988k1261k7209k9213j2445p886j2642
2729I8488587o580j4359k0969Q166L7289L8349L1746K2232N961r305j9151j4078P111
$$ y = [98702157, 98691684, 98667967, 98629665, 98593140, 98547548, 98485106, 98425293, 98379964, 98361087, 98383093, 98427409, 98470336, 98514342, 98547637, 98553312, 98545629, 98534757, 98526520, 98542511, 98569018, 98571038, 98555410, 98529279, 98479307, 98420817, 98380893, 98371845, 98404092, 98469436, 98541540, 98612082, 98668933, 98684174, 98668474, 98657405, 98664922, 98698682, 98750532, 98785943, 98796785, 98796874, 98777896, 98745638, 98724061, 98702365, 98667955, 98644626, 98646832, 98665845, 98690027, 98694843, 98662961, 98608583, 98547351, 98499411, 98495913, 98533398, 98587084, 98647141, 98699236, 98729897, 98742473, 98731804, 98699486, 98678386, 98682392, 98692697, 98701996, 98705006, 98691469, 98675108, 98668349, 98663777, 98666573, 98680025, 98684287, 98670965, 98650432, 98625231, 98599243, 98577982, 98550773, 98521560, 98509115, 98501229, 98488587, 98482007, 98467648, 98446679, 98454845, 98492134, 98530483, 98562229, 98584461, 98590422, 98581117, 98561966, 98547888, 98554999]
2755.5I8554999R602j3870k9391l8940m8882l8874j7398n114Q392K2572K1130R763
2780I8433989r125m1139p2205r7472j18500q2028L5751J29229J10471L1132k0099j5754
2804.5I8284250J0789J6147m739k5928l4666m0656m5502m6748l8702j1664K3353M9192
2828.9I8135126N7381M3005J8835J854k7377o9380q4167q1915q9502q3161m3410J0497
2853.4I7787786N3072P0035O0505M0781J9419m851k0910k2954k4312m0299o6203p6538
2877.9I7775531n9080l4225k3067j6553o532k545J931J3226K2167K7341K0772j1080
2902.4I7707886m2165m4364m0000m3714m8000o3807q5222q8877q0180o5285l9023o783
2926.8I7060466J2624M125n400Q922L5322N5814O5434O7389M6134j37k9677k5541k9910
$$ y = [98554999, 98564601, 98550731, 98521340, 98482400, 98433518, 98394644, 98377246, 98372132, 98380524, 98403096, 98424226, 98433989, 98424864, 98383725, 98311520, 98214048, 98095548, 98013520, 98049271, 98178500, 98288971, 98320103, 98300004, 98284250, 98295039, 98311186, 98306447, 98280519, 98245853, 98205197, 98159695, 98112947, 98074245, 98062581, 98085934, 98135126, 98192507, 98235512, 98254347, 98256201, 98228824, 98159444, 98075277, 97993362, 97903860, 97820699, 97777289, 97787786, 97840858, 97910893, 97971398, 98012179, 98031598, 98026747, 98005837, 97982883, 97958571, 97918272, 97852069, 97775531, 97716451, 97682226, 97659159, 97642606, 97636074, 97633529, 97635460, 97648686, 97670853, 97698194, 97718966, 97707886, 97665721, 97621357, 97581357, 97537643, 97489643, 97425836, 97340614, 97251737, 97171557, 97106272, 97067249, 97060466, 97073090, 97077215, 97071815, 97080737, 97116059, 97171873, 97237307, 97304696, 97350830, 97350693, 97321016, 97295475, 97265565]
2953.4I7265565m6593m1770l3468l9262m8852n8949o1119m9322k6781K50J9783J7637
2977.8I6897119j0365m4543n9270m6009k0862j7363m6330r1273j50198k32440l15046
3000.3I5863420l43085k67511j10561L28m0990k23237n07814q35133r82225o71529
3020.7I1881663O866N45871O12718L39449p6390n88381j010686q00711K85566J383769
3041.1I2579734J519597R01019K31851k14464m15164l41058j59293j57279k82377k84207
3061.5I3378359j22076J33002L83812M45199K80094J24812J45656K13492J44505k5111
3081.9I5101744j46878k07209l03829m14312l60698j25438O6072J53530K86573M34119
3102.2I4483674M55069L79580K95347K13069J60784J53339J31416P8082K2072k0385
$$ y = [97265565, 97218972, 97177202, 97143734, 97104472, 97055620, 96996671, 96935552, 96886230, 96859449, 96859699, 96879482, 96897119, 96886754, 96842211, 96782941, 96736932, 96716070, 96698707, 96652377, 96561104, 96410906, 96178466, 95863420, 95520335, 95252824, 95142263, 95142591, 95101601, 94878364, 94370550, 93535417, 92553192, 91881663, 91888529, 92434400, 93047118, 93386567, 93310177, 92721796, 91711110, 90910399, 91195965, 92579734, 94099331, 95000350, 95232201, 95017737, 94602573, 94261515, 94102222, 93944943, 93662566, 93378359, 93256283, 93389285, 93773097, 94218296, 94498390, 94623202, 94768858, 94982350, 95126855, 95101744, 94954866, 94747657, 94443828, 94029516, 93668818, 93543380, 93609452, 93762982, 94049555, 94483674, 94938743, 95318323, 95613670, 95826739, 95987523, 96140862, 96272278, 96350360, 96372432, 96352047]
3122.6I6352047k8962j663K0504K092k2322j2338J5819K1702q911l0112j7828n525
3147.1I6284503P98N150j3947l5155k2250r186k7525m6533m6206m3618m6081m8768
3171.6I5951182n5170n9271n2405m0924k9016k1201k3675k2113j0205j2171l2431m8715
3196.1I5543885n8764o7413o9767p1102p5001p8785q4025q7506q9746r3347r6691r9557
3220.5I4572181r7055r3662r4998r0677p4285o6757r3401j20556j12188r3883q0186
3243I3554533o4975o8415r2768r9731q5193q3464r8163j06007j04618r3991o6447k9641
3267.5I2561120n126k0683n9748q4936r3526q5974p1478o4247o1650n8281m8506m5979
3291.9I1860986o9458j05762j33002j32245j06465r1905j11586j53571j88881j98049
$$ y = [96352047, 96323085, 96321422, 96341926, 96344018, 96321696, 96309358, 96325177, 96346879, 96337968, 96307856, 96290028, 96284503, 96285301, 96290451, 96276504, 96241349, 96219099, 96209913, 96182388, 96135855, 96089649, 96046031, 95999950, 95951182, 95896012, 95836741, 95784336, 95743412, 95714396, 95693195, 95669520, 95647407, 95637202, 95625031, 95592600, 95543885, 95485121, 95417708, 95347941, 95276839, 95201838, 95123053, 95039028, 94951522, 94861776, 94768429, 94671738, 94572181, 94475126, 94381464, 94286466, 94195789, 94121504, 94054747, 93961346, 93840790, 93728602, 93634719, 93554533, 93489558, 93421143, 93328375, 93228644, 93143451, 93059987, 92961824, 92855817, 92751199, 92657208, 92590761, 92561120, 92555994, 92535311, 92475563, 92390627, 92297101, 92211127, 92139649, 92075402, 92013752, 91955471, 91906965, 91860986, 91791528, 91685766, 91552764, 91420519, 91314054, 91222149, 91110563, 90956992, 90768111, 90570062]
3312.3I0570062j88160j83790j90092j91181j89901k03180k31642k54553k62106k63291
3332.7H8412166k61939k69395l01582l42959l79979m26335m79865n31643n70154n35077
3353.1H4313238l69996j42592q834k0921q9222j35851j57952j72323j94681k34842
3373.5H2786024k71374k79969k70605k58410k49130k46131k37197k20472k15619k21831
3393.9H0315286k14553j88637j73980j95443k18666j94287j51992j36650j37567j43606
3414.3G8559905j41608j15473r3108q8686o9487l2472j0139j3101l565K0689O819k7931
3438.8G7991843k3675J5486N5199P4095P0578P3707Q7273R2435J12945J45662J39880
3461.2G8835428J30760J62757J75458J27190P4691Q5580J32150J63930J62560J23793
$$ y = [90570062, 90381902, 90198112, 90008020, 89816839, 89626938, 89423758, 89192116, 88937563, 88675457, 88412166, 88150227, 87880832, 87579250, 87236291, 86856312, 86429977, 85950112, 85418469, 84848315, 84313238, 83943242, 83800650, 83791816, 83770895, 83681673, 83545822, 83387870, 83215547, 83020866, 82786024, 82514650, 82234681, 81964076, 81705666, 81456536, 81210405, 80973208, 80752736, 80537117, 80315286, 80100733, 79912096, 79738116, 79542673, 79324007, 79129720, 78977728, 78841078, 78703511, 78559905, 78418297, 78302824, 78209716, 78121030, 78051543, 78019071, 78008932, 77995831, 77992266, 78012955, 78019774, 77991843, 77968168, 77983654, 78038853, 78112948, 78183526, 78257233, 78344506, 78436941, 78549886, 78695548, 78835428, 78966188, 79128945, 79304403, 79431593, 79506284, 79591864, 79724014, 79887944, 80050504, 80174297]
3481.6H0174297J07926J41758J55973J41865J45746J63632J74851J74343J81204J85538
3502H1747133J48725J21218J47843J86253K12795K06428J76335J76590K12735K50674
3522.4H3586729K35283J78659J59603J84071K20794K53951K49690K20406K33174K70092
3542.8H5792452K53207J78158J48344J83886K02221K00105K21920K55155K66785K58314
3563.2H7960547K52652K48689K23207K04581K25044K60156K75117K89416L16340L32880
3583.6I0588629L20155K75689K50119K63315K79224K91098L06290L00550K76626K75248
3604I3426943K86799K87295K74366K67065K66236K42698K21807K22951K12425K13140
3624.4I5921725K18201J97977J65134J39439J34552J35690J31780J31964J41812J59734
$$ y = [80174297, 80282223, 80423981, 80579954, 80721819, 80867565, 81031197, 81206048, 81380391, 81561595, 81747133, 81895858, 82017076, 82164919, 82351172, 82563967, 82770395, 82946730, 83123320, 83336055, 83586729, 83822012, 84000671, 84160274, 84344345, 84565139, 84819090, 85068780, 85289186, 85522360, 85792452, 86045659, 86223817, 86372161, 86556047, 86758268, 86958373, 87180293, 87435448, 87702233, 87960547, 88213199, 88461888, 88685095, 88889676, 89114720, 89374876, 89649993, 89939409, 90255749, 90588629, 90908784, 91184473, 91434592, 91697907, 91977131, 92268229, 92574519, 92875069, 93151695, 93426943, 93713742, 94001037, 94275403, 94542468, 94808704, 95051402, 95273209, 95496160, 95708585, 95921725, 96139926, 96337903, 96503037, 96642476, 96777028, 96912718, 97044498, 97176462, 97318274, 97478008]
3644.8I7478008J63740J16152M3082M2886Q2623J15753J02049L6377k045M4340J04249
3667.2I8327214J07014R9337Q1777J461n1833k8342M149N0592J07825J40679Q2350
3689.6I8922223J0055K9624N3084N8215O4707M6110K3860L9166N5808J4717m3774j4639
3714.1I9259156L2729M5884M5889L7760J5354N30K1160O1566R6482P3641N579r65J7410
3740.6I9712175r686k1374L8403L0756k9754j9473K6834L5477K491j9109O175L2765
3765.1I9785680K4890k0372m7785j7053L1823N4681J9252k7340k4158j3471j3429n793
3789.6I9746925L022J0234K0420K9940O616k7997k0730m1795p1883l1459K6947M7618
3814.1I9697858M3380M6844P748l9816j3619K3514L5143K9033M0680O4558L6651k4426
$$ y = [97478008, 97641748, 97757900, 97800982, 97843868, 97926491, 98042244, 98144293, 98180670, 98178625, 98222965, 98327214, 98434228, 98533565, 98615342, 98616803, 98564970, 98536628, 98540777, 98591369, 98699194, 98839873, 98922223, 98932278, 98961902, 99014986, 99073201, 99137908, 99184018, 99207878, 99247044, 99302852, 99317569, 99273795, 99259156, 99291885, 99337769, 99383658, 99421418, 99436772, 99437302, 99458462, 99520028, 99616510, 99690151, 99695730, 99694765, 99712175, 99702489, 99681115, 99719518, 99750274, 99720520, 99701047, 99727881, 99763358, 99765849, 99746740, 99752915, 99785680, 99810570, 99790198, 99742413, 99725360, 99757183, 99811864, 99831116, 99803776, 99779618, 99766147, 99752718, 99746925, 99749947, 99760181, 99780601, 99810541, 99817157, 99789160, 99768430, 99726635, 99654752, 99623293, 99650240, 99697858, 99741238, 99788082, 99795830, 99756014, 99742395, 99765909, 99801052, 99830085, 99870765, 99935323, 99971974, 99947548]
3838.5I9947548m3410l7271j2684L5197P6765O8008m3755j05083j9342K0462K4998
3861I9911433J0670J949J0574j3626l7026l8970l1549n000j860r263j6975n2911o2841
3887.5I9664605m7171m8054k0551L3640O5041P0578M9060l27k9010j3661Q577K3407
3912I9756134L5262L7819K6822J9252J4115n502r149J1343J3530j455m971N556K1147
3938.5I9919903K7913K0617J6672J4895N853L326J0359J0634N007L016m268r906l672
3965A00020349r18k515k647j275L326O509K384K02O581M625l159j299l517j9896k9480
3995.6I9979270j7918
3997.6I9961352
$$ y = [99947548, 99904138, 99866867, 99854183, 99889380, 99966145, 100034153, 99990398, 99885315, 99865973, 99886435, 99911433, 99922103, 99924052, 99934626, 99921000, 99883974, 99845004, 99813455, 99808455, 99806595, 99797332, 99780357, 99727446, 99664605, 99617434, 99569380, 99548829, 99582469, 99647510, 99718088, 99767148, 99766821, 99737811, 99724150, 99732727, 99756134, 99791396, 99829215, 99856037, 99875289, 99889404, 99883902, 99874753, 99886096, 99899626, 99898171, 99893200, 99898756, 99919903, 99947816, 99968433, 99985105, 100000000, 100005853, 100009179, 100019538, 100030172, 100035179, 100038195, 100033927, 100024021, 100020349, 100019431, 100016916, 100014269, 100012994, 100016320, 100022829, 100025213, 100025415, 100031996, 100036621, 100033462, 100032163, 100028646, 100008750, 99979270, 99961352]
##END=$$ End of the data block
