##TITLE=JOLY $$ Begin of the data block
##JCAMP-DX=5.00 $$ ACD/SpecManager v 10.08
##SPECTROMETER/DATA SYSTEM=Alpha
##DATE=12 Mar 2014 10:59:36
##DATA TYPE=INFRARED SPECTRUM
##DATA CLASS=XYDATA
##ORIGIN=
##OWNER=
##NPOINTS=1765
##FIRSTX=399.75695801
##LASTX=3997.56933594
##MAXX=3997.56933594
##MINX=399.75695801
##MAXY=0.84101033
##MINY=0.41832429
##XFACTOR=1.0000000000
##YFACTOR=1.000000000000000e-9
##FIRSTY=0.67005074
##DELTAX=2.03957629
##XUNITS=1/CM
##YUNITS=ARBITRARY UNITS
##XYDATA=(X++(Y..Y))
399.8F70050740n27918l72112j12772m42207j349866j411438l52562J967j093030j519441
$$ 670050740 669522822 669150710 669037938 668595731 667245865 665834427 665481865 665483832 664390802 662871361
420.2F62871361k79248j729q32617q99792j88112j96278p93159m91917N40853M08232
$$ 662871361 662592113 662590384 661757767 660857975 660669863 660473585 659680426 659188509 659729362 660137594
440.5F60137594r24170j416862n74231M4226k99215q73387p01785l72469p48635q62837
$$ 660137594 659213424 657796562 657222331 657266557 656967342 656093955 655392170 655019701 654271066 653408229
460.9F53408229k52962J37747l08097q02576m60387P3552o1690n01812m75705j57833
$$ 653408229 653155267 653293014 652984917 652182341 651721954 651795506 651733816 651232004 650756299 650598466
481.3F50598466l57508p94530m66407J60099L099p13885r86278m04775J14918l08574
$$ 650598466 650240958 649446428 648980021 649140120 649143219 648429334 647443056 647038281 647153199 646844625
501.7F46844625o76751j40667O9499o76930j198947p11262j42873o23762j175523n50687
$$ 646844625 646167874 646027207 646096706 645419776 644220829 643509567 643366694 642742932 641567409 641016722
522.1F41016722J59085k44678q77618m86911K94865K14338l97563j66714N61952K51532
$$ 641016722 641175807 640931129 640053511 639566600 639861465 640075803 639678240 639511526 640073478 640325010
542.5F40325010p66277r33528m06087n95868j436531j565814q56817n45442p89285
$$ 640325010 639558733 638625205 638219118 637623250 636186719 634620905 633764088 633218646 632429361
560.9F32429361n97059K801m5359p89523j055181m56095o5863m54486o38246m3273
$$ 632429361 631832302 631835103 631789744 631000221 629945040 629488945 629423082 628968596 628330350 628287077
581.3F28287077M95195K26617k17259m2498K34842j09851p49171r59634p31767m95493
$$ 628287077 628782272 629008889 628791630 628749132 628983974 628874123 628124952 627165318 626433551 625938058
601.7F25938058j79291L99828R40323J210928J188755J146078J361489J627386J729131
$$ 625938058 625758767 626158595 627098918 628309846 629498601 630644679 632006168 633633554 635362685
620F35362685J805603K036691K287030K235830J953006K012312K397180K344250J881719
$$ 635362685 637168288 639204979 641492009 643727839 645680845 647693157 650090337 652434587 654316306
638.4F54316306J800418K029836J851559J218498Q25524R94801J094461O08802M3213
$$ 654316306 656116724 658146560 659998119 661216617 662042141 663036942 664131403 664740205 664783418
656.7F64783418o5446k25663r85145j674712j793623l0995K556324L330648L755987
$$ 664783418 664717972 664492309 663507164 661832452 660038829 660007834 662564158 665894806 669650793
675.1F69650793M124999L796756K792418K262235K508819K443135J739860J403987
$$ 669650793 673775792 677572548 680364966 682627201 685136020 687579155 689319015 690723002
691.4F90723002J690209J688063J021862O59466J140356J488447R81271M73202O99818
$$ 690723002 692413211 694101274 695123136 695782602 696922958 698411405 699392676 699865878 700565696
709.8G00565696J077592Q92580N55455R64225J625001J458645R44555J213491J831174
$$ 700565696 701643288 702535868 703091323 704055548 705680549 707139194 708083749 709297240 711128414
728.1G11128414J679122R76324Q25286J248598J193822O19888M72903Q63314R44257
$$ 711128414 712807536 713783860 714609146 715857744 717051566 717671454 718144357 719007671 719951928
746.5G19951928N72979M33028P23779R30309P65741O90341J055420J398503J245201
$$ 719951928 720524907 720957935 721681714 722612023 723377764 724068105 725123525 726522028 727767229
764.8G27767229R90212J047254J144290R46164O11007M35650L25561j669n41687r51827
$$ 727767229 728757441 729804695 730948985 731895149 732506156 732941806 733267367 733265698 732724011 731772184
785.2G31772184q91447l86059J57952M28975M25935L01957J15156j81198n18978p02262
$$ 731772184 730880737 730494678 730652630 731081605 731507540 731809497 731924653 731743455 731224477 730522215
805.6G30522215p14302q30471j107574j158058q08537n28694n14745k21014N16355
$$ 730522215 729807913 728977442 727869868 726711810 725903273 725374579 724859834 724638820 725155175
824G25155175J030504J037717J124144J619279J912713J521230J125157J356602J655578
$$ 725155175 726185679 727223396 728347540 729966819 731879532 733400762 734525919 735882521 737538099
842.3G37538099J429498J216472J782953K672673K834081K414704K358675K493918
$$ 737538099 738967597 740184069 741967022 744639695 747473776 749888480 752247155 754741073
858.7G54741073J947283R81987N46515N39243j5914j179159j773894j420975j223266
$$ 754741073 756688356 757670343 758216858 758756101 758740187 757561028 755787134 754366159 753142893
877G53142893j720071k065956j761437j475393j660526j699865j080990m54366m92334
$$ 753142893 751422822 749356866 747595429 746120036 744459510 742759645 741678655 741224289 740731955
895.4G40731955o07253r3936M12583J09851n01036o12855n44906j020074j746654j988769
$$ 740731955 740124702 740030766 740443349 740553200 740052164 739439309 738894403 737874329 736127675 734138906
915.8G34138906j852572k034306k578974k755881k275943j624823j157880p68602m78208
$$ 734138906 732286334 730252028 727673054 724917173 722641230 721016407 719858527 719089925 718611717
934.1G18611717o92725j581609k561212k956271k875924k843916k870381k631367k323567
$$ 718611717 717918992 716337383 713776171 710819900 707943976 705100060 702229679 699598312 697274745
952.5F97274745k519489l256380l932596m244029m528761n022347n438745n538106
$$ 697274745 694755256 691498876 687566280 683322251 678793490 673771143 668332398 662794292
968.8F62794292n637527o104469o740212p189453p616103q281767q830070q684278
$$ 662794292 657156765 651052296 644312084 637122631 629506528 621224761 612394691 603710413
985.1F03710413q010507p549464p328511o652772n344510l939450k899170k190471
$$ 603710413 595699906 588150442 580821931 574169159 568824649 564885199 561986029 559795558
1001.4E59795558j601874j256049j519382k325654l073812l519475m095256m945815
$$ 559795558 558193684 556937635 555418253 553092599 550018787 546499312 542404056 537458241
1017.7E37458241n629718n941749o124616o193757n826711n074919m225850l112018
$$ 537458241 531828523 525886774 519762158 513568401 507741690 502666771 498440921 495328903
1034.1D95328903j483202K46167J277030J315504Q76338N40107K60741k96176j004010
$$ 495328903 493845701 494091868 495368898 496684402 497560740 498100847 498361588 498065412 497061402
1052.4D97061402j347006j137763m60953O32883J837492K497941K206087J285851N13017
$$ 497061402 495714396 494576633 494115680 494748563 496586055 499083996 501290083 502575934 503088951
1070.8E03088951L01957M31895P03395J283228K193928L034234L527641L825188M184723
$$ 503088951 503390908 503822803 504526198 505809426 508003354 511037588 514565229 518390417 522575140
1089.1E22575140M486322M291475L533483K588331J627863M98414o70433j384974j402020
$$ 522575140 527061462 531352937 534886420 537474751 539102614 539601028 538930595 537545621 536143601
1107.5E36143601r00209M0233J427651K847969L736377M016161M120111M432381M816412
$$ 536143601 535243392 535283625 536711276 539559245 543295622 547311783 551431894 555864275 560680687
1125.8E60680687M844249M436552L817320L090203K223015J309156O92070M87148L21448
$$ 560680687 565524936 569961488 573778808 576869011 579092026 580401182 581093252 581580400 581901848
1144.2E81901848p2062n08785q34942j187861j650691j964807j810313j245617m05550
$$ 581901848 581829786 581321001 580486059 579298198 577647507 575682700 573872387 572626770 572221220
1162.6E72221220Q58962K530336M072547M984498N377353N683601N948185N839170
$$ 572221220 573080182 575610518 579683065 584667563 590044916 595728517 601676702 607515872
1178.9F07515872N287766M620135L987670L127694J971662R02176K01046k62499o79612
$$ 607515872 612803638 617423773 621411443 624539137 626510799 627412975 627614021 627351522 626671910
1197.2F26671910q74519n81086l218M67062Q21054J204431J484275J462638J281321
$$ 626671910 625797391 625216305 625213087 625680149 626501203 627705634 629189909 630652547 631933868
1215.6F31933868J282453J520217J643658J438439J156091J009643Q14140M25339P7128
$$ 631933868 633216321 634736538 636380196 637818635 638974726 639984369 640798509 641223848 641300976
1233.9F41300976n2988j61648m28855p17760q17656p67648p47085o92785l93927L6776
$$ 641300976 641247988 641086340 640657485 639939725 639122069 638354421 637607336 636914551 636520624 636557400
1254.3F36557400K79904L39508N28752R32634J241148J291454J309037J439869J513601
$$ 636557400 636837304 637176812 637705564 638638198 639879346 641170800 642479837 643919706 645433307
1272.7F45433307J417815J301527J322866J497030J697540J811147J862407J819312
$$ 645433307 646851122 648152649 649475515 650972545 652670085 654481232 656343639 658162951
1289F58162951J574874J292229J224458J222015R64939N10037J77086p16k72810o34372
$$ 658162951 659737825 661030054 662254512 663476527 664441466 664951503 665128589 665127873 664855063 664220691
1309.4F64220691p51853m78924k801M99725R67682J288056J316071J027226O01709
$$ 664220691 663468838 662989914 662987113 663486838 664454520 665742576 667058647 668085873 668687582
1327.8F68687582K28524j23620m17769m59730k65062o9797P391L5941O9440K4736k61784
$$ 668687582 668916106 668792486 668374717 667914987 667649925 667580128 667587519 667623460 667692900 667717636 667455852
1350.2F67455852o47247q30173p98822p92980r37939j064300r44376q24750q72552
$$ 667455852 666808605 665978432 665179610 664386630 663448691 662384391 661440015 660615265 659742713
1368.5F59742713n59330J27435P14957J127184J484156J684427J780987K149999K662539
$$ 659742713 659183383 659310818 660025775 661152959 662637115 664321542 666102529 668252528 670915067
1386.9F70915067K690494K212584J648009J106024P38799M31359J86801Q3030k7419
$$ 670915067 673605561 675818145 677466154 678572178 679310977 679742336 679929137 680012167 679984748
1405.3F79984748n3882q2553j40190J550K45809P8261m10199k66254N1022O8366R5666
$$ 679984748 679930866 679848313 679708123 679709673 679955482 680033743 679623544 679357290 679408312 679476678 679572344
1427.7F79572344R5904K35676M23432M1425n26190n46932p93636j327395j713157j915216
$$ 679572344 679668248 679903924 680327356 680368781 679842591 679295659 678502023 677174628 675461471 673546255
1448.1F73546255j595974q98004l21269l44098m93228L14593J000762J378179K036869
$$ 673546255 671950281 671052277 670731008 670386910 669893682 670208275 671209037 672587216 674624085
1466.4F74624085K951205L822684M536689M353523L581882K887666K090692J257837
$$ 674624085 677575290 681397974 685934663 690288186 693870068 696757734 698848426 700106263
1482.8G00106263M19736o75976k387345l908873l884315l875911m365087l283799j133084
$$ 700106263 700525999 699850023 697462678 693553805 689669490 685793579 681428492 678144693 677011609
1501.1F77011609L23713M75883o85513j222908j389921j960277k263904j883924o51181
$$ 677011609 677335322 677811205 677125692 675902784 674512863 672552586 670288682 668404758 667753577
1519.5F67753577O58691K007365L263235M055858M114032L828108L583312L253579
$$ 667753577 668412268 670419633 673682868 677738726 681852758 685680866 689264178 692517757
1535.8F92517757L136337L451407L574014L701508L995001M091263M177511M174173
$$ 692517757 695654094 699105501 702679515 706381023 710376024 714467287 718644798 722818971
1552.1G22818971M105568L845572L503859K922058K256394J920104J559138R12189
$$ 722818971 726924539 730770111 734273970 737196028 739452422 741372526 742931664 743843853
1568.4G43843853J79530j78278r24647k635240l272474l386438m493356n659520o629825
$$ 743843853 744023383 743845105 742920458 740285218 737012744 733626306 729132950 723473430 716843605
1586.8G16843605p605970q639574r471655j0025799j0081410r765268r477556r016275
$$ 716843605 709237635 700598061 691126406 681100607 671019197 661253929 651776373 642760098
1603.1F42760098q237004p626057p402003o877184o014108o314695p128358m912555
$$ 642760098 634523094 626897037 619495034 612617850 606603742 600289047 593160689 588248134
1619.4E88248134k678097j951813j004160o9380O51241J483261K162695K663732L032505
$$ 588248134 585570037 583618224 582614064 582544684 583195925 584679186 586841881 589505613 592538118
1637.8E92538118L326059L700733L883481M134655M326642L892183L930986M424512
$$ 592538118 595864177 599564910 603448391 607583046 611909688 615801871 619732857 624157369
1654.1F24157369L966034L878951M215896M424691M423738M197716M189968M187346
$$ 624157369 628123403 632002354 636218250 640642941 645066679 649264395 653454363 657641709
1670.4F57641709L776908L627598L609836L364444L266096L380477L739954L790318
$$ 657641709 661418617 665046215 668656051 672020495 675286591 678667068 682407022 686197340
1686.7F86197340L722370L969610L969669L952801L832937L370642L118158K574503
$$ 686197340 689919710 693889320 697858989 701811790 705644727 709015369 712133527 714708030
1703G14708030J816154J213014Q99255O82533L08692k73168j033306j101017o61790
$$ 714708030 716524184 717737198 718636453 719318986 719627678 719354510 718321204 717220187 716558397
1721.4G16558397p54237q17120n86868m46737m74453r50038p58588L7551O8128K38240
$$ 716558397 715804160 714987040 714400172 713953435 713478982 712528944 711770356 711807907 711876035 712114275
1741.8G12114275R52243J568020K034843K633273L520131M183889M658282N112648
$$ 712114275 713066518 714634538 716669381 719302654 722822785 727006674 731664956 736777604
1758.1G36777604N434692N859851N625070N154311N128801M992485M674018M091978
$$ 736777604 742212296 748072147 753697217 758851528 763980329 768972814 773646832 777738810
1774.4G77738810L591299L455519L240109K788782K528787K532303K443433K113521
$$ 777738810 781330109 784785628 788025737 790814519 793343306 795875609 798319042 800432563
1790.7H00432563J861632J900255J943589J756489J547277J605451J677215J513541
$$ 800432563 802294195 804194450 806138039 807894528 809441805 811047256 812724471 814238012
1807H14238012J261234J235664J310468J203477R94146R92537J121401J029373P86483
$$ 814238012 815499246 816734910 818045378 819248855 820243001 821235538 822356939 823386312 824172795
1825.4H24172795P32362Q22902P62939O02365N28216O54578P83205O52373L84987M19020
$$ 824172795 824905157 825728059 826490998 827093363 827621579 828276157 829059362 829711735 830096722 830515742
1845.8H30515742O11484N04911L27587L80815N33699M55618K55585K78711M92335M91559
$$ 830515742 831127226 831632137 831959724 832340539 832874238 833329856 833585441 833864152 834356487 834848046
1866.2H34848046J95861R0540K93433L55423J78754Q8513J92761K90871K18332J34170
$$ 834848046 835043907 835134447 835427880 835783303 835962057 836050570 836243331 836534202 836752534 836886704
1886.6H36886704J79768K32219J61529K1219M0472J75893J71304M4048M7147J76847
$$ 836886704 837066472 837298691 837460220 837481439 837521911 837697804 837869108 837913156 837960303 838137150
1907H38137150J54614k6166n3942J03414J22249j1385m3273L5525Q9824Q404r7692
$$ 838137150 838291764 838265598 838211656 838315070 838437319 838425934 838382661 838418186 838508010 838516414 838418722
1929.4H38418722k8372O7473P093n8949Q404O1631l9995j52826j32203j7404J0550
$$ 838418722 838390350 838457823 838464916 838405967 838414371 838476002 838436007 838283181 838150978 838133574 838144124
1951.9H38144124q2970j00434M053M7207m0293p5340j430K9444l7014q3506k0564O0499
$$ 838144124 838061154 837960720 837964773 838011980 837971687 837896347 837894917 837924361 837887347 837803841 837783277 837843776
1976.3H37843776K0623p2360m8757N3644N4479l3021n3644n722M77p5639j02579j8001
$$ 837843776 837864399 837792039 837743282 837796926 837851405 837818384 837764740 837759018 837759495 837683856 837581277 837563276
2000.8H37563276J0073o0617r1434j8179L5047j8298q0169o0737k9743o6936q7440
$$ 837563276 837573349 837512732 837421298 837403119 837438166 837419868 837339699 837278962 837249219 837182283 837094843
2023.2H37094843l8206l696m2736q1480m5001J4841M411m6313l6835K3126M5419K5988
$$ 837094843 837056637 837052941 837010205 836928725 836883724 836898565 836902976 836856663 836819828 836842954 836888373 836914361
2047.7H36914361M2080O8367N8174M3869N7995Q8394R5844P3433N5552Q2850J06752
$$ 836914361 836956441 837024808 837082982 837126851 837184846 837273240 837369084 837442517 837498069 837580919 837687671
2070.2H37687671P9155N5730N9903N7936N4002M7803L8743K7835n186k0742k5749p0453
$$ 837687671 837766826 837822556 837882459 837940395 837994397 838042200 838080943 838108778 838103592 838082850 838057101 837986648
2094.6H37986648r7513n0485q643l5942p9631q6308o7890m5895o914L0756N9426P1942
$$ 837986648 837889135 837838650 837830007 837794065 837714434 837628126 837560236 837514341 837507427 837538183 837597609 837669551
2119.1H37669551O1155P0512R2030P4625M2855N2810Q3983R3877P9036P8261J01209
$$ 837669551 837730706 837801218 837893248 837967873 838010728 838063538 838147521 838241398 838320434 838398695 838499904
2141.5H38499904J16050J11818J14322J32739J17422O0022L8206R7513J42575J15811
$$ 838499904 838615954 838727772 838842094 838974833 839092255 839152277 839190483 839287996 839430571 839546382
2161.9H39546382Q0347N8592M2915N1856O4671N8770O9976P7546N4836N9903P5519
$$ 839546382 839626729 839685321 839728236 839780092 839844763 839903533 839973509 840051055 840105891 840165794 840241313
2184.4H40241313M6611L1650M2975K9623J8239K2471L0101N6743O8486J6034k4438
$$ 840241313 840287924 840319574 840362549 840392172 840410411 840432882 840462983 840519726 840588212 840604246 840579808
2206.8H40579808J2040L6955J4007M887J9014K8968K0504M947J6511L6776K8968K0087
$$ 840579808 840591848 840628803 840642810 840647697 840666711 840695679 840716183 840721130 840737641 840774417 840803385 840823472
2231.3H40823472K7954K7835K3306L3379L6954K4200r656l2246J1146M1187K801j1921
$$ 840823472 840851426 840879261 840902567 840935946 840972900 840997100 840987444 840955198 840966344 841007531 841010332 840998411
2255.8H40998411J550l636o318o616o080l755k8551p0691o6399k0683k3305o0440n8829
$$ 840998411 840999961 840996325 840990007 840983391 840977311 840973556 840945005 840874314 840807915 840787232 840763927 840703487 840644658
2282.3H40644658n4658j00314j53661j68622j42395j32323j82032k14040j85192j57535
$$ 840644658 840590000 840489686 840336025 840167403 840025008 839892685 839710653 839496613 839311421 839153886
2302.7H39153886k01047k87056l18527k93076k64764k47121k74002l65496m45843m47630
$$ 839153886 838952839 838665783 838347256 838054180 837789416 837542295 837268293 836902797 836456954 836009324
2323.1H36009324l54350k76804l24965l93092l66628l15070l20018l67403l97742l01718
$$ 836009324 835654974 835378170 835053205 834660113 834293485 833978415 833658397 833290994 832893252 832591534
2343.5H32591534L1352L32713J78277k85744o29425o87719o85334o18041m15921j92523
$$ 832591534 832622886 832955599 833133876 832848132 832218707 831530988 830845654 830227613 829811692 829619169
2363.8H29619169l9994L8683R6321J41263J34587J24336J82509K05755Q6189l4094
$$ 829619169 829579175 829617858 829714179 829855442 829990029 830114365 830296874 830502629 830588818 830554724
2384.2H30554724o1631r0719j75714k64287k76268k58088l00467l42607l14355k70665
$$ 830554724 830493093 830402374 830226660 829962373 829686105 829428017 829127550 828784943 828470588 828199923
2404.6H28199923k94030l75449m00663l64661l85702m32312m02868l39448l48390m33862
$$ 828199923 827905893 827530444 827129781 826765120 826379418 825947106 825544238 825204790 824856400 824422538
2425H24422538m73618m05133l58760m22240m86910m61400l98278l87668m19259m03822
$$ 824422538 823948920 823543787 823185027 822762787 822275877 821814477 821416199 821028531 820609272 820205450
2445.4H20205450l76463m35650m96745m44293l58999l82662m63068m66526m45187m74811
$$ 820205450 819828987 819393337 818896592 818452299 818093300 817710638 817247570 816781044 816335857 815861046
2465.8H15861046m91142m51207m07517m33445n16892n42938m82381m34398m49658m85062
$$ 815861046 815369904 814918697 814511180 814077735 813560843 813017905 812535524 812101126 811651468 811166406
2486.2H11166406m75526m46856m69148m95136m47750l87132m22299m93706m78506m34458
$$ 811166406 810690880 810244024 809774876 809279740 808831990 808444858 808022559 807528853 807050347 806615889
2506.6H06615889m43816m56751m26113l85702l85284m24326m33206l68417l25262l63588
$$ 806615889 806172073 805715322 805289209 804903507 804518223 804093897 803660691 803292274 802967012 802603424
2527H02603424l89040l56734l25441l29316l46660l34859l23236l45588l52919l25918
$$ 802603424 802214384 801857650 801532209 801202893 800856233 800521374 800198138 799852550 799499631 799173713
2547.4G99173713k98023l04223l25977l08633k61605k44558k89738l28183k93076k58744
$$ 799173713 798875690 798571467 798245490 797936857 797675252 797430694 797140956 796812773 796519697 796260953
2567.8G96260953k96056l45111l36886k90155k87771l41654l33429k41994k27988l26574
$$ 796260953 795964897 795619786 795282900 794992745 794704974 794363320 794029891 793787897 793559909 793233335
2588.2G93233335l69549l05831k84016l71933m15981l49879l18110l81232m36425l98099
$$ 793233335 792863786 792557955 792273939 791902006 791486025 791136146 790818036 790436804 790000379 789602280
2608.6G89602280l50237m07338m99010m83633m04775m17351m75467m26888l37303l67164
$$ 789602280 789252043 788844705 788345695 787862062 787457287 787039936 786564469 786137581 785800278 785433114
2629G85433114m50671m32730l51310l34024l87311l78549k84195k61963l42905l70681
$$ 785433114 784982443 784549713 784198403 783864379 783477068 783098519 782814324 782552361 782209456 781838775
2649.4G81838775l13104l05354l64125l58403k84373k63811l01957l08096k90573l08990
$$ 781838775 781525671 781220317 780856192 780497789 780213416 779949605 779647648 779339552 779048979 778739989
2669.8G78739989l34919l22044k86638k78235l16322l47256l10958k49982k78592l54707
$$ 778739989 778405070 778083026 777796388 777518153 777201831 776854575 776543617 776293635 776015043 775660336
2690.2G75660336l59356l13580l04461l37541l48091l35932l55482l82364l71933l42369
$$ 775660336 775300980 774987400 774682939 774345398 773997307 773661375 773305893 772923529 772551596 772209227
2710.6G72209227l30448l48926l56674l43740l53157l73900l47019k99215l14593l45946
$$ 772209227 771878779 771529853 771173179 770829439 770476282 770102382 769755363 769456148 769141555 768795609
2731G68795609l04996k31386k43962l20613l21031k69413k53617k66969k78712k86758
$$ 768795609 768490613 768259227 768015265 767694652 767373621 767104208 766850591 766583622 766304910 766018152
2751.4G66018152l09586l45409l55065l20315k93434l26693l80039l72768l50892l86179
$$ 766018152 765708566 765363157 765008092 764687777 764394343 764067650 763687611 763314843 762963951 762577772
2771.8G62577772m21882m42147m78029n19097n62429n60046n13851n42760o38962o97970
$$ 762577772 762155890 761713743 761235714 760716617 760154188 759594142 759080291 758537531 757898569 757200599
2792.2G57200599p05004p07626p68841q38577q33273q29995q86679r22799Tr48131
$$ 757200599 756495595 755787969 755019128 754180551 753347278 752517283 751630604 750707805 749785006 748836875
2812.5G48836875r98974j055241j082718j093566j145065j211643j258970j321673
$$ 748836875 747837901 746782660 745699942 744606376 743461311 742249668 740990698 739669025
2828.9G39669025j442015j590431j734972j932681k302706k822459l262698l562391
$$ 739669025 738227010 736636579 734901607 732968926 730666220 727843761 724581063 721018672
2845.2G21018672l785074l781557l289938k313852j274049n57781k35915k83003n93483
$$ 721018672 717233598 713452041 710162103 707848251 706574202 706016421 705780506 705497503 704904020
2863.5G04904020r81033j310527j416862j255513j138031j187205j155198j067460
$$ 704904020 703922987 702612460 701195598 699940085 698802054 697614849 696459651 695392191
2879.9F95392191j115322j235902j286745j263201j235366j203358j121819j010120
$$ 695392191 694276869 693040967 691754222 690491021 689255655 688052297 686930478 685920358
2896.2F85920358r51708r49740r71437j035809j175761j436651j742363k015293k327680
$$ 685920358 684968650 684018910 683047473 682011664 680835903 679399252 677656889 675641596 673313916
2914.5F73313916k593100k542794k067745j281142l76701N10335J300692J893103K273798
$$ 673313916 670720816 668178022 666110277 664829135 664452434 664962769 666263461 668156564 670430362
2932.9F70430362K526522K703071K796530K791047K666593K414405K065242J688420
$$ 670430362 672956884 675659955 678456485 681247532 683914125 686328530 688393772 690082192
2949.2F90082192J381636J138151R43243Q67486R17614J054406J169503J188814J194239
$$ 690082192 691463828 692601979 693545222 694412708 695330322 696384728 697554231 698743045 699937284
2967.6F99937284J259625J369536J434803J397073J367688J391769J313269J140594
$$ 699937284 701196909 702566445 704001248 705398321 706766009 708157778 709471047 710611641
2983.9G10611641R98915Q85248P95841O53625L73959J11222n6445k13206l43680m31300
$$ 710611641 711610556 712495804 713291645 713945270 714319229 714430451 714374006 714160800 713817120 713385820
3004.3G13385820m70697m33743l92735m41134n27382n86987o41942p05898p57098q03709
$$ 713385820 712915123 712481380 712088645 711647511 711120129 710533142 709891200 709185302 708428204 707624495
3024.7G07624495q89719r29057q88050q87572r95875j129031j101494r99987j047909
$$ 707624495 706734776 705805719 704917669 704030097 703034222 701905191 700803697 699803710 698755801
3043F98755801j206398j327575j323044j261294j269757j299739j291097j265108j205862
$$ 698755801 697549403 696221828 694898784 693637490 692367733 691067994 689776897 688511789 687305927
3061.4F87305927j143157j081109j065910j165390j203418j077950r18209q54731r75967
$$ 687305927 686162770 685081661 684015751 682850361 681646943 680568993 679650784 678796053 677820086
3079.7F77820086j126050j121521j112402j142681j120984j112342j133919j123249
$$ 677820086 676694036 675572515 674460113 673317432 672196448 671084106 669950187 668826938
3096F68826938j058817j050771j170039j233160j140952j090467j213968j283586j152217
$$ 668826938 667768121 666717350 665547311 664314151 663173199 662082732 660868764 659585178 658432961
3114.4F58432961j073719j194298j426637j624465j595557j430213j362443j427293
$$ 658432961 657359242 656164944 654738307 653113842 651518285 650088072 648725629 647298336
3130.7F47298336j522601j494705j358569j337707j523793j681924j650452j557529
$$ 647298336 645775735 644281030 642922461 641584754 640060961 638379037 636728585 635171056
3147F35171056j444400j360774j535773j810312j790226j655221j670360j714707j705408
$$ 635171056 633726656 632365882 630830109 629019797 627229571 625574350 623903990 622189283 620483875
3165.4F20483875j695037j707077j713156j717210j714587j709700j738966j775383
$$ 620483875 618788838 617081761 615368605 613651395 611936808 610227108 608488142 606712759
3181.7F06712759j780332j769661j749993j743674j766801j797259j825034j832426
$$ 606712759 604932427 603162766 601412773 599669099 597902298 596105039 594280005 592447579
3198E92447579j819491j801432j768767j745284j768947j778245j766324j787185j797855
$$ 592447579 590628088 588826656 587057889 585312605 583543658 581765413 579999089 578211904 576414049
3216.4E76414049j816452j854658j856565j828135j813530j802445j734853j654923
$$ 576414049 574597597 572742939 570886374 569058239 567244709 565442264 563707411 562052488
3232.7E62052488j682281j752556j735389j645207j510620j367867j313746j369417
$$ 562052488 560370207 558617651 556882262 555237055 553726435 552358568 551044822 549675405
3249E49675405j407206j362026j335382j407862j473129j464128j430929j368642j280904
$$ 549675405 548268199 546906173 545570791 544162929 542689800 541225672 539794743 538426101 537145197
3267.4E37145197j192510j231730j396775j472712j417040j343966j356304j410245
$$ 537145197 535952687 534720957 533324182 531851470 530434430 529090464 527734160 526323915
3283.7E26323915j401365j353085j338065j379549j436592j499056j578689j561284
$$ 526323915 524922550 523569465 522231400 520851851 519415259 517916203 516337514 514776230
3300E14776230j416743j285315j333892j573145j777590j820623j758576j723885j792849
$$ 514776230 513359487 512074172 510740280 509167135 507389545 505568922 503810346 502086461 500293612
3318.4E00293612j865714j871080j935660k143145k297610k297968k285003k252519
$$ 500293612 498427898 496556818 494621158 492478013 490180403 487882435 485597432 483344913
3334.7D83344913k153963k160907k266854k264261k215952k132237j938224j902878
$$ 483344913 481190950 479030043 476763189 474498928 472282976 470150739 468212515 466309637
3351D66309637k075315k125799k018780j957059k000361k055735j995712j929582k072423
$$ 466309637 464234322 462108523 460089743 458132684 456132323 454076588 452080876 450151294 448078871
3369.3D48078871k323896k353072k096862j841306j741827j779944j803964j658738
$$ 448078871 445754975 443401903 441305041 439463735 437721908 435941964 434138000 432479262
3385.7D32479262j410365j214772j295239j547933j503408j103371q20428r97126j238197
$$ 432479262 431068897 429854125 428558886 427010953 425507545 424404174 423583746 422586620 421348423
3404D21348423j015097o12617m11510l30895k98888k53796j01328N0127J03682J89096
$$ 421348423 420333326 419720709 419309199 418978304 418679416 418425620 418324292 418374419 418478101 418667197
3424.4D18667197L72559N05745M80354N21988O70791O04301L78162L73334N94020P67737
$$ 418667197 419039756 419545501 420025855 420547843 421218634 421822935 422201097 422574431 423168451 423936188
3444.8D23936188Q34942Q83132R60380J028299J082659J178265J290500J247674J203716
$$ 423936188 424771130 425654262 426614642 427642941 428725600 429903865 431194365 432442039 433645755
3463.2D33645755J417846J578331J378774J082421J092016J303137J513481J544386
$$ 433645755 435063601 436641932 438020706 439103127 440195143 441498280 443011761 444556147
3479.5D44556147J349062J347184J551211J552969J486540J599967J751304J846522
$$ 444556147 445905209 447252393 448803604 450356573 451843113 453443080 455194384 457040906
3495.8D57040906J829147J781553J779437J711607J640529J686215J794756J933813
$$ 457040906 458870053 460651606 462431043 464142650 465783179 467469394 469264150 471197963
3512.1D71197963J941204J771539J753360J931072K101212K055467J862108J827449
$$ 471197963 473139167 474910706 476664066 478595138 480696350 482751817 484613925 486441374
3528.4D86441374J994937K183736K339095K404541K392262K591490K869487K875865
$$ 486441374 488436311 490620047 492959142 495363683 497755945 500347435 503216922 506092787
3544.7E06092787K702117K733707K941311L143191L306091L447890L638804L782153
$$ 506092787 508794904 511528611 514469922 517613113 520919204 524367094 528005898 531788051
3561.1E31788051L758490L664077L882288M207075M156768M068077M192591M288018
$$ 531788051 535546541 539210618 543092906 547299981 551456749 555524826 559717417 564005435
3577.4E64005435M373908M558086M589021M352749M164695M362881M461051M395723
$$ 564005435 568379343 572937429 577526450 581879199 586043894 590406775 594867826 599263549
3593.7E99263549M492819M627109M612922M562855M538417M409790M429221M603446
$$ 599263549 603756368 608383477 612996399 617559254 622097671 626507461 630936682 635540128
3610F35540128M598856M566729M502117M418433M581928M572213M348576M142106M174173
$$ 635540128 640138984 644705713 649207830 653626263 658208191 662780404 667128980 671271086 675445259
3628.4F75445259M553020M489839M324734M284739M181564M165709M235328M174649
$$ 675445259 679998279 684488118 688812852 693097591 697279155 701444864 705680192 709854841
3644.7G09854841M005075M083276M249870L968299L681838L838182L872037L523945
$$ 709854841 713859916 717943192 722193062 726161361 729843199 733681381 737553418 741077363
3661G41077363L221632L128528L009379K890289L000378K733231K359510K402365K305150
$$ 741077363 744298995 747427523 750436902 753327191 756327569 759060800 761420310 763822675 766127825
3679.4G66127825K155959K178789K201914K175153J919090J549721J468539J483560
$$ 766127825 768283784 770462573 772664487 774839640 776758730 778308451 779776990 781260550
3695.7G81260550J382411J241207J223921J238585J143098J054287R90331R29117R48429
$$ 781260550 782642961 783884168 785108089 786346674 787489772 788544059 789534390 790463507 791411936
3714G91411936R03070Q07822P32839O69301O06417N96166O86467O95288O76691P04825
$$ 791411936 792315006 793122828 793855667 794524968 795131385 795727551 796414018 797109306 797785997 798490822
3734.4G98490822P27535P08282M83274J62125L05772P40647N40256K77162M48048N64098
$$ 798490822 799218357 799926639 800409913 800572038 800877810 801618457 802158713 802435875 802883923 803448021
3754.8H03448021M41254L44336M19914M58777M32492M02748K93017K35855K61247K80500
$$ 803448021 803889275 804233611 804653525 805112302 805544794 805947542 806240559 806476414 806737661 807018161
3775.2H07018161L67939M18902L04997J79410J64449K20776K97784L14236K23935K08318
$$ 807018161 807386100 807805002 808109999 808289409 808453858 808674634 808972418 809286654 809510589 809718907
3795.6H09718907K74777J17004J7107K18510K09749J47045K36749K54870J53363J80482
$$ 809718907 809993684 810110688 810127795 810346305 810556054 810703099 810939848 811194718 811348081 811528563
3816H11528563K97130P9929p033J31309J22845J65224K05934K18988K94685J61708
$$ 811528563 811825693 811905622 811898589 812029898 812152743 812317967 812523901 812742889 813037574 813199282
3836.4H13199282j33276q5116J02520J37151J42335J60814p153l35872r5963L02076
$$ 813199282 813066006 812980890 813083410 813220561 813362896 813523710 813516557 813180685 813084722 813386798
3856.8H13386798K12669J03951P8082R8050Q6963l1174l5584J8836M8637N9664m3988
$$ 813386798 813599467 813703418 813781500 813879550 813966513 813935339 813899755 813918591 813967228 814026892 813982904
3879.2H13982904q166J30177J15275L7849n9247j05500k8789M3332K1160n305m0471
$$ 813982904 813974738 814104915 814220190 814258039 814198792 814093292 814064503 814107835 814128995 814123690 814083219
3901.7H14083219j54555j01149R0897J44183R6441L8564r298j3233j3232o1333l2008
$$ 814083219 813928664 813827515 813918412 814062595 814159036 814197600 814188302 814175069 814161837 814100504 814068496
3924.1H14068496P4744M0114o3538k2888O4492M3034l0934q2434m8935L8624M4584
$$ 814068496 814143240 814183354 814119816 814096928 814161420 814204454 814173520 814091086 814042151 814080775 814125359
3946.5H14125359J5259M3213P5937M9233K8193N3048J6153m9889j6809P1168R2209
$$ 814125359 814140618 814183831 814259768 814309001 814337194 814390242 814406395 814356506 814339697 814410865 814503074
3969H14503074N3823K4974J3113M0352Q3924J31011J27613J8001l3021J4603K4200
$$ 814503074 814556897 814581871 814594984 814635336 814719260 814850271 814977884 814995885 814962864 814977467 815001667
3991.4H15001667N900K9862Q4401
$$ 815001667 815007567 815037429 815121830
3997.5H15121830
$$ 815121830
##END=$$ End of the data block
