##TITLE=$$ Begin of the data block
##JCAMP-DX=5.00 $$ ACD/SpecManager v 10.08
##SPECTROMETER/DATA SYSTEM=Varian
##DATE=15 Jan 2013 16:15:50
##DATA TYPE=INFRARED SPECTRUM
##DATA CLASS=XYDATA
##ORIGIN=
##OWNER=
##NPOINTS=3735
##FIRSTX=399.26403809
##LASTX=4000.35498047
##MAXX=4000.35498047
##MINX=399.26403809
##MAXY=76.99505615
##MINY=40.11231613
##XFACTOR=1.0000000000
##YFACTOR=0.000000100000000
##FIRSTY=75.05500031
##DELTAX=0.96440572
##XUNITS=1/CM
##YUNITS=TRANSMITTANCE
##XYDATA=(X++(Y..Y))
399.3G50550003l477783r867478l0822m756852N132218J8539200J3862076m61655q849411
407.9G60639496n395279j0704041Q62809O83746J6785k762375j478272J452256k628251
416.6G40686874J6450196P87353j6613464Q85391l144913J311264n018920N177230
424.3G40521011K345810L807679K59704j654968Q131409K523269j834945p882996l037491
433G43178482p31811j650315j960220J756058O094436k536087j48926j390380L240661
441.7G45851898J042404m740371J787872m448624j41067M04205L850632K960510L73764
450.4G46941223L651886m609604j210403j873779j506958j960373r66721K852173k864533
459.1G38452911K947770K735672M863204k326965m581604k121506k537460M5929l453217
$$ plain form
399.3 750550003 747072220 737204742 737173920 732417068 737549286 756088486 769950562 769488907 760639496
407.9 760639496 755244217 744540176 745402985 746086731 746103516 743341141 741862869 743315125 740686874
416.6 740686874 757137070 757924423 741310959 742196350 739051437 740362701 735343781 740521011
424.3 740521011 742866821 746674500 746934204 745279236 753410645 755933914 754098969 746215973 743178482
433 743178482 742446671 740796356 738836136 740592194 746686630 744150543 744001617 742611237 745851898
441.7 745851898 746894302 742153931 743941803 739493179 739352112 739756317 743606949 746567459 746941223
450.4 746941223 750593109 745983505 744773102 742899323 741392365 739431992 738465271 741317444 738452911
459.1 738452911 741400681 744136353 748999557 746672592 742090988 739969482 737432022 737477951 734024734
467.7G34024734J956711k615890K789306L512803k694626M860840l16315N359421l153916
476.4G43723068l960113l296128o320877M561005J6556M91485K138520O388931M588470
485.1G48330917l034668m479980o332626J57928n61829j127243K068329N378952N62821
493.8G40962601l571396M61960j56479L594665l668213m800186q80356k346725K698288
502.5G32294159q09708L437500M978638Q95157k977066k860184r26819m483337n29328
511.1G29019012Q49686J911545n44357q45642J915740j846694K278900K289428p63778
519.8G34263840k848053j752777r71299j297073m64859j654587K339173J583099K200165
528.5G31397629K411880Q9569j473846m498062j208191j5640N35125k89154N11475
$$ plain form
467.7 734024734 735981445 733365555 736154861 739667664 736973038 741833878 741517563 746876984 743723068
476.4 743723068 739762955 736466827 730145950 734706955 734723511 735214996 737353516 743742447 748330917
485.1 748330917 745296249 740816269 734483643 734641571 734079742 732952499 735020828 740399780 740962601
493.8 740962601 737391205 737853165 737696686 741291351 737623138 732822952 731942596 729595871 732294159
502.5 732294159 731484451 734921951 739900589 740795746 737818680 734958496 734031677 729548340 729019012
511.1 729019012 729868698 731780243 731235886 730390244 732305984 730459290 732738190 735027618 734263840
519.8 734263840 731415787 729663010 728691711 727394638 726929779 725275192 727614365 729197464 731397629
528.5 731397629 733809509 733899078 732425232 727927170 726718979 726703339 727238464 726949310 727460785
537.2G27460785J512222M23508L127823j24817j133881k421417j924210L86658j641693
545.9G25664978M01917n49927L31955J322708J420288N39627j288223N56793l61328
554.5G28038788j005325l006592j477204N68390j02081J023483P83615J180802p70493
563.2G25233383M0207q49991k815399j248321r58939q00476j259766J027527k31323
571.9G18136902o66733J197357m35562j961365k662887q28858l102874k580414l41263
580.6G06754303L53165R28497p80106J217270N84488r35898j947937k554321j145935
589.3G02473526j139908L10288k32849j79215P72324J561584Q35648r0790M26636k003632
598.9G02733612k161865k479935k394791j963424k280045j162567p00149j477738m788971
$$ plain form
537.2 727460785 728973007 729396515 732524338 732399521 731265640 728844223 726920013 727306671 725664978
545.9 725664978 726066895 725516968 725848923 727171631 728591919 729131546 727843323 728400116 728038788
554.5 728038788 727033463 724026871 722549667 723118057 723015976 724039459 724823074 726003876 725233383
563.2 725233383 725273590 724423599 721608200 720359879 719400940 718600464 717340698 718368225 718136902
571.9 718136902 717470169 718667526 718231964 716270599 713607712 712778854 709675980 707095566 706754303
580.6 706754303 707107468 708035965 707255859 708473129 709057617 708121719 706173782 703619461 702473526
589.3 702473526 701333618 701643906 701411057 701231842 702004166 703565750 704401398 704310608 704737244 702733612
598.9 702733612 700571747 698091812 695697021 693733597 691453552 690290985 689590836 688113098 683324127
607.6F83324127m225998m360351n948181n702820n746460l640747k365570O42852L831330
616.3F55808182L480301K551574L104401L548965K718964L871536L927002L171997
624F82182922L283387L916092M553756L212128K669372L49732j957092k462311j472855
632.7F94275131l669281q446197o389618k688675J14517J107330L238678O176682O564178
641.3F90282745P251740M283905L273086K285080J205674L115158K292480L277054
649G17266922K615204K408829K356643J465836N82504l37219L72620k326508p9041
657.7G24325790J818314J231079J784515Q52051K432175K163086J085129n82657r91516
666.4G34117966n479889j6931763J1040115P245636L220215J202011R37271Q21534
$$ plain form
607.6 683324127 679098129 674737778 668789597 663086777 657340317 653699570 651334000 651976852 655808182
616.3 655808182 659288483 661840057 664944458 668493423 671212387 675083923 679010925 682182922
624 682182922 685466309 689382401 693936157 697148285 699817657 700167389 698210297 695747986 694275131
632.7 694275131 690605850 682159653 675770035 673081360 673195877 674303207 677541885 683718567 690282745
641.3 690282745 697534485 701818390 705091476 707376556 708582230 711697388 713989868 717266922
649 717266922 719882126 722290955 724647598 726113434 726695938 726358719 726731339 724404831 724325790
657.7 724325790 726144104 727375183 729159698 730011749 732443924 734607010 735692139 735109482 734117966
666.4 734117966 728638077 711706314 722746429 729992065 733212280 734414291 735351562 736173096
674.1G36173096K14233R537k81067K61230k055740j977463K84119J017609O74667K064362
683.8G36384583K676239r25599q20617N6915k09274j044388o84967q10318j012879
692.4G33609695J497117K64511J329574J542435N84564J026840j007690j847839l078690
701.1G33920517p63779m3106l37219R75418J063919K100983Q73260J083145m88815
709.8G38384323j474380j344300k401352p31048J58157J173706j85165P51343K169799
718.5G36501083J146622M62875j500625J5640p42645j352005j612015j754303k00119
727.2G30964508K24915K792053J840133R70917j34201j711349o76575j261063k74887
735.8G32734451J07575r89990j727601O83136J845398P55844K56653r34524K83279
$$ plain form
674.1 736173096 736387329 736396866 736115799 736377029 734321289 732343826 732627945 733645554 734320221 736384583
683.8 736384583 739060822 738135223 737314606 737371521 737162247 736117859 735432892 734622574 733609695
692.4 733609695 735106812 735371323 736700897 738243332 738827896 739854736 738847046 736999207 733920517
701.1 733920517 733156738 733113632 732776413 733751831 734815750 736916733 737789993 738873138 738384323
709.8 738384323 736909943 735565643 733164291 732433243 732591400 733765106 733579941 734331284 736501083
718.5 736501083 737647705 738110580 736609955 736625595 735882950 734530945 732918930 731164627 730964508
727.2 730964508 731189423 733981476 735821609 736792526 736658325 734946976 734270401 733009338 732734451
735.8 732734451 732842026 731852036 730124435 730807571 732652969 733408813 733665466 732730942 733014221
744.5G33014221q70285r36203j141281j736145q93860p55463K555237J502304P12204
753.2G31450729L98560j151886j96228j400757j107254m66309M47922k87857J83792
761.9G27870712J351319k49176L79638J79215Q61511m86679k217102k356491k297821
770.6G23035126k95487l48739j91269m63105J157761Q42133j637574j738967k552491
779.2G17807388j005478k103424k465057o27594m40445k59399n30091k78702r44900
787.9G09152298Q10165J33591k009888j204223o03256M21371l2043R94796J020890
796.6G08683701N82580R63593L20892p1182j057892k92130n78460L90320J311492J022416
806.2G11275330J428375R06677J182861K4720R66262K18506j390991j62735j02844
$$ plain form
744.5 733014221 732143936 731207733 730066452 728330307 727436447 726680984 729236221 730738525 731450729
753.2 731450729 731849289 730697403 730501175 729100418 727993164 727526855 727974777 727686920 727870712
761.9 727870712 729222031 728972855 729352493 729531708 730393219 729906540 727689438 725332947 723035126
770.6 723035126 722739639 722390900 722199631 721736526 722894287 723736420 722098846 720359879 717807388
779.2 717807388 716801910 714698486 712233429 711605835 711165390 710905991 710375900 710097198 709152298
787.9 709152298 709962463 710096054 708086166 706881943 706278687 706700058 706668015 707662811 708683701
796.6 708683701 709266281 710229874 710550766 710479584 709421692 709129562 708551102 708941422 710252914 711275330
806.2 711275330 712703705 713610382 714793243 714817963 715784225 716002731 714611740 714449005 714346161
814.9G14346161M75464l67508R3612P18537P76520N43594N51529J517334J15890m03366
824.6G18367767j920547p50046O95496n79911J1979K25524J045762L28750O16150O04706
834.2G18645630k75421j09101q35189J43508M9668j50070m99497O34995J274490j77383
843.9G18701630m26865j687698m7150M56085o20498j266709j606293Q37632J266250
852.5G15606384P28913N21469L88031j29166M7913o91223j271210L80707l28370J17035
862.2G15370483L62473J042404M27551j215896P50808J71738K4719j21917n64194k23923
871.8G16024246o31561m71191L99093J680298L20206N85174J48468k67334L28980r15299
881.5G17201080J67694m26941j82189Q30001J575547J603622L56598J365814Q16040
$$ plain form
814.9 714346161 714821625 714454117 714547729 715266266 716042786 716586380 717137909 718655243 718771133 718367767
824.6 718367767 716447220 715697174 716392670 715812759 715824738 716050262 717096024 717424774 718040924 718645630
834.2 718645630 718370209 718261108 717425919 717569427 717619095 717469025 716969528 717604523 718879013 718701630
843.9 718701630 718274765 716587067 716539917 716996002 716375504 715108795 713502502 714340134 715606384
852.5 715606384 716335297 716856766 717244797 717115631 717163544 716472321 715201111 715581818 715253448 715370483
862.2 715370483 715732956 716775360 717202911 715987015 716737823 716909561 716934280 716812363 716248169 716024246
871.8 716024246 715392685 714921494 715320587 717000885 717321091 717906265 718054733 717787399 718116379 717201080
881.5 717201080 717368774 716941833 716759644 717589645 719165192 720768814 721125412 722491226 723307266
890.2G23307266J95770j052551m38995P06863K56119P37610J12610J000061P46307
898.8G25571060J377869J849060O59256j006470k460022L08609K31095j89515J79825
907.5G26520767M83475J734085J224594J089478J3504j01624r39407j72348L49350
916.2G30201874j271210m07486k7161J123124M30755O64063P12280n52444K7771j187516
925.8G29714050j130752j875763r99985m8904n341R03244l06625P49130L84445p93304
935.5G26590195j674576j283341j92794j223297k37427k94495L47214O67648l01437
944.2G22397690n08805q83026n38482j287461j072235q19397o72531q55560q77991
952.8G14882202n97458p38373L18451k51846m3335o83517j488877j010208j193390
$$ plain form
890.2 723307266 723503036 722450485 722011490 722718353 722974472 723712082 723824692 724824753 725571060
898.8 725571060 726948929 728797989 729457245 728450775 725990753 726299362 726530457 726340942 726520767
907.5 726520767 727004242 728738327 729962921 731052399 731065903 730964279 730024872 729852524 730201874
916.2 730201874 728930664 728523178 728496017 729619141 730049896 730713959 731426239 730873795 730901566 729714050
925.8 729714050 728583298 726707535 725707550 725658646 725653305 726556549 726249924 726999054 727383499 726590195
935.5 726590195 724915619 723632278 723439484 722216187 721978760 721684265 722031479 722699127 722397690
944.2 722397690 721888885 721005859 720467377 719179916 718107681 717288284 716615753 715760193 714882202
952.8 714882202 714284744 713546371 713864822 713612976 713569641 712886124 711397247 710387039 709193649
961.5G09193649o08062q40836j6556j39999L19214K29721q42057j04064j045838r18732
971.2G05226440j299743j02387J76697r63440O65436O7367K36359m68368o01426k10266
980.8G02726669j019821j52969r74884j302719j266861r25980j53809L34168m43649
989.5F96820145p53327j67618j870346p83386q52661j324997n10101j249008q93631
998.2F88415070j476593o48194j144867j627502n51682j766433k619324k865372k246475
1006.8F73468628k257691k435302k883682k763443k672577l418427k646027k963943
1014.6F51427536k691269l204498m650498m057541l179626k959290k997665j678886
1022.3F26008263l30811k00691j264534j784134j311569o95763r27238k495270j516724
$$ plain form
961.5 709193649 708585587 707744751 707728195 707588196 707907410 708137131 707295074 707191010 706145172 705226440
971.2 705226440 703926697 703824310 704001007 703037567 703703003 703770370 704006729 703538361 702936935 702726669
980.8 702726669 701706848 701553879 700578995 699276276 698009415 697083435 696929626 697263794 696820145
989.5 696820145 696066818 695899200 694028854 693245468 692392807 691067810 690557709 689308701 688415070
998.2 688415070 686938477 686290283 685145416 683517914 682966232 681199799 678580475 675715103 673468628
1006.8 673468628 671210937 668775635 665891953 663128510 660455933 657037506 654391479 651427536
1014.6 651427536 648736267 645531769 640881271 636823730 633644104 630684814 627687149 626008263
1022.3 626008263 625677452 625476761 624212227 622428093 621116524 620420761 619493523 616998253 615481529
1031F15481529q46405q41102M0664n09796r09042j049729j164398j463737k66877N10903
1040.6F08982010J44844M73518k95562m08135O0425J105843J454315J139984P37114
1049.3F13394356J57127Q45337k44217L43590J78108o13441J296692P71751Q63113
1058F16992416K73209M20837J220131l53126k00615l50723q82721n55382L43666O00090
1067.6F17507782P23457q0070j430664l14522l87154j251068j639900j593666j463165
1076.3F10071030j483384j707916j949997j324348j953163j557885j622886l018608
1084E95452843l076554k764549k380943k857475k669411k459030l552552l763122k890091
1092.7E69039116k505570k282333k432136l401032l963203l450394k860298l510399
$$ plain form
1031 615481529 614635124 613794022 613834686 613324890 612415848 611366119 610201721 608737984 608471107 608982010
1040.6 608982010 609126854 609600372 609304810 608896675 608957100 610062943 611517258 612657242 613394356
1049.3 613394356 613551483 614396820 614152603 614496193 614674301 614060860 615357552 616129303 616992416
1058 616992416 617265625 617686462 618906593 618553467 618352852 618002129 617119408 616564026 616907692 617507782
1067.6 617507782 618231239 618151169 616720505 616405983 616018829 614767761 613127861 611534195 610071030
1076.3 610071030 608587646 606879730 604929733 603605385 601652222 600094337 598471451 595452843
1084 595452843 592376289 589611740 587230797 584373322 581703911 579244881 575692329 571929207 569039116
1092.7 569039116 566533546 564251213 561819077 558418045 554454842 551004448 548144150 544633751
1100.4E44633751l724899m063111l546638k609558l479882m178581m627647m010620
1108.1E14392815m441605n379524m542237k896041j696816p90367J550102K898483
1115.8D99094810K755318K047310J898384R88541O05316M88434j032257j698952k312241
1124.5E02834663k135276k540589k864227k961350m100799k711830j258354j41564
1132.2D84120674j007957j435929l09868J08605K582970L186531K734947J916694J057282
1140.9D92953949R28307N72624L14827n75218m48151o23436k83508J58767l28521l21885
1150.5D92347755m77714o4964m77715n48096m75998m45823l56522l78456n9280j048432
1160.2D88014755l06358N10788L45077n3825P2289P92579L58467J502075J783066J782227
$$ plain form
1100.4 544633751 540908852 536845741 533299103 530689545 527209663 523031082 518403435 514392815
1108.1 514392815 509951210 504571686 500029449 497133408 495436592 494646225 496196327 499094810
1115.8 499094810 501850128 503897438 505795822 506784363 507389679 507878113 506845856 505146904 502834663
1124.5 502834663 500699387 498158798 495294571 492333221 488232422 485520592 484262238 484120674
1132.2 484120674 483112717 481676788 481366920 481475525 484058495 487245026 489979973 491896667 492953949
1140.9 492953949 493882256 494454880 494769707 494194489 493746338 493122902 492839394 492998161 492669640 492347755
1150.5 492347755 491870041 491805077 491327362 490779266 490303268 489857445 489500923 489122467 489063187 488014755
1160.2 488014755 487708397 488219185 488564262 488510437 488582726 489375305 489733772 491235847 493018913 494801140
1169.8D94801140J520157J201706K090072J583023J424218J371765J616707J134033
1177.5E06742821P82814J167946J139183K092933J938134J447906P04918K80495N47485
1186.2E16844635K11334j95541k79694O69976L01780J45989K85263R8343L96232p5149
1195.9E18403168L16658q19206j106377p3280p77092p74537o01997K39334J40686o26106
1205.5E14321251l43475L07579K89688l26920j93443p37457k37046J9188L6736R53216
1215.1E14089317K95792k52914l93029J28594K26402Q7090K35595l48167j88904J60141
1224.8E14039917L31268L78456Q84476Q89130N91278N25589L04603M58832l55758m39797
1234.4E17607994J15624O43272R02710P23686J101494O57997Q30765N58166j02729
$$ plain form
1169.8 494801140 496321297 497523003 499613075 501196098 502620316 503992081 505608788 506742821
1177.5 506742821 507525635 508693581 509832764 511925697 513863831 515311737 516016655 516297150 516844635
1186.2 516844635 517055969 516860428 516580734 517250710 517552490 517698479 517983742 518082085 518478317 518403168
1195.9 518403168 518719826 517900620 516794243 516720963 515943871 515169334 514567337 514806671 514947357 514321251
1205.5 514321251 513977776 514285355 514575043 514248123 514054680 513317223 513080177 513099365 513136101 514089317
1215.1 514089317 514385109 514132195 513739166 513867760 514094162 514181252 514416847 514068680 513879776 514039917
1224.8 514039917 514371185 514749641 515634117 516523247 517114525 517640114 517944717 518403549 518047791 517607994
1234.4 517607994 517723618 518366890 519269600 519993286 521094780 521752777 522583542 523141708 523038979
1243.1E23038979J79977L58658N04684J76163P24640J032905R73092J115646Q00781
1251.8E28905525M52767L1776N73654P38678L37029N56831N30205o600L29476J017875
1261.4E33467216P97310J157608P80335M66080O72493L70483M39339L67431P84989
1270.1E39303284M92515N46837J444206J418381J433907R56764Q50906P93267N71708
1278.8E47811775O57006K74581M61846N57098P31011J245384J125374R94644Q16917
1287.5E54675636O28281O74591N24712J3504L0288O44837L35617J11503N32380Q29811
1297.1E59001160R23195N95092L51334j831j29700N9242N112J11122M05083N74951
1306.8E61894760M47083N02052K76985J69678M18014q9645l89175o3248L12500L700
$$ plain form
1243.1 523038979 523218956 523577614 524082298 524258461 524983101 526016006 526989098 528104744 528905525
1251.8 528905525 529358292 529390068 529963722 530702400 531039429 531596260 532126465 532119865 532449341 533467216
1261.4 533467216 534264526 535422134 536202469 536668549 537341042 537711525 538150864 538518295 539303284
1270.1 539303284 539795799 540342636 541786842 543205223 544639130 545595894 546446800 547240067 547811775
1278.8 547811775 548468781 548743362 549205208 549762306 550493317 551738701 552864075 553858719 554675636
1287.5 554675636 555303917 555978508 556503220 556516724 556547012 557191849 557527466 557638969 558171349 559001160
1297.1 559001160 559924355 560519447 560870781 560868950 560739250 560798492 560803604 560914726 561319809 561894760
1306.8 561894760 562341843 562843895 563120880 563290558 563708572 563618927 563229752 563166504 563479004 563482704
1316.4E63482704k19040J89209L53089O15158M52461K62756j5068J450K97355j89170
1326E65230904l98827J7929O69479N80864K26136K47230K41623J63689k84500j56479
1335.7E66538048n27382p92313l90587o70662l73039P50618J205368M53530q3084j98250
1345.3E65912247o48766r68361j265182j054001q53005n99594p82051o93245k24800
1354E58823242k80876m46053p57408m60357j68839k02064m94843l93715N45006K20795
1363.7E56384888N44128O79970j04447j18904k04582k95410p21359r24988m15382m36097
1373.3E54387817q79211o42967M75006N74951K60391J46714q9798j49537J28479L83339
1382.9E54595184k07863m8255L10058k82364k72293O59142O87484j60903o59829r89456
$$ plain form
1316.4 563482704 563263664 563452873 563805962 564421120 564873581 565136337 565121269 565122719 565420074 565230904
1326 565230904 564832077 564850006 565519485 566100349 566326485 566573715 566815338 566979027 566694527 566538048
1335.7 566538048 566010666 565218353 564827766 564157104 563784065 564534683 565740051 566193581 566110497 565912247
1345.3 565912247 565263481 564295120 563029938 561975937 561122932 560523338 559741287 559048042 558823242
1354 558823242 558542366 558096313 557338905 556878548 556709709 556507645 556012802 555619087 556164093 556384888
1363.7 556384888 556929016 557608986 557504539 557385635 557181053 556885643 556164284 555239296 554823914 554387817
1373.3 554387817 553508606 552865639 553340645 553915596 554175987 554322701 554232903 554083366 554211845 554595184
1382.9 554595184 554387321 554339066 554649124 554366760 554094467 554753609 555441093 555280190 554620361 553630905
1392.6E53630905j036415j431770j626663m56772o52848r94186j292458m01496q8082
1401.3E45650215r97696j218033j262893j943665j221199n31998n43403o75049q18062
1409.9E36438217n22919l97224j053467q27751o80580r49822r30748p28416N4016j769714
1419.6E28631592n1079J005669p4654j73416q57544M3411K70004m75387j84517j27678
1429.2E28006401M07600o1073P36275R15375L82003R64432L29666o74286K69623J468468
1438.9E32744484J063652R76486J318512P69844J064797O09932J166038J330223R20105
1447.6E41964073J012459J448708J501197N25208J417045J269265J375656J856727
1455.3E52370338J054612L31802K48985L615990K293205K098580J614799R96437J551628
$$ plain form
1392.6 553630905 552594490 551162720 549536057 549079285 548426437 547432251 546139793 545738297 545650215
1401.3 545650215 544652519 543434486 542171593 540227928 539006729 538474731 537931328 537256279 536438217
1409.9 536438217 535915298 535518074 534464607 533636856 532956276 532006454 531075706 530347290 530401306 528631592
1419.6 528631592 528580513 529586182 529511528 529338112 528480568 528523979 528793983 528318596 528134079 528006401
1429.2 528006401 528414001 528352928 529089203 530004578 530386581 531351013 531680679 531006393 531276016 532744484
1438.9 532744484 533808136 534784622 536103134 536872978 537937775 538547707 539713745 541043968 541964073
1447.6 541964073 542976532 544425240 545926437 546451645 547868690 549137955 550513611 552370338
1455.3 552370338 553424950 553756752 554005737 557621727 559914932 562013512 563628311 564624748 566176376
1464E66176376P30820K347946K122421J943207J496125J101264J675492k20490l70865
1472.6E77002296J434708Q52699J327057M67148J008301J011124N12924L36494j4839
1481.3E83937912L10554N33715J53579j81083L0174p46880l94248O25190r25102n37338
1491E82806473N31463N85328j78833l0976L31459k648926J70174j0071j026764K59018
1500.6E80788345l051P7362K26135P20062O17867l536644o039543K266044K214546
1509.3E77331123M59175Q20504Q6937K51312J025162M58679N66940q3504j973686J243057
1518.9E80185699J465035k296410k942581J327629K371979J415215q34656N00984Q40950
1527.6E82033844j31378o13976m54254o45637n02129j081276j534309J844597O87027
$$ plain form
1464 566176376 566907196 569255142 571377563 573320770 574816895 575918159 577593651 577373161 577002296
1472.6 577002296 578437004 579289703 580616760 581083908 582092209 583103333 583616257 583952751 583937912
1481.3 583937912 584248466 584782181 584935760 584754677 584784851 584037971 583643723 584268913 583343811 582806473
1491 582806473 583337936 583923264 583744431 583713455 584044914 581395988 581566162 581556091 580529327 580788345
1500.6 580788345 580785294 580862656 581088791 581808853 582426720 578890076 572850533 575116577 577331123
1509.3 577331123 577790298 578610802 578697739 578949051 579974213 580432892 580999832 580916328 578942642 580185699
1518.9 580185699 581650734 579354324 576411743 577739372 580111351 581526566 580691910 581192894 582033844
1527.6 582033844 581902466 581288490 580834236 580188599 579686470 578605194 577070885 578915482 579602509
1536.3E79602509J49421J031952l161697o295433K622070J360054j476860Q56476L4256
1545E74722748r57871J065483j39885M3984j045837j895257O17104L57323k41471l334808
1554.6E69191513p45811J225586N0964p570267l339882M271050K351265J599388k02408
1563.3E66831398l57170j465798p32994j88484p44896l85208l270111J213760J026841
1572E61927338j10093m79736l40156l52402n246658J808280O67992q31795q01086r30100
1581.6E55311584j66626n13954j26571r00307j082764j259231j065560o48536j698685
1590.3E47849350o29730q41866k60582n36346r20410m25492j175880o82221q68225
1599E41508598k55699j024856p45087k73666m92897J50718n72319R9487o33888P1182
$$ plain form
1536.3 579602509 579751930 580783882 577622185 571326752 573948822 575308876 573832016 574688492 574722748
1545 574722748 573764877 574830360 574690475 574734459 573688622 571793365 572410469 572767792 572526321 569191513
1554.6 569191513 568445702 569671288 569722252 562151985 558812103 563083153 565434418 567033806 566831398
1563.3 566831398 566474228 565008430 564275436 564086952 563342056 562956848 559686737 560900497 561927338
1572 561927338 561817245 561337509 560997353 560644951 555398293 557206573 557874565 557042770 556241684 555311584
1581.6 555311584 555144958 554631004 554504433 553604126 552521362 551262131 550196571 549548035 547849350
1590.3 547849350 547219620 546377754 546117172 545580826 544660416 544234924 543059044 542376823 541508598
1599 541508598 541252899 540228043 539482956 539209290 538716393 538867111 538294792 538394279 537760391 537831573
1608.6E37831573j94816n58510M01917n38712J46523m21524P14187m0130j912117K166137
1618.2E37594528R54209J394577K82363P65343M26483j572685O52962L19252P92694
1626.9E41609726l6507M56505J141472P49168K31514k12936N58586N45311k672615
1635.6E42370224m90837J703567Q42781P02248Q08907N06172N11169l34511K49482
1644.3E46869202j41297j754303l34930P62634J653786O90575J236419K140885J964836
1653E53087807q836441K113342J582298J48125L4408n9280J58882k15149K39716l3531
1662.6E48220177j097107Q72841K74810j19171J85814P04498j760025q96492J125641
1671.3E47510986o59370J082382J250458k976j434135N29251P33490l40996m6310j530991
$$ plain form
1608.6 537831573 537636757 537078247 537480164 536941452 537087975 536666451 537380638 537340508 535428391 537594528
1618.2 537594528 538548737 539943314 540225677 540991020 541417503 539844818 540497780 540817032 541609726
1626.9 541609726 541573219 542029724 543171196 543920364 544151878 543938942 544497528 545042839 542370224
1635.6 542370224 541879387 543582954 544425735 545127983 545936890 546443062 546954231 546619720 546869202
1644.3 546869202 546727905 544973602 544638672 545401306 547055092 547745667 548982086 551122971 553087807
1653 553087807 544251366 546364708 547947006 548095131 548129539 548070259 548229141 548013992 548253708 548220177
1662.6 548220177 547123070 547995911 548270721 548151550 548337364 549041862 547281837 546385345 547510986
1671.3 547510986 546851616 547933998 549184456 549181480 547747345 548276596 549010086 548669090 548622780 547091789
1680.9E47091789K71874J327934Q24203l422698j525116K056579O714n21011j26953
1689.6E45983315r48220l61442l24326j70669o16112m61388l961334J098442J685486
1698.3E41923752Q21724L09829o093063L749161J182060J09329J93787Q33130J987533
1707E45017242Q70133K586822J682167K135048K169991J952629K668228J487579L346406
1715.6E63916245K201728M429589M464721L926010M228783L856201M583626L430443
1723.4E95037346M355888L487358L728447M280701L631783M037933L358879M008598
1731.1F25926933L222161K844467K348747K744408M024887L281708K715759K437362
1738.8F49546432K439042K239456L722992K821274J614456K386627K508697K387619
$$ plain form
1680.9 547091789 547363663 548691597 549515800 546093102 544567986 546624565 546631279 546110268 545983315
1689.6 545983315 545035095 544673653 544349327 544178658 543562546 543101158 539139824 540238266 541923752
1698.3 541923752 542745476 543055305 536962242 540711403 541893463 542002792 542196579 543029709 545017242
1707 545017242 545887375 548474197 550156364 552291412 554461403 556414032 559082260 560569839 563916245
1715.6 563916245 566117973 570547562 575012283 578938293 583167076 587023277 591606903 595037346
1723.4 595037346 599393234 602880592 606609039 610889740 614521523 618559456 621918335 625926933
1731.1 625926933 629149094 631993561 634342308 637086716 641111603 644393311 647109070 649546432
1738.8 649546432 651985474 654224930 657947922 660769196 662383652 664770279 667278976 669666595
1746.5F69666595J589356J859589R86099K650680K296830J381607L404159K039261
1754.2F85874176J646194J734620M57534J370240J571884J087112J384583K46658O44455
1762.9F96017456K231293J616440J313476J210480R75113k55890J345062K623749K01111
1771.6G07278290j538925M71649K867965J684113N05600K159576J023179Q95156M50516
1780.3G15797119j18255Q96759J063766J102219j67008Q03223J583557R19342N10178
1788.9G22390900J081237R77250j12763j139984M86679K388535K82745k77863J014176
1797.6G27090912O07605R2773l18374J461105Q3466q8120P16248o7292K89231J57623
1807.3G30025177J74561K21405M58602p53860k51694P17774L66211N07354m75921J33972
$$ plain form
1746.5 669666595 671255951 673115540 674101639 676752319 679049149 680430756 683834915 685874176
1754.2 685874176 687520370 689254990 689712524 691082764 692654648 693741760 695126343 695373001 696017456
1762.9 696017456 698248749 699865189 701178665 702389145 703364258 703108368 704453430 707077179 707278290
1771.6 707278290 705739365 706211014 709078979 710763092 711268692 713428268 714451447 715346603 715797119
1780.3 715797119 715678864 716575623 717639389 718741608 718574600 719377823 720961380 721880722 722390900
1788.9 722390900 723472137 724449387 724336624 723196640 723683319 726071854 726354599 726076736 727090912
1797.6 727090912 727698517 727791290 727472916 728934021 729017487 728929367 729645615 729578323 729867554 730025177
1807.3 730025177 730199738 730421143 730879745 730125885 729874191 730591965 730958176 731465530 730989609 731123581
1816.9G31123581k31552k20185K17515n07737N87235k4872K65579M86298j426163L6011
1826.5G30305710P92999M36707n48249j838379L49274J268692q39j98593K35595K98691
1836.2G31101608j71432q54187K56881k69165j75476m84390o7749N24979k881775J215668
1845.8G28194962J385192j01547k81219k08206J8157m59213P2708n37338l00827K48337
1855.5G28031006J81427K52228l89710M0283j43127J27716m53949q69827j82648k94647
1865.1G26298752j01929m07867M56085n39398j079865P77893O28891J03607p09075
1873.8G25427094l72315p6675N2871k37732k79388J16653n5542M55628k24762m26025
1883.4G24379807n16205l35388M04891n22537l29437j74103o79016P7057N85251n7984
$$ plain form
1816.9 731123581 730892029 730671844 730889359 730381622 730968857 730943985 731209564 731695862 730269699 730305710
1826.5 730305710 731098709 731535416 730987167 729148788 729498062 730766754 730765915 730567322 730802917 731101608
1836.2 731101608 730930176 730075989 730332870 730063705 729888229 729403839 729336090 729861069 726979294 728194962
1845.8 728194962 729580154 729478607 729197388 728989182 729007339 728548126 728620834 728083496 727782669 728031006
1855.5 728031006 728212433 728464661 728074951 728115234 727972107 728099823 727645874 726776047 726593399 726298752
1865.1 726298752 726196823 725788956 726245041 725705643 724625778 725403671 726032562 726136169 725427094
1873.8 725427094 725054779 724978104 725030975 724793243 724513855 724630508 724574966 725030594 724805832 724379807
1883.4 724379807 723863602 723528214 723933105 723410568 723081131 722907028 722228012 722305069 722890320 722832336
1893.1G22832336j87454J09253l94668K97012j56860n15442m11225o44912o4393P0115
1902.7G20933762J38168o0043J99356R4299n55725n59692k75116m64707n94330J20774
1912.4G18976746j90583L62854M52805j15585L59115j258316r16366L35006L08304
1921.1G18313980k9983p26929k56195J32294K70385L9978J602k64968p4616q6441n71442
1931.7G16747665l46908p82471O4392L52860j12610J48773k17590k89612j93939M44336
1941.3G15814896n61905j539688L61633L39966l40424l08075P6065l891j8234N9738
1951G13880081r6588j93100k03552k84348m23355L0060j54572l26232P62K31705m8828
1961.6G12412033l26462N9738n69915l74222j00479o48957k65884k212J37863p2098
$$ plain form
1893.1 722832336 722644882 722754135 722359467 722656479 722499619 721984177 721572952 720928040 720863647 720933762
1902.7 720933762 721071930 721011887 721211243 721305542 720749817 720190125 719915009 719450302 718855972 718976746
1912.4 718976746 718786163 719149017 719601822 719486237 719845352 718587036 717670670 718005676 718313980
1921.1 718313980 718283997 717557068 717300873 717433167 717703552 717743530 717745132 717480164 717405548 717319107 716747665
1931.7 716747665 716400757 715618286 715682678 716035538 715922928 716071701 715854111 715564499 715370560 715814896
1941.3 715814896 715252991 713713303 714074936 714414902 714074478 713766403 713842468 713838577 713820343 713880081
1951 713880081 713783493 713590393 713386841 713102493 712679138 712709198 712554626 712228394 712229156 712460861 712412033
1961.6 712412033 712085571 712145309 711575394 711201172 711100693 710451736 710185852 710183640 710321503 710249405
1971.2G10249405L08075J53122m12750l95432k90375K01035j38931l65296m30832j17569
1980.8G08760452o6070m43039K9449n2948l2501k49023l12500k26136l45993L22342
1990.5G07384033O0806j002883o29807M59137L50113J61362Q7280k98843p7744k26440
2000.1G06267014k17438k62222r7275k71149m81720P2632N8899R1553k21177K3041
2009.8G04962158j18027o69479k52991l99398l81089q9035R7885l56674k9602L72009
2019.4G03135757m7531J21231l31344j22376k41012n29938j18179l46146m03595l6011
2029.1G01080856N95398K289k16064j51978k74124k59323r66644j69526j4190k70310
2038.7F99356384P5989Q0948L10440J45798j02310p61872j56708K39869j97907j84631
$$ plain form
1971.2 710249405 710557480 710710602 710297852 709902420 709612045 709813080 709674149 709308853 708878021 708760452
1980.8 708760452 708694382 708251343 708280792 708227844 708195343 707946320 707633820 707407684 707061691 707384033
1990.5 707384033 707444839 706441956 705812149 706271286 706621399 706782761 706870041 706571198 706493454 706267014
2000.1 706267014 706049576 705787354 705690079 705418930 704937210 705009842 705068741 705160294 704939117 704962158
2009.8 704962158 704844131 704174652 703921661 703522263 703141174 703052139 703150024 702793350 702763748 703135757
2019.4 703135757 703088226 703209457 702878113 702755737 702514725 701984787 701866608 701520462 701116867 701080856
2029.1 701080856 701676254 701678543 701462479 701310501 701036377 700777054 699810410 699640884 699626694 699356384
2038.7 699356384 699432373 699513321 699823761 699969559 699867249 699105377 698948669 699188538 698990631 698806000
2048.4F98806000l34473m7378k96250L7766J34582N6458J04522o20422m38003m47236
2058F96955566j88293N035k47650k05002m577K05688J10169O3781n17196o485J51138
2068.6F96322174n22308l20969l28598m6692R9869K91214O4163K9602j70135q18634
2078.2F94599686j57471l19672l69644l7765k73972l87039q0948K56958l30734l66745
2087.9F92532654l08914k06452l72467o61011m24346m02222j068j8006K67716J25198
2097.5F90531082j46637K8839l33862J6479l01208m58527l72390n61982L5630N02777
2107.2F88940201L16391j61133r460j90964j31073l88413o16073K80990K17057n0888
2116.8F88206635m28544j33056K25830K94876N22003l33938k18888j88522m65164k72904
$$ plain form
2048.4 698806000 698471527 698424149 698127899 698165665 698300247 698356705 698461227 697840805 697402802 696955566
2058 696955566 696767273 696772308 696524658 696319656 696315079 696520767 696630936 696694717 696177521 696171036 696322174
2068.6 696322174 695799866 695478897 695150299 695103607 695203476 695494690 695558853 695588455 695418320 694599686
2078.2 694599686 694442215 694122543 693752899 693715134 693441162 693054123 692973175 693230133 692899399 692532654
2087.9 692532654 692223740 692017288 691644821 690983810 690559464 690157242 690156174 690138168 690405884 690531082
2097.5 690531082 690384445 690413284 690079422 690095901 689794693 689336166 688963776 688401794 688437424 688940201
2107.2 688940201 689256592 689095459 689085999 688895035 688763962 688375549 687759476 688040466 688257523 688206635
2116.8 688206635 687778091 687645035 687870865 688165741 688687744 688353806 688134918 687946396 687481232 687208328
2126.5F87208328l03344k15912j62278K52991J80435Q3313j03988k21863R9335k72904
2136.1F86544113p42264n43136l662q7815Q7815J72424K15454K16446m13055N0354
2145.8F85496674R0484m27246n78689l99170l00751o00510k1896L28522L32031J59454
2155.4F84078903O6910j08948m86068j51520k21939l75672l83987p0877J33285J31913
2165F82612000K21939j06430j41526l56292m23356p91244o86646K5177L205J88675
2174.7F80545502J02234L59420L9444m09546r1400m54635n36423m83627r1172j25732
2184.3F78854065k92358J58538K68402L43247j23825l85056j18408j4572m14047n15671
2194F77760315j64108k91901k09579J18713O44302K44370l37753N264j51978o75583
$$ plain form
2126.5 687208328 686904984 686689072 686526794 686779785 686960220 687043533 686939545 686717682 686817017 686544113
2136.1 686544113 685801849 685258713 685255051 685167236 685255051 685427475 685642929 685859375 685446320 685496674
2145.8 685496674 685587158 685159912 684581223 684182053 683881302 683280792 683258896 683587418 683919449 684078903
2155.4 684078903 684145813 684036865 683550797 683399277 683177338 682801666 682417679 682346802 682480087 682612000
2165 682612000 682833939 682727509 682585983 682229691 681806335 681015091 680328445 680353622 680356827 680545502
2174.7 680545502 680647736 681007156 681046600 680637054 680545654 680091019 679554596 679070969 678979797 678854065
2184.3 678854065 678561707 678720245 678988647 679331894 679208069 678823013 678704605 678690033 678275986 677760315
2194 677760315 677596207 677304306 677094727 677213440 677857742 678102112 677764359 677769623 677617645 676942062
2203.6F76942062o33316J05591L6545k48184k31858k00424P9346L3874q7432l73230
2213.3F75422974k03247k29950k22474j24511m77371m30222m47311K89840L33329k37275
2222.9F73673782j34048k32315l27377k82288K15378l65601n23071N112j96991P5454
2232.5F71908035J42899J92413k09732m84314n47867m62341p7667l46680j52435l9139
2242.2F69923172J00250K3346n5847j64795m62952k9602j99356j11999l77884m13818
2251.8F68230515J83486L8910p9345k34223R1324m00467n23910j52665l56597l55683
2261.5F66441345m53415J92414L1967Q3694K823l60489J74942K4338J23596m60052
2271.1F65801163m92478k98690n28946j81122k17743J64337q0185j05591p6675j02310
$$ plain form
2203.6 676942062 676308746 676414337 676450882 676202698 675970840 675770416 675849762 675883636 675796204 675422974
2213.3 675422974 675219727 674989777 674767303 674642792 674165421 673735199 673287888 673577728 673911057 673673782
2222.9 673673782 673539734 673307419 672980042 672697754 672913132 672547531 672024460 672029572 671832581 671908035
2232.5 671908035 672050934 672243347 672033615 671549301 671001434 670539093 670461426 670114746 669962311 669923172
2242.2 669923172 670023422 670046768 669990921 669826126 669363174 669333572 669134216 669022217 668644333 668230515
2251.8 668230515 668414001 668452911 668373566 668139343 668230667 667830200 667306290 667153625 666797028 666441345
2261.5 666441345 665987930 666180344 666212311 666296005 666298828 665938339 666113281 666137619 666261215 665801163
2271.1 665801163 665308685 665009995 664481049 664299927 664082184 664246521 664166336 664060745 663984070 663881760
2280.8F63881760j31989k66952J62429n13229m83475m69589k02484O87m56009K33612
2290.4F61754761j24283k91138n32074l23028l20130q12683M8294j06048M24041j21612
2300F59596100p28073m15039p26471K73514k21329n69382n07126m19006p7896n81284
2309.7F55624008l15018o59713n01480k29187o5461P9499r3460k97699j056900r71146
2319.3F51513443j397781o38886M43573J70899q92640j536102J55411k29340q60138
2328F46728439n90744L2883K19955n25817j145m65011q94242j216659m8447K75116
2337.7F43514328M654M78210j171646n57708Q7890L89404j79901j78070J186600Q40607
2347.3F44414368J070709K17285n18036j142273j703949j049118q35724n2871n64499
$$ plain form
2280.8 663881760 663749771 663482819 663645248 663132019 662648544 662178955 661976471 661977158 661521149 661754761
2290.4 661754761 661630478 661339340 660807266 660484238 660164108 659351425 659399719 659293671 659717712 659596100
2300 659596100 658868027 658452988 657726517 658000031 657778702 657209320 656702194 656283188 656205292 655624008
2309.7 655624008 655308990 654649277 654147797 653918610 653853149 653932648 653839188 653541489 652484589 651513443
2319.3 651513443 650115662 649476776 649920349 650091248 649198608 647662506 647817917 647588577 646728439
2328 646728439 646137695 646170578 646390533 645864716 645863571 645398560 644504318 643287659 643239212 643514328
2337.7 643514328 643518982 643997192 642825546 642267838 642355728 642745132 642565231 642387161 643573761 644414368
2347.3 644414368 645485077 645702362 645184326 644042053 642338104 641288986 640453262 640400391 639835892
2356F39835892j307678j566430j354217l12500K34108M4136k41013o1531j665382j45989
2365.6F33459396J475373J083908Q42247O88286J194458J86576Q77076N63926j08490
2374.3F40262756Q82874N90820K29492J86997M42657J60981N07736P54318J36719L357
2383.9F44158707n3254K86484k9068j48773k2659m9134l4179m84772m1656k58179m59213
2394.6F42864304k14005l51868j66473k02866K68860n4855q00858n91125j17111P3852
2404.2F40707855O4316K25220j39008k34909m93393o16913k33650l16925k58255k04124
2413.8F38500214n6076k13128j28364K11182N8403l90397p01484k13700k18238l15667
2423.5F36532745l55949j75667K09236q1558K22473J3390m68407l49617l12233l43895
$$ plain form
2356 639835892 638528214 636961784 635607567 635295067 635529175 635573311 635332298 635270767 633605385 633459396
2365.6 633459396 634934769 636018677 636860924 637549210 638743668 638930244 639807320 640371246 640262756
2374.3 640262756 641145630 641736450 641965942 642152939 642595596 642756577 643264313 644018631 644155350 644158707
2383.9 644158707 644105453 644391937 644362869 644214096 644191437 644142303 644108124 643623352 643581696 643323517 642864304
2394.6 642864304 642650299 642298431 642131958 641929092 642197952 642143097 641342239 640751114 640634003 640707855
2404.2 640707855 640772171 640997391 640858383 640623474 640130081 639513168 639279518 638962593 638704338 638500214
2413.8 638500214 638444138 638231010 638102646 638313828 638372231 637981834 637280350 637066650 636848412 636532745
2423.5 636532745 636176796 636001129 636210365 636128807 636351280 636364670 635896263 635546646 635234413 634890518
2433.1F34890518k40211J4114k84576k68784l90167l21884N2948j37635O0311j55258
2442.8F33219376l23639m97551n24369J24741k17552o42281j81770K83966J21155j30844
2452.4F31231232j63803j63689j99432k94114k76718o35795n08919M3907R9831j6175
2462.1F29116325j35994k8228o6491j86004k97051m61578m05121l38135l52249j30806
2471.7F26714668K32430K59743O0691k34832j50414k68936p59316m68826n6343K6627
2481.3F25355492k12098n36918l63159J87225L52249r0408k49367j93176l02277n02319
2491F23445244m94118n83725m70962N7907J37024L20167K47116o1493k39792m63485
2500.6F21893883k92626k88620m56237m51622j2551J97487k4185k08130j89095r346
$$ plain form
2433.1 634890518 634650307 634664421 634379845 634111061 633720894 633399010 633451958 633314323 633374634 633219376
2442.8 633219376 632895737 632398186 631873817 631998558 631781006 631138725 630956955 631240921 631362076 631231232
2452.4 631231232 631067429 630903740 630704308 630410194 630133476 629497681 628988762 629032669 629132500 629116325
2462.1 629116325 628980331 628952103 628885612 628699608 628402557 627940979 627535858 627197723 626845474 626714668
2471.7 626714668 626947098 627206841 627267532 627032700 626882286 626613350 625854034 625385208 625328865 625355492
2481.3 625355492 625143394 624606476 624243317 624430542 624782791 624692383 624443016 624249840 623947563 623445244
2491 623445244 622951126 622367401 621896439 621954346 622091370 622411537 622658653 622597160 622357368 621893883
2500.6 621893883 621601257 621312637 620856400 620404778 620392227 620589714 620565529 620357399 620168304 620158958
2510.3F20158958m17900j91497j44501n57633k22091J1215L40881p1449l60489l18947
2519.9F18226547l38974L60070j17264p26967m78554j58310K53220n3292n55801l51524
2529.6F16059151J21536K59438J30958l57056m78935j90658l44658m37699l66211R652
2539.2F14405518L50875N3826k22321m8370j06354l06778j90124l50533k29721l2387
2548.9F13323631k83279j3657K07405k81143l41797P6027J01052j06507n00564m91257
2558.5F11689911m97437m93278J23253p5875k2049L08190m7226n0545j36604l53317
2568.1F10445023m38614m25034l44772j27182j01280m5777L82576J57623j14135j44768
2577.8F09243660j07231J068l42941p07550o37055k00462n493K17209J14860m67110
$$ plain form
2510.3 620158958 619741058 619549561 619405060 618847427 618625336 618636551 618977432 618905983 618545494 618226547
2519.9 618226547 617887573 618247643 618130379 617403412 616924858 616766548 617019768 616966476 616410675 616059151
2529.6 616059151 616180687 616440125 616571083 616214027 615735092 615544434 615199776 614762077 614395866 614405518
2539.2 614405518 614756393 614810219 614587898 614539528 614433174 614126396 613936272 613585739 613356018 613323631
2548.9 613323631 613040352 613026695 613234100 612952957 612611160 612687187 612788239 612681732 612181168 611689911
2558.5 611689911 611192474 610699196 610822449 610746574 610724525 611032715 610985489 610934944 610798340 610445023
2568.1 610445023 610006409 609581375 609236603 609109421 609008141 608962364 609344940 609502563 609388428 609243660
2577.8 609243660 609136429 609137497 608794556 608087006 607449951 607249489 607243996 607461205 607576065 607108955
2587.4F07108955j38931M03671o0157n66597l82500j98250j53923m65889l03345L19596
2597.1F05562630J74331j46980l27797K84577K68364m41857k08015k87972m75998o31637
2606.7F03769646j72119M06990J10015P5799O675k58293l15933L0784l07540o70319
2616.4F02675705l60298k71416K29416J77498j18637j54877m1008M9820l11699j7509
2626F01856995M0474l04490n72357l45077L22342L96080N0811m31404j60217J04790
2635.6F00957947j0071l45383m13627J99852Q506j54991l33709k99721O8168j25007
2645.3E99551964k20299l68957p6333J0682p7134n8288j54534N4627j62315k75231
2654.9E98224182l85704O0005L63045k57225o0043j86997n40275l61367n1345K87170
$$ plain form
2587.4 607108955 606970024 607373695 607313538 606746941 606364441 606166191 606012268 605546379 605243034 605562630
2597.1 605562630 605736961 605589981 605262184 605546761 605815125 605373268 605165253 604877281 604401283 603769646
2606.7 603769646 603597527 604004517 604114532 604190331 604197006 603938713 603622780 603653564 603346024 602675705
2616.4 602675705 602315407 602043991 602273407 602450905 602332268 602177391 602136383 602186203 601874504 601856995
2626 601856995 601897469 601592979 601020622 600675545 600997887 601393967 601444778 601013374 600853157 600957947
2635.6 600957947 600947876 600602493 600188866 600388718 600397224 600242233 599908524 599608803 599676971 599551964
2645.3 599551964 599331665 598962708 598886375 598897057 598819923 598761635 598607101 598661728 598499413 598224182
2654.9 598224182 597838478 597898483 598261528 598004303 597944260 597757263 597216988 596855621 596804276 597091446
2664.6E97091446J09711p1984j29814j07689j47209m60129l12080J40419j26991l69263
2674.2E95616417j31378j17607Q5754K37350o5841l69263j14593r3880m98657N951
2683.9E94554253K30293m04167m55857j2817k76222n13344J05553J77574j78528j91002
2693.5E93035736k03094m73748m19578o5880K7390k5139l64876k22931K39868L21007
2703.1E91848755m9133k85149j33553m03823j90506j31302k89650j76888m20608k80762
2712.8E89487381k05688L8299j41449l45116J77651j38550m63676m24958k1629j3161
2722.4E87949104l64074O4277p0190k30904k45285l77426l510k50206p58056k51389
2732.1E85462341K42997m3717j84517r9525m5738m08974o15769q926K41928M7684m43230
$$ plain form
2664.6 597091446 597201157 597129173 596999359 596891670 596744461 596284332 595972252 596112671 595985680 595616417
2674.2 595616417 595485039 595367432 595453186 595690536 595624695 595255432 595140839 595046959 594548302 594554253
2683.9 594554253 594784546 594380379 593924522 593911705 593635483 593122139 593227692 593405266 593226738 593035736
2693.5 593035736 592832642 592358894 591939316 591873436 591900826 591875687 591510811 591287880 591527748 591848755
2703.1 591848755 591799622 591514473 591380920 590977097 590786591 590655289 590365639 590188751 589768143 589487381
2712.8 589487381 589281693 589319992 589178543 588833427 589011078 588872528 588408852 587983894 587962265 587949104
2722.4 587949104 587585030 587649307 587579117 587348213 587102928 586725502 586721992 586471786 585713730 585462341
2732.1 585462341 585705338 585661621 585477104 585377579 585331841 584922867 584307098 584298172 584540100 584587784 584144554
2742.7E84144554l74489L41530J24092j41220j50337m41208l88946l91808m84848k30866
2752.3E82006454j10588m3640n1727k63290j89782k42996m07867j20507J49613O7863
2762E80793533j04904k94113k50244j15547l80173l89519q5983o6338k56614j86234
2771.6E78663864M5090p4310j58387n13534o57730j93444k7046l052l12309k90413
2781.3E76478729J25504j47324k98042o5422j87531l81698j66169j79519m20418k67487
2790.9E74490623p3890j44158j49154m2916k83317k38457o87m66423o99997n21965
2800.5E71869659o15463k93770J42174r804j90773m38423k98157M0245j0452j27449
2810.2E70067787n34973n28870m71077m80651j97335j88636p1106k21940N723J03111
$$ plain form
2742.7 584144554 583770065 584111595 584235687 584094467 583944130 583502922 583113976 582722168 582237320 582006454
2752.3 582006454 581895866 581852226 581800499 581537209 581347427 581104431 580696564 580576057 580725670 580793533
2762 580793533 580688629 580394516 580144272 580028725 579648552 579259033 579173050 579106712 578850098 578663864
2771.6 578663864 578708954 578634644 578476257 577962723 577304993 577111549 577084503 577081451 576769142 576478729
2781.3 576478729 576604233 576456909 576158867 576093445 575905914 575524216 575358047 575178528 574758110 574490623
2790.9 574490623 574416733 574272575 574123421 574080505 573797188 573558731 573558044 573091621 572391624 571869659
2800.5 571869659 571254196 570960426 571102600 571092796 570902023 570463600 570165443 570205688 570195236 570067787
2810.2 570067787 569532814 569003944 568532867 568052216 567854881 567666245 567595139 567373199 567378922 567482033
2819.8E67482033p61299o88553N2109n6115o56318n48554j87073J4229j33056n32341
2829.5E63985062j92871L9672J9341l37486p99713q19970p98340j80778J0605l63770
2839.1E60561752l48434m93279q68530p91435l84865m87595m82177n13268p65953n55611
2848.8E54870605k92549r4795j18484l96271l62244k4452l49007p79266l44620J36643
2858.4E52245560R0065k22054k06833j11961K44903K59362m19045m60891m38729k52800
2868.1E50727577k00386n48057k29607L6659l8070l82691m43687P4577P820m48036
2877.7E48556099l81203k62756m05846l19214k50740k83165j62887J06926o4125p11861
2887.3E45821228p74994l34511m2457k83280p09953o48575j87301o6834j85165l93944
$$ plain form
2819.8 567482033 566720734 566032181 566084290 566028175 565371857 564823303 564636230 564650459 564517403 563985062
2829.5 563985062 563792191 563831863 563851204 563513718 562714005 561894035 561095695 560914917 560925522 560561752
2839.1 560561752 560213318 559720039 558851509 558060074 557675209 557187614 556705437 556192169 555426216 554870605
2848.8 554870605 554578056 554483261 554364777 553968506 553606262 553581810 553232803 552453537 552108917 552245560
2858.4 552245560 552335625 552113571 551906738 551794777 552039680 552299042 551879997 551419106 550980377 550727577
2868.1 550727577 550527191 549979134 549749527 549786186 549748116 549365425 548921738 548996315 549004135 548556099
2877.7 548556099 548174896 547912140 547506294 547187080 546936340 546653175 546490288 546597214 546533089 545821228
2887.3 545821228 545046234 544711723 544669266 544385986 543676033 543027458 542840157 542773323 542588158 542194214
2897E42194214r77097o65245j84097l48473o76422j239967j135559n32990R308l63540
2906.6E36080132o89545l49884m00200j04942n16587q59527o19850q91495o65169n11055
2916.3E30471878m16450j54877j3886k26860l29590K51923K13242j84632j30348M8676
2925.9E29529076J24588N76629K83890l92456L41148O36940N09568M18167J76429J12114
2935.6E32316093N5314M37622M61654M35524N00145L38593J29013j66588k17056j62697
2945.2E34127617K50969K63748J1215j54571n41001k16827r0294m88663l46222o3552
2954.8E32752419j26267j1063L2578k55241k65732K1248L56254k01187p26433j30691
2964.5E31445885J62201p3662K05955L04489m20265j63345J92184J7319M53491L08724
$$ plain form
2897 542194214 541217117 540551872 540367775 540019302 539342880 538102913 536967354 536434364 536443672 536080132
2906.6 536080132 535390587 535040703 534640503 534535561 534018974 533159447 532539597 531648102 530982933 530471878
2916.3 530471878 530055428 529900551 529886665 529659805 529330215 529582138 529795380 529610748 529480400 529529076
2925.9 529529076 529653664 530230293 530514183 530121727 530462875 531099815 531609383 532027550 532203979 532316093
2935.6 532316093 532371407 532809029 533270683 533706207 534206352 534544945 534673958 534507370 534290314 534127617
2945.2 534127617 534378586 534642334 534653549 534498978 533957977 533741150 533650856 533162193 532815971 532752419
2954.8 532752419 532626152 532615089 532647667 532392426 532126694 532147942 532504196 532303009 531576576 531445885
2964.5 531445885 531608086 531534424 531740379 532044868 531624603 531461258 531653442 531670761 532124252 532432976
2974.1E32432976J2932J68495N12733N50537K58217R2240r5673J58195q3656j51138
2983.8E33855858N42641L54728M1695M12445M28925k5788k5329P6141J67046j25161
2993.4E35703201m17480K97432N25932K05994l17612n85670j64109J50261M16985J22299
3003.1E35937233l87611m77829j58043j6136k03515P7858J66436J50222K2545j81999
3012.7E34929161L014j85166n11398m93469l55377l29628j22948L013l84788m76303
3022.4E32076111P1297K80151m09279n02357J64070L0746l03726j09406k46658n38826
3032E30512123j14174K3194l60108l16276j06697k93618m62417j17874l8338l70102
3041.6E28355713l24631q7852k16942m99420k56996J53160R3269k10457o11534l52402
$$ plain form
2974.1 532432976 532445908 532614403 533127136 533677673 533935890 534028130 533932457 534090652 534006996 533855858
2983.8 533855858 534398499 534753227 534794922 535207367 535636292 535610504 535585175 535661316 535828362 535703201
2993.4 535703201 535285721 535583153 536109085 536315079 535997467 535411797 535247688 535397949 535814934 535937233
3003.1 535937233 535549622 535071793 534913750 534897614 534694099 534771957 534938393 535088615 535111160 534929161
3012.7 534929161 534932175 534747009 534235611 533742142 533386765 533057137 532934189 532937202 532552414 532076111
3022.4 532076111 532147408 532427559 532018280 531515923 531679993 531710739 531407013 531297607 531050949 530512123
3032 530512123 530397949 530421143 530061035 529744759 529638062 529344444 528882027 528764153 528725815 528355713
3041.6 528355713 528031082 527943230 527726288 527226868 526969872 527123032 527216301 527005844 526394310 526041908
3051.3E26041908K49672k42805m96750n62668o70357J86730m8256m55590k66952k43683
3060.9E23491249j57280p10373m21066q0681l42522K0447m1923l67585n40771l19405
3070.6E20530090l25966o57463n12657k41661N3635o3362k42119j16348L6964P1335
3080.2E18532448j10130n64576n76820j50032l16582r1972l81203o41098Q1062M6349
3089.9E15827446J39732l41911p30743l08037j79215L0632o51817o96487K48146L87687
3099.5E13725433k65731o08483j79138R0675K27166k4491J04332q4534p43141k28347
3109.1E12013741k4949n2681L2158K01493K23236j06240k61459o47964K11525P80983
3118.8E12369843j9875l7003J946k97051l76243o8665R995O6490L08189R1668J08108
$$ plain form
3051.3 526041908 526291580 526048775 525552025 524989357 524319000 524505730 524457474 524001884 523734932 523491249
3060.9 523491249 523333969 522623596 522202530 522121849 521779327 521799774 521757851 521390266 520849495 520530090
3070.6 520530090 520204124 519546661 519034004 518792343 518845978 518782616 518540497 518424149 518461113 518532448
3080.2 518532448 518422318 517857742 517280922 517130890 516814308 516722336 516341133 515700035 515781097 515827446
3089.9 515827446 515967178 515625267 514894524 514586487 514407272 514437904 513786087 513089600 513337746 513725433
3099.5 513725433 513459702 512851219 512672081 512762756 512989922 512965431 513069763 512985229 512242088 512013741
3109.1 512013741 511988792 511936111 511968269 512169762 512392998 512286758 512025299 511377335 511588860 512369843
3118.8 512369843 512349968 512312965 512314911 512017860 511641617 511572952 511582947 511649437 511957626 512049294 512157402
3129.4E12157402l1967l47252k38342j53809m4823O3668K823L40461O20346l21083
3139E12047424r69238m15039p4616k07328J39885N50995j75248n12504J59836J90658
3148.7E10734825k10686k76260k32048r3422J09825j37405l35999n08995o15921j5220
3158.3E08418694P5759l08036l84484k37007Q2016Q6632j03226l49998l75405p6713
3168E06828232J1864k79160l34206J77689o8016n91698j99356j87149n32684j91574
3177.6E04633942K47955k06184q33550m58527j12648o1950N33409Q4801q35762n17006
3187.3E02474480m95453n92957k69661k04811k78702l38859m8866j58234l47672j37672
3196.9D99601593m98734m86984j64184L4790O9427o46934n95055J13983l2196n32417
$$ plain form
3129.4 512157402 512125435 511778183 511539841 511386032 511341209 511404877 511407700 511748161 512368507 512047424
3139 512047424 511078186 510663147 510588531 510381203 510521088 511072083 510896835 510384331 510544167 510734825
3148.7 510734825 510524139 510247879 510015831 509922409 510032234 509894829 509558830 509049835 508433914 508418694
3158.3 508418694 508494453 508186417 507801933 507564926 507646942 507733574 507630348 507280350 506904945 506828232
3168 506828232 506840096 506560936 506226730 506404419 506336403 505744705 505545349 505358200 504825516 504633942
3177.6 504633942 504881897 504675713 503842163 503383636 503270988 503209038 503742447 503827248 502991486 502474480
3187.3 502474480 501979027 501386070 501116409 500911598 500632896 500294037 500245171 500086937 499739265 499601593
3196.9 499601593 499102859 498615875 498451691 498486481 498555908 497908974 497313919 497427902 497395706 496863289
3206.5D96863289l35961K15188l24135r80644n19677k07252m86145o43006j80015J42021
3216.2D93543663j1406j51443n81513p65533k82784o3095j90163m41436l89214l6240
3225.8D90630836m0359q77j2780n64537n67512P0495j09634m47464l05901l94592m33273
3236.4D87824402n34172l58238n1232q5182j02959l92608j02310Q010n59616l60985
3246.1D85285110m42886p46117m77523p8888m7608l9253R0752l93906k11449L11699
3255.7D83249931j83258p06558p26013m66538L8948J58234p16400o32973K22969N1995
3265.4D80290337j20278l07998j34621K48260j02424l78723m63410k68745m57421o82296
3275D77622681O2637O5804l58201n24711p57141J56746J92871p51877o5041K8267p36007
$$ plain form
3206.5 496863289 496527328 496742516 496418381 495437737 494918060 494710808 494224663 493581657 493401642 493543663
3216.2 493543663 493532257 493380814 492799301 492033768 491750984 491687889 491497726 491056290 490667076 490630836
3225.8 490630836 490590477 490589600 490576820 490012283 489444771 489515266 489405632 488958168 488652267 488257675 487824402
3236.4 487824402 487290230 486931992 486880760 486795578 486692619 486300011 486197701 486205711 485646095 485285110
3246.1 485285110 484842224 484096107 483618584 483539696 483492088 483452835 483543587 483149681 482938232 483249931
3255.7 483249931 483066673 482360115 481634102 481167564 481206512 481364746 480648346 480015373 480238342 480290337
3265.4 480290337 480170059 479862061 479727440 479975700 479873276 479494553 479031143 478762398 478304977 477622681
3275 477622681 477685318 477751122 477392921 476868210 476111069 476267815 476460686 475708809 475643768 475672035 474936028
3285.6D74936028m57573l1014J46408p5455m72183l56292l71438o48803l29705n7334
3295.3D72282639j76392k02828k54249n72662r73740n47257l77540o60782k94189j21384
3304.9D68101616J08414J04560m69512p29256m58450o48880r35097L4523q9836p97234
3314.6D64220848l95393n99938n35087J9264k6360n90477j005287q20350m45748j29089
3324.2D59692383k88544r54246j288948o90575k6779r842m32053p20138p09496n11742
3333.8D54060020k66151q70590q49190l82042n97725n10063p21092m98505n14984p53708
3343.5D48095970o48765j252175p48329k79999r15413j038208m54483l0403o26983
3352.2D42101212q07877l84064m01497q99810r26705p13692j159820r34830n64346
$$ plain form
3285.6 474936028 474478455 474447441 474593849 474518394 474046211 473689919 473318481 472669678 472339973 472282639
3295.3 472282639 472106247 471903419 471649170 471076508 470102768 469555511 469177971 468517189 468223000 468101616
3304.9 468101616 468210030 468314590 467845078 467115822 466657372 466008492 465073395 465107918 465018082 464220848
3314.6 464220848 463825455 463225517 462690430 462709694 462683334 462092857 461087570 460267220 459821472 459692383
3324.2 459692383 459403839 458449593 457160645 456470070 456443291 456433449 456001396 455281258 454571762 454060020
3333.8 454060020 453793869 452923279 452074089 451692047 451094322 450584259 449863167 449364662 448849678 448095970
3343.5 448095970 447447205 446195030 445446701 445166702 444251289 443213081 442758598 442728195 442101212
3352.2 442101212 441293335 440909271 440507774 439607964 438681259 437967567 436807747 435872917 435308571
3360.8D35308571p44324j018524r73549j16882Q7776q38890j176071n64995m48532
3369.5D29514580p95975r66682p65648o31218j279221r86137j69525l79105p53593
3378.2D22787476p97501o65855q56095r19685p26814l14293L7269m82597o72493o19049
3387.8D16770363p10526l10287m39873o53458n06286n67131p0267k45972p62825m62036
3397.5D12041702o38008l37105M197k61002p7133l03345q47053o47927l06701o06843
3407.1D08020782n49354m30451k86750q8578n79223m29459l23562m30413j90582j5640
3416.8D04696770r9640k77901N303n28031l87726j1902m71420l25088k97623L72009
3426.4D02674751L99285p286K41508k19345n28717k53792J5068k70195j32294m4670
$$ plain form
3360.8 435308571 434564247 433545723 432572174 432455292 432543068 431704178 430528107 429963112 429514580
3369.5 429514580 428718605 427751923 426986275 426355057 425075836 424089699 423920174 423541069 422787476
3378.2 422787476 421989975 421324120 420468025 419548340 418821526 418507233 418544502 418061905 417389412 416770363
3387.8 416770363 416059837 415749550 415309677 414656219 414149933 413582802 413512535 413266563 412503738 412041702
3397.5 412041702 411403694 411066589 411070786 410809784 410732651 410429306 409582253 408934326 408627625 408020782
3407.1 408020782 407471428 407040977 406754227 406665649 406086426 405656967 405333405 404902992 404712410 404696770
3416.8 404696770 404597130 404319229 404324532 403796501 403408775 403396873 402925453 402600365 402302742 402674751
3426.4 402674751 403074036 403066750 403308258 403088913 402560196 402306404 402321472 402051277 401918983 401874313
3436.1D01874313j65710J39770J58616j10131o57730j15967K77520N66558P45316Q1024
3445.7D02793579K57607l76091k3995J62163k89154L20320J8311N53779N52406j33857
3455.3D03835068J20048J32332J68572N06897Q50143p668j00746L99170K45476L69835
3465D06519127K23045J53694L4295M79278M60854M8217K96593N88799P31544n3444
3474.6D09482002j01318M79088O72569N27840o4545r7427L00178N62821J50528M79812
3484.3D12391548P25746N15328O69021J95923L95966N26619q0033k43644O05621J120148
3493.9D16822243O79512N62744j97868k58332N34897Q35953P47108M93775N91316j18065
3503.6D20693283o33926J4229J024017J347732Q42781Q0872N1727R08699M78821K77519
$$ plain form
3436.1 401874313 401708603 401848373 402006989 401896858 401239128 401123161 401400681 401967239 402712555 402793579
3445.7 402793579 403051186 402675095 402651100 402813263 402524109 402844429 402862740 403416519 403968925 403835068
3455.3 403835068 403955116 404087448 404256020 404762917 405613060 405605392 405504646 405903816 406149292 406519127
3465 406519127 406742172 406895866 406930161 407409439 407870293 407918510 408215103 408803902 409535446 409482002
3474.6 409482002 409380684 409859772 410532341 411060181 410995636 410898209 411198387 411761208 411911736 412391548
3484.3 412391548 413117294 413632622 414301643 414497566 414893532 415420151 415340118 415096474 415702095 416822243
3493.9 416822243 417501755 418064499 417866631 417608299 418143196 418979149 419726257 420220032 420811348 420693283
3503.6 420693283 420059357 420073586 421097603 422445335 423288116 423368988 423420715 424329414 424808235 425085754
3513.2D25085754L04795M46319P50847K80686P03468N50575m6768K19307R49745R66034
3522.9D30210762k88925K81486J000634M77180j03760N87616R46007M56085N22385
3531.5D34089470L95851M94728O46286J112099M47655R9906J112252N30624L33786
3540.2D39262657L86887L72619p9460O28090J544342M0627J21536k30713P70645J242981
3549.9D44060211J241265J415023q06312K66037M03633P53822J197853l738N29251
3558.5D49057045J45149R63669N81093P05185O14128m60587K094269J68343K25715
3567.2D54094009R21059j047783J615982J055680P58399R64432J105118k823m01268
3575.9D59062805J348267K83203O57082O33087j2246J072655J415215N28297j84479
$$ plain form
3513.2 425085754 425390549 425836868 426587715 426868401 427571869 428122444 428075676 428294983 429244728 430210762
3522.9 430210762 429921837 430203323 431203957 431681137 431577377 432164993 433111000 433567085 434089470
3531.5 434089470 434485321 434980049 435626335 436738434 437186089 437285995 438398247 438928871 439262657
3540.2 439262657 439649544 440022163 439942703 440570793 442115135 442155762 442277298 442046585 442817230 444060211
3549.9 444060211 445301476 446716499 445910187 446176224 446579857 447333679 448531532 448527794 449057045
3558.5 449057045 449202194 450165863 450746956 451452141 452066269 451605682 453699951 453868294 454094009
3567.2 454094009 455015068 453967285 455583267 456638947 457397346 458361778 459466896 459464073 459062805
3575.9 459062805 460411072 460694275 461351357 461984444 461972198 463044853 464460068 464988365 464803886
3584.6D64803886J857987L47977j228943O92520m42391J671334J486015J271286M1466
3593.2D70501137j42250K356338l65219N16892J685752L69721J199989k02408r0904
3601.9D75829048J179085K18162J83640J614075J097336o63338J994324n27001j217842
3610.6D79707489L663178J098594j668358J491051q38280J791535J923446j109199
3618.3D86059456K088432m64706j022759J403160J006279M03290J05095P20825J750260
3627D92049332M469070M08745q475914J574135K041015K500573N60989j087380J085930
3635.7D95126495J492272J013069l67661O59638J350021R85756j4038j66550J170464
3644.4E01249466R90028K096596r09843j206742M112168o04210k854309j359444K327499
$$ plain form
3584.6 464803886 466661873 467009850 465780907 466473427 466031036 467702370 469188385 470459671 470501137
3593.2 470501137 470358887 472715225 472350006 472866898 474552650 474922371 476122360 475919952 475829048
3601.9 475829048 477008133 477226295 477409935 479024010 480121346 479458008 481452332 480925331 479707489
3610.6 479707489 483370667 484469261 482800903 484291954 483453674 485245209 487168655 486059456
3618.3 486059456 488147888 487683182 486660423 488063583 489069862 489473152 489578247 490299072 492049332
3627 492049332 496518402 496927147 488451233 490025368 492066383 494566956 495127945 494040565 495126495
3635.7 495126495 496618767 497631836 497264175 497923813 499273834 500259590 500245552 500079002 501249466
3644.4 501249466 502239494 504336090 503426247 502219505 506331673 505727463 502873154 501513710 503841209
3653E03841209K096787J666412K205010m166680N40619K250557O4316L67889P1412
3661.7E08937531Q19702O70890J81122o4659O5308J883659J093064l37906M1237m077797
3671.4E09212151K43835L972931M459763L80325q643418K44599K896538J557045j635895
3680E12687874k92664J179962N6115j15662l70750l32108K223511L722305m475708
3688.7E14282875l082466L238945l227539r1095K496872J12495Q26569n08194j290207
3697.4E12758255M71306N46188J181259J570702k945633k370491K162285N43327m81720
3706.1E13435478j07765P31506J363945m833908R62906J063957o834221L320122K740326
3714.8E11842346l24554p13043O24122M90379k367553J41945L069954k018700k936707
$$ plain form
3653 503841209 505937996 507604408 509809418 505642738 506183357 508433914 508498230 508866119 508937531
3661.7 508937531 509757233 510428123 510609245 510544586 510609894 512493553 513586617 513248711 513289948 509212151
3671.4 509212151 509455986 513428917 517888680 518269005 509625587 509870186 512766724 514323769 512687874
3680 512687874 512395210 513575172 513631287 513515625 513144875 512812767 515036278 518758583 514282875
3688.7 514282875 511200409 514439354 511211815 511120720 513617592 513730087 514556656 514048462 512758255
3697.4 512758255 513229561 513775749 514957008 516527710 513582077 511211586 513373871 513917198 513435478
3706.1 513435478 513327713 514059219 515423164 510589256 511552162 512616119 505781898 509102020 511842346
3714.8 511842346 511517792 510804749 511428871 511919250 509551697 509693642 512763596 510744896 507808189
3723.4E07808189K554970j88331r41887n50995j21918P04193m98466L107986n14870
3732.1E11358871m689483L979072M7532n652695N10902J108971j053009J075973K620926
3740.8E09307060k065811O50978O285248m139862j0534782M243621L125382L949928
3748.5E10821762k189064o773033N939903j890106m057999K790146K195854O93856
3756.2E07531319l728485N75752L050804k923050j665382J664199O46401j73531J691819
3764.9E06669846j553803l484459J286240L061371R14764m710464K57377J439171l95317
3773.6E03484726m19045l33480M91905K65121J455155q7090m790764Q51708J345711
3782.3E02263947J51863J113052j445808j115227O59485R2430j9684j32866m39262
$$ plain form
3723.4 507808189 510363159 510174828 509232941 508681946 508560028 509264221 508765755 511873741 511358871
3732.1 511358871 506669388 510648460 510695992 505043297 505554199 506663170 505610161 506686134 509307060
3740.8 509307060 507241249 507892227 514177475 510037613 499502831 503746452 506871834 510821762
3748.5 510821762 508632698 501859665 507799568 505909462 501851463 504641609 506837463 507531319
3756.2 507531319 503802834 504378586 507429390 504506340 502840958 504505157 505151558 504978027 506669846
3764.9 506669846 505116043 501631584 502917824 505979195 506893959 502183495 502440872 503880043 503484726
3773.6 503484726 503065681 502732201 503224106 503489227 504944382 504857292 500066528 500918236 502263947
3782.3 502263947 502415810 503528862 502083054 500967827 501627312 501719742 501700058 501567192 501127930
3790.9E01127930o44493K2506l91082j28899J241302j612281k266541M49410K145156
3799.6D99943008M365006j767578p602730O41594J572266K472457K411538n136795
3807.3D96898766j963959K546120P39593n69496l54958j67541N80101K842178n3558
3816E00497246p375527J405564K888450L376465K366257r393807k89764J834450J33629
3824.7D95442963J535988K01416k824517j87225M34074J416855J219521m381142N36728
3833.4D93394661K924118l084793l74336M268989m987488k819709M835548k070618
3841.1D92086372J18485L106499j833878k052078P69691J74561l81279N46684n69878
3849.8D91965179O50673K542725k116890J313553q761788p7362N153389l03688q25462
$$ plain form
3790.9 501127930 500483437 500505943 500114861 499985962 501227264 499614983 497348442 497797852 499943008
3799.6 499943008 504308014 502540436 494937706 495579300 497151566 499624023 502035561 496898766
3807.3 496898766 494934807 497480927 498220520 497651024 497296066 497128525 497708626 500550804 500497246
3816 500497246 493121719 494527283 497415733 500792198 503158455 493764648 493474884 495309334 495442963
3824.7 495442963 496978951 497180367 494355850 494168625 494602699 496019554 497239075 492857933 493394661
3833.4 493394661 496318779 493233986 492859650 497128639 492141151 489321442 494156990 492086372
3841.1 492086372 492204857 495311356 493477478 491425400 492195091 492369652 491988373 492535057 491965179
3849.8 491965179 492615852 495158577 493041687 494355240 485593452 485516090 490669479 490365791 489540329
3858.4D89540329P48939N20287Q94699k363624O83937M089012l937340m264297K096214
3867.1D88008156K701797K040673m737053l373185J706696L438149K436065o346664
3874.8D85874634l28446J910820n07660Q95691K973252k206459m557228K755203N43556
3883.5D87353363R97887L342743o858559o83708J486130J07307K175217m18625m720154
3892.2D82781601J237755K164459j385689K8458K29454J013870K048378m725456J401787
3900.9D84794617N01404l515206K264938j260299q89740L32794L28560J145553j14860
3909.6D83587761k27699j66817L39165P5378l65448M22211O62231j210022k070198
3918.2D81046562R18541o18629j516648J640549J260567Q30078j063118j852951M62532
$$ plain form
3858.4 489540329 490289268 490809555 491704254 489340630 490024567 494113579 490176239 485911942 488008156
3867.1 488008156 490709953 492750626 488013573 484640388 486347084 489785233 492221298 485874634
3874.8 485874634 485546188 487457008 486949348 487845039 490818291 488611832 484054604 486809807 487353363
3883.5 487353363 488351250 491693993 484835434 484151726 485637856 485745163 487920380 487501755 482781601
3892.2 482781601 484019356 486183815 484798126 484826584 485056038 486069908 488118286 483392830 484794617
3900.9 484794617 485296021 481780815 484045753 482785454 481895714 482228508 482557068 483702621 483587761
3909.6 483587761 483360062 483193245 483532410 483607788 483242340 483664551 484326782 483116760 481046562
3918.2 481046562 481965103 481346474 479829826 481470375 482730942 483561020 482497902 480644951 481107483
3926.9D81107483M65851j01280j259614M14391K352371j095924k011719L10669K54479
3935.6D80436707p5798k54326n85022J24397L52669P96699O16684k400741j003266
3944.3D78008003R73320O24047o0807j456604R3651J54114j244698P09229O68869o12374
3953.9D77856750p89070m10347L20397j29509j5145M94271N50232O5269j317367o27594
3963.6D75997887K86445q4839j47247l3913P6561j67198k6626N3901m44297k47612
3973.2D75263062k92244n27077o4354K52571J45531L85475J8349q70400l68919p4463
3982.8D73867531L49693L90778q11158J77765P65801m42009p20177l40118M57382J21231
3992.5D73816719q86345p03201J37863M35638l29551o98967J04255L64495
$$ plain form
3926.9 481107483 481573334 481472054 480212440 480626831 482979202 481883278 479871559 480182228 480436707
3935.6 480436707 480360909 480106583 479521561 479645958 479998627 480795326 481412010 479011269 478008003
3944.3 478008003 478981323 479605370 479544563 478087959 478181610 478335724 477091026 477800255 478469124 477856750
3953.9 477856750 477067680 476657333 476977730 476848221 476833076 477327347 477877579 477942848 476625481 475997887
3963.6 475997887 476284332 476199493 476052246 476018333 476094894 475927696 475901070 475954971 475510674 475263062
3973.2 475263062 474970818 474443741 474379387 474631958 474777489 475162964 475181313 474310913 473941994 473867531
3982.8 473867531 474217224 474608002 473796844 473974609 474740410 474298401 473578224 473238106 473695488 473816719
3992.5 473816719 472930374 472227173 472365036 472800674 472471123 471772156 471876411 472240906
4000.2D72240906
$$ plain form
4000.2 472240906
##END=$$ End of the data block
