##TITLE=$$ Begin of the data block
##JCAMP-DX=5.00 $$ ACD/SpecManager v 10.08
##SPECTROMETER/DATA SYSTEM=Varian
##DATE=15 Jan 2013 16:05:30
##DATA TYPE=INFRARED SPECTRUM
##DATA CLASS=XYDATA
##ORIGIN=
##OWNER=
##NPOINTS=3735
##FIRSTX=399.26403809
##LASTX=4000.35498047
##MAXX=4000.35498047
##MINX=399.26403809
##MAXY=81.36561584
##MINY=42.84896088
##XFACTOR=1.0000000000
##YFACTOR=0.000000100000000
##FIRSTY=73.02409363
##DELTAX=0.96440572
##XUNITS=1/CM
##YUNITS=TRANSMITTANCE
##XYDATA=(X++(Y..Y))
399.3G30240936K8183594k9780960j3064499m388962J845932L706894l462219l185959
407G10094757L464661J3246689j819153l758240o277847P70187L804779p441711K438659
415.7G14522781Q329850Q862228l720322j334686j0965958n056381M710541o3477L014374
424.3G18298950l493881K142105j524887n010834L85514j215363K147446n233612N61752
433G07057190k51312j646195n47333l987045N091553J69983J229400j208419k07062
441.7G05700760K212906k923889L179855j023331j812591j854554M373475Q97293m110871
450.4G04639053k304077q901443n61066q4381M278488J1136932P450104m695434j1099320
459.1F99858856J131668J587220O93435n428467K17667N008621j573868K208329l707123
$$ y = [730240936, 758424530, 728643570, 715579071, 711190109, 713036041, 716742935, 713280716, 710094757, 713559418, 726806107, 724986954, 721228714, 714950867, 715721054, 719525833, 712084122, 714522781, 722852631, 731714859, 727994537, 726659851, 715693893, 710637512, 715348053, 715284576, 718298950, 714805069, 716947174, 715422287, 710411453, 710796967, 709581604, 711729050, 706495438, 707057190, 706805878, 705159683, 704612350, 700625305, 705716858, 705886841, 707116241, 705907822, 705700760, 707913666, 704989777, 708169632, 707146301, 705333710, 703479156, 707852631, 708749924, 704639053, 702334976, 693433533, 692872467, 692788086, 697066574, 708203506, 715653610, 710958176, 699858856, 700990524, 702577744, 703271179, 697842712, 698060379, 703069000, 701495132, 703703461, 699996338]
467.7F99996338k431107j474456J77764J234894j803360J766434l051148J740494j451874
476.4F94703979j541213k264863m329834M806443Q67386j597977j157913M784240M330597
485.1F98600845j460113k212753n189591o99310K144470N715485K059097m193115n198059
493.8F89566956l926697K699890J761017K963409J22452j518707j693802k233963K306213
502.5F90046768j004028J37863j413345j393891R53751O53686R86100j49994Q5220
511.1F88902130k956238l08609r70077n60684K162399k317276R66186L140336L295974
519.8F91354141j013794k980423j760635j698761K45285j806717j118088o34613j15509
528.5F80470886K65045J578675K253341l096161j666793k94876q78907k77710R73740
$$ y = [699996338, 697565231, 696090775, 696268539, 697503433, 695700073, 697466507, 694415359, 696155853, 694703979, 693162766, 690897903, 686568069, 691374512, 692241898, 690643921, 689486008, 694270248, 698600845, 697140732, 694927979, 689738388, 689039078, 691183548, 696899033, 698958130, 694765015, 689566956, 685640259, 688340149, 690101166, 693064575, 693187027, 691668320, 689974518, 687740555, 690046768, 689042740, 689180603, 687767258, 686373367, 687327118, 687980804, 688966904, 688816910, 688902130, 685945892, 685637283, 684667206, 684106522, 686268921, 683951645, 684917831, 688058167, 691354141, 690340347, 687359924, 685599289, 683900528, 684145813, 682339096, 681221008, 680586395, 680470886, 680735931, 682314606, 684567947, 681471786, 679804993, 679510117, 678631210, 678353500, 679327240]
537.2F79327240J767349k099151k094117J401596J028824k291031m47540o95495n90592
545.9F75307083L624344R6741q62122k00424M73785n56717k463913r95864r02100J006546
555.5F74527359p90253K67868J988755o40793J600342J186447j343613l676758k805786
564.2F70313568N06287N86776j130218l88336L229751K682114j169586l172608K6474
572.9F71484222J511231m32053m50897Q57239K301025L47901O05545k39869k567367
581.5F73416977j784134j281281N55954j008529j81046K029801J403808m71649j144791
590.2F71535110R7733j432343Q45490k48642j797562M82560m00162Q80890J926193
598.9F71889267J918716m61883j810608j146698j198731L53470J77460M66766K50016
$$ y = [679327240, 681094589, 678995438, 676901321, 678302917, 679331741, 677040710, 676593170, 675897675, 675307083, 678931427, 679028168, 678166046, 677965622, 678439407, 677882690, 675418777, 674422913, 673520813, 674527359, 673737106, 674004974, 675993729, 675352936, 676953278, 678139725, 676796112, 673119354, 670313568, 670819855, 671406631, 670276413, 669888077, 673117828, 675799942, 674630356, 671457748, 671484222, 672995453, 672563400, 672112503, 672969742, 675270767, 675618668, 676224213, 675984344, 673416977, 671632843, 670351562, 670907516, 669898987, 669717941, 671747742, 673151550, 672679901, 671535110, 671632843, 670200500, 671045990, 670797348, 668999786, 669482346, 669082184, 669963074, 671889267, 673807983, 673346100, 671535492, 670388794, 669190063, 669543533, 669720993, 670187759, 670437775]
607.6F70437775M44259J316758K39944j755524j645584J600266O80389k80838L28522
616.3F71365967L6773K17972J58768L44925J4343O39343J02158L30734J58615k4719
625.9F73344879J712952M74777j92032m09164K45590j3275j034165o3400R7427M64402
635.5F74627991k04850L78495J443710J462174p11594j786881O50788M92019J372986
644.2F77724838P37305j26801J228257P20291J06964N95169R07135j319885L59573
652.9F80932846Q55637r6512O96640J32522J103821j443023m26178P31887r76028q57697
662.5F80653915J95618K771378O44989J995315L456192k436294m59595j392670J04218
671.2F85533066o16150m26788Q04748O18363J518020N49698j13983j496735j1444O57959
$$ y = [670437775, 670882034, 672198792, 672438736, 670683212, 669037628, 670637894, 671318283, 671037445, 671365967, 671402740, 671620712, 671779480, 672124405, 672138748, 672778091, 672880249, 673210983, 673369598, 673344879, 675057831, 675532608, 675340576, 674931412, 675177002, 675163727, 674129562, 674066162, 674163589, 674627991, 674423141, 674801636, 676245346, 677707520, 676995926, 675209045, 675859833, 676351852, 677724838, 678462143, 678335342, 679563599, 680283890, 680390854, 680986023, 681893158, 680573273, 680932846, 681788483, 681691971, 682388611, 682521133, 683624954, 682181931, 681755753, 682487640, 681511612, 680653915, 680849533, 683620911, 684265900, 686261215, 689717407, 687281113, 686821518, 685428848, 685533066, 684916916, 684490128, 685294876, 685913239, 687431259, 687980957, 687866974, 686370239, 686358795, 687016754]
680.9F87016754J026764M27551k083664j73721J327896K380905q2321j256409M98581
689.6F89082336m48761j276092j319504K89230Q82950K383957J041947n22385j08719
698.2F90004959j850891l38287K05841n5390r37652l7384K132568Q09326J40000p26624
707.9F89346466k49329q34884m54483J65939l10821R76028q3084N42145P67059M74319
717.5F90339355l42254r30786o0120q08411N94635p12814p84149N49850L32337Q33664
727.2F89011307l64609p65076j659393n01785l33710j08566R73434j93176M68902m23355
736.8F86103973J43738j415634l094254m23889K67182J71127j248856l72161P74383
745.5F80905609L36685m99191k029343j266021p27234r079l64762j043624o32935K40173
$$ y = [687016754, 688043518, 688471069, 686387405, 686213684, 687541580, 689922485, 689840164, 688583755, 689082336, 688633575, 687357483, 686037979, 686327209, 687210159, 689594116, 690636063, 690113678, 690004959, 688154068, 687815781, 688021622, 687966232, 687028580, 686991196, 689123764, 689933090, 690073090, 689346466, 689097137, 688262253, 687807770, 687973709, 687662888, 688638916, 688555832, 689097977, 689865036, 690339355, 689997101, 689066315, 689006195, 688197784, 688792419, 688079605, 687295456, 687845306, 688177643, 689011307, 688646698, 687881622, 686222229, 685720444, 685386734, 685278168, 686251602, 686058426, 686527328, 686103973, 686247711, 684832077, 681737823, 681313934, 681581116, 681752243, 680503387, 680131226, 680905609, 681242294, 680743103, 678713760, 677447739, 676720505, 676711426, 676346664, 675303040, 674670105, 674910278]
755.1F74910278M47998o61239j61209j86768n22919j58538J185989J160278l91845
763.8F75622025l05405m25339p15790j045837l85361l31955j97754m02755J30920R42307
773.5F72885056j157914Q17337N57404r27277m73556j543503L5172l85743L25699R9945
783.1F70232620l58658O14472j137238j12991L25928j15967j040955l85132Q28858
791.8F68850937J40076K44979p13729P89260P39212j42898j62659l97644P40814J40839
801.4F70229187R93881J150055R32694K84118M85382J370621p12662M1199P70645J619950
811.1F77165070K362823J202240K21252K32773M79050j63651J819230J448974O92139
819.7F85459900o73523q26950K519150O40945N36118Q15200k67486j76239k5482Q91876
$$ y = [674910278, 675358276, 674697037, 674535828, 674349060, 673826141, 673667603, 674853592, 676013870, 675622025, 675316620, 674891281, 674175491, 673129654, 672744293, 672412338, 672214584, 671811829, 671942749, 672885056, 671727142, 672544479, 673101883, 672174606, 671701050, 670157547, 670192719, 669806976, 670132675, 670232620, 669873962, 670488434, 669351196, 669238205, 669564133, 669448166, 668407211, 668022079, 668850937, 668991013, 669235992, 668522263, 669311523, 670050735, 669907837, 669745178, 669347534, 670088348, 670229187, 671223068, 672373123, 673305817, 673589935, 674075317, 675445938, 674733276, 674774475, 675545120, 677165070, 679527893, 680730133, 680951385, 681184158, 681663208, 681499557, 683318787, 684767761, 685459900, 684786377, 683959427, 686478577, 687119522, 687655640, 688470840, 688203354, 688027115, 688001633, 688893509]
829.4F88893509P01675J240082j71204J9684K77481j02920P74460m12979j65406j19171
839F90935211N33066r918J03912Q41751j37787M81720n71365j43204o49948j084747
848.7F90298691M41971M79202Q99811N55496L62167q75702j101226q32825j58234L85361
858.3F90454712o46973M49143N43060O93283l4332p00226o24390p34024l32946j277085
868F87790222L81699L20053K28653L34701p39364R21097L65524n17502j900177k106476
877.6F85078430o85119L45916M63181l53012M45022j98440R16900N78156j215668n71670
887.3F84803696l73535N03768r3002P32498J307297O30112K00805m83627j77994j250610
896.9F85799408p33032j15433l50723q48084P2327J555328L0594k72827r05457r19723
$$ y = [688893509, 689595184, 690835266, 690664062, 690683746, 690961227, 690858307, 691632767, 691219788, 691054382, 690935211, 691468277, 691458359, 691562271, 692404022, 692266235, 692747955, 692176590, 692033386, 691383438, 690298691, 690740662, 691219864, 692119675, 692675171, 693037338, 692161636, 691060410, 690227585, 690069351, 690454712, 689807739, 690256882, 690799942, 691493225, 691458893, 690758667, 690134277, 689400253, 689067307, 687790222, 688171921, 688491974, 688720627, 689055328, 688315964, 689237061, 689602585, 689085083, 687184906, 685078430, 684393311, 684739227, 685202408, 684849396, 685294418, 685095978, 686012878, 686591034, 685375366, 684803696, 684430161, 684933929, 684840927, 685573425, 686880722, 687510834, 687711639, 687228012, 687050018, 685799408, 685066376, 684950943, 684600220, 683752136, 683824463, 685379791, 685410385, 685137558, 684232101, 683312378]
906.5F83312378m38614o88934n70832n61142J27640J1597M40063j38778J4877J98288
916.2F81706543j369476j552658j219864j69220J39236P26395l10669p82013q9264
924.9F77079010j202927p40890j287689m54712o19431j137085Q5068m42581L62091
933.6F71640854n55802p59735j065979j809387o19354q35877j33972k89612j068878
942.2F64502258r69619L16009J2741j496277r70535j691437j052932n26734r35593
950.9F57187881q84323r21249n19791p83157m50211j487274j520767m08173p26699
959.6F49486237r56040j362381o09741l08685j024247j191330l31802L8529l46756
968.3F43393784m95453j280442p83157k6932p9040l41110k40632Q3695j95923j91231
$$ y = [683312378, 682873764, 682184830, 681613998, 681052856, 681180496, 681192093, 681632156, 681493378, 681508255, 681706543, 680337067, 678784409, 677564545, 677395325, 677534561, 678260956, 677950287, 677168274, 677079010, 675876083, 675135193, 673847504, 673392792, 672773361, 671636276, 671721344, 671278763, 671640854, 671085052, 670325317, 669259338, 667449951, 666830597, 665994720, 665860748, 665571136, 664502258, 663532639, 663848648, 663861389, 662365112, 661394577, 659703140, 658650208, 658123474, 657187881, 656303558, 655382309, 654862518, 654079361, 653629150, 652141876, 650621109, 650212936, 649486237, 648530197, 647167816, 646558075, 646249390, 645225143, 644033813, 643702011, 643740540, 643393784, 642898331, 641617889, 640834732, 640807800, 640728760, 640387650, 640147018, 640230713, 640034790, 639843559]
977.9F39843559k62642o77299j122093M387k77291q79516J81694k50054j04103p48024
987.6F35708618o90880n27458j289406o67038q22944q36525j609726q29773n6915j182099
997.2F27195854r09347o67763j008644j774864j492997j883316j235122j104622k579384
1005.9F14539795j148491j490288j629715j320228k146950k218933k274246j620827
1013.6F00690117k474899k364502j468087j734199j560784j295509r64660m44108K76299
1022.3E88659668k19841p22237j59721O60820L85704K16904J568107J444168J134186
1031E92967758N6267l18565Q08639K51007L02696l051K48184P45315M19999M88281
1040.6E95966530j07803p29523o64406N25742K62184q16765j164436k67258J262359
$$ y = [639843559, 639580917, 638903618, 637781525, 637785912, 637508621, 636629105, 636810799, 636560745, 636456642, 635708618, 635017738, 634490280, 633200874, 632533836, 631710892, 630874367, 629264641, 628434868, 628377953, 627195854, 626286507, 625618744, 624610100, 622835236, 621342239, 619458923, 618223801, 617119179, 614539795, 613391304, 611901016, 610271301, 608951073, 606804123, 604585190, 602310944, 600690117, 598215218, 595850716, 594382629, 592648430, 591087646, 589792137, 588827477, 588383369, 588659668, 588439827, 587717590, 587557869, 588218689, 588604393, 588821297, 590389404, 591833572, 592967758, 593024025, 592705460, 593514099, 593765106, 594067802, 594064751, 594312935, 595058250, 595478249, 595966530, 595858727, 595129204, 594464798, 594990540, 595252724, 594435959, 593271523, 593004265, 594266624]
1049.3E94266624J275559O05888o17943j77078p43713j393242k66418q15888l53126
1058E91780663L91655O04362J50032r1705n05905j306496n95322p87468J15357L41263
1067.6E90096436m64631m20036n53055n2070L8299M7951p66258r76219q90618l05595
1077.2E85754204J80588m50707L75519n06859o98013l51944o01845r5215p56645l62015
1086.9E82487068m59404P0648P09114K11297J88751q67081j408424j454010q05130
1095.6E78672829K136L97301K59094L662M93660N82466J83106j382828j169701l91655
1105.2E77650070q90770p31888j002311m76036K56729J00288l36838o4087j1024l50685
1114.9E74143448l11508j242295p41424J21612K45819r4108n18189L12081l5629o85654
$$ y = [594266624, 595542183, 596148071, 595530128, 595353050, 594609337, 593216095, 592949677, 592133789, 591780663, 592172318, 592776680, 592926712, 592835007, 592329102, 591022606, 590427284, 589639816, 589755173, 590096436, 589631805, 589211769, 588658714, 588606644, 588644943, 588692894, 587926636, 586950417, 586059799, 585754204, 585934792, 585484085, 585859604, 585352745, 584654732, 584302788, 583700943, 583605728, 582849083, 582487068, 582027664, 582098312, 582807426, 583018723, 583207474, 582340393, 580931969, 579477959, 578672829, 578674965, 579072266, 579331360, 579335022, 579828682, 580411148, 580594254, 579211426, 578041725, 577650070, 576759300, 576027412, 575025101, 574549065, 574805794, 574906082, 574569244, 574505157, 574494133, 574143448, 573831940, 572589645, 571848221, 571969833, 572215652, 572121544, 571603355, 571915436, 571879807, 571194153]
1124.5E71194153j055222r17854o18629o36788j97067l51830l39203k58445m0970m55017
1134.1E66323128r38530q48503q38242l28789j066932r01108k86484n54581n72815
1142.8E59987144j596603j210022n03540j377754j627007p31086j35956o42624r32884
1151.5E51229668j046067p18956r18655k038536j387482p12127r63479m67796l09372
1160.2E42667198q08945q06159k71035q26645j347351r26208o89926m01230k93961
1168.9E36295738L472q5679k80189n49355q37936K7809j69411o89888m20913m69094
1178.5E32824554o95533o65322l04832n03197n53436n54009k33001m03939j035957
1187.2E27875328m26788m98352l69454j83067m57726m52156q86345p72209k18315P8774
$$ y = [571194153, 570138931, 569221077, 568602448, 567965660, 567768593, 567416763, 567077560, 566819115, 566778145, 566323128, 565384598, 564536095, 563697853, 563369064, 562302132, 561401024, 561114540, 560559959, 559987144, 558390541, 557180519, 556676979, 555299225, 553672218, 552941132, 552805176, 552162552, 551229668, 550183601, 549464645, 548545990, 546507454, 545119972, 544407845, 543444366, 542976570, 542667198, 541858253, 541052094, 540781059, 539954414, 538607063, 537680855, 536990929, 536589699, 536295738, 536299210, 536213531, 535933342, 535383987, 534546051, 534573860, 534404449, 533714561, 533293648, 532824554, 532129021, 531463699, 531158867, 530655670, 530102234, 529548225, 529315224, 528911285, 527875328, 527448540, 526950188, 526580734, 526397667, 525939941, 525487785, 524601440, 523829231, 523610916, 523689690]
1196.8E23689690n58205o26144j08529l78761p05261o99387j06086k15950k35482q6898
1206.5E19968987j66703k22282m28276m7951N0812P03926O44150M5471P5073m06952
1216.1E20216255k6626J41677J63880N52597K62680K89917N20706j70021o49490L8566
1225.8E21340141K33612N7717k9564K48680N05829J20735j35307l39814r8533n722
1235.4E21897774J73607R0446j00479K94456j1520J28594J64413J52931J36490q0605
1245E22846107J66741n6954J73989M4403K17132M14544r1248J25237P63K30407J68801
1255.7E24239922k88849l55339j91689Q8081R8382O58378K41585j26495J8806k13814
1265.3E24168968j8272j71776j55678J74103N18455K78016k3117o2943k24228J57852
$$ y = [523689690, 523131485, 522505341, 522396812, 522018051, 521312790, 520613403, 520507317, 520291367, 520055885, 519968987, 519802284, 519580002, 519151726, 519103775, 519154587, 519858513, 520502663, 520548134, 520623207, 520216255, 520189629, 520331306, 520495186, 521047783, 521310463, 521600380, 522121086, 521951065, 521301575, 521340141, 521573753, 521631470, 521601906, 521850586, 522356415, 522477150, 522341843, 522002029, 521903496, 521897774, 522071381, 522161827, 522061348, 522355804, 522344284, 522472878, 522637291, 522790222, 522926712, 522846107, 523012848, 522955894, 523129883, 523174286, 523391418, 523805962, 523714714, 523839951, 523840714, 524071121, 524239922, 523951073, 523595734, 523404045, 523492126, 523590508, 524248886, 524490471, 524363976, 524382782, 524168968, 524150696, 523978920, 523823242, 523997345, 524515800, 524793816, 524770699, 524707756, 524483528, 524641380]
1274.9E24641380O2676k1782K25868M10843K35481j09329L29323N16548M2610l20930
1284.6E26012688J716J00251J69372K70310K03018O47621L01781K18086N08690M93736
1294.2E28927269L41492n9700k5063R7809O50749N10712P3242L50533L41758N55611
1303.9E31764412M61197J59645J31874M80957P65457N04341L41950K5863J61858N50804
1313.5E35348358M36630K94762K76527N22576M96940J37215J14136M39682O18858O63719
1323.2E39349403N33104J65749J69640K17285J21689M71458N02777J45607R5940k3651
1332.8E41749001L6392J91116M0894O6299O1455l53813o91872k50778L80974J47361
1342.4E41377029k82363j95809j28174n94673q68339p38717p89680p64809o08863m64860
$$ y = [524641380, 524704056, 524682274, 524908142, 525318985, 525554466, 525445137, 525774460, 526291008, 526333618, 526012688, 526014404, 526114655, 526284027, 526554337, 526757355, 527404976, 527706757, 527924843, 528433533, 528927269, 529268761, 529209061, 529183998, 529281807, 529932556, 530443268, 530516510, 530867043, 531208801, 531764412, 532225609, 532385254, 532517128, 532998085, 533763542, 534267883, 534609833, 534635696, 534797554, 535348358, 535784988, 536079750, 536356277, 536878853, 537375793, 537513008, 537627144, 538066826, 538685684, 539349403, 539882507, 540048256, 540217896, 540435181, 540556870, 541028328, 541531105, 541676712, 541772652, 541749001, 541785393, 541976509, 542017403, 542083702, 542145157, 541791344, 541099472, 540848694, 541229668, 541377029, 541094666, 540898857, 540770683, 540176010, 539307671, 538568954, 537779274, 537014465, 536405602, 535940742]
1352.1E35940742l69033m32778n90820p34940q4076L10517N0850l23410k60277M53491
1361.7E33960266K51389l891N60341M44717j67847J62964L53165K00271K56043m52805
1371.4E35564613k71530j90620m08974j46789m9172M03709K58217K68784M8370L14904
1381E35791512P03353J18027J9875L34511R14230J055145J005135R55772R51576M49448
1390.7E42298584J79596N92384r002p02324J66359Q04062N57518K29110j9111M46968
1400.3E44544144P17926Q3923J11427J37101n13382L85398J008835O86760J53542L92036
1409.9E47707710N14794J94626j62735m2420J28632j13716j7281J61247J00708n52940
1419.6E47918625Q74748P39899j53427k11068k66761L32184K02980J99699P54890O2600
$$ y = [535940742, 535571709, 535138931, 534548111, 533813171, 533729095, 534039612, 534090462, 533767052, 533506775, 533960266, 534211655, 534207764, 534768105, 535212822, 535044975, 535207939, 535561104, 535761375, 536017418, 535564613, 535293083, 535102463, 534693489, 534546700, 534497528, 534901237, 535159454, 535428238, 535476608, 535791512, 536494865, 536612892, 536632767, 536967278, 537881508, 538936653, 539941788, 540897560, 541849136, 542298584, 542478180, 543070564, 543061562, 542359238, 542525597, 543329659, 543887177, 544116287, 544097176, 544544144, 545262070, 545345993, 545457420, 545594521, 545081139, 545466537, 546475372, 547162132, 547315674, 547707710, 548222504, 548417130, 548254395, 548211975, 548340607, 548226891, 548209610, 548370857, 548471565, 547918625, 548793373, 549533272, 549379845, 549168777, 548902016, 549234200, 549437180, 549636879, 550391769, 550454369]
1429.2E50454369m82178L39546M39415n92575k2049R20639K34146o11610O57043J565933
1438.9E52902679R37462M32320L45421M2267K18391J1787O22216Q78677P94335M69627
1448.5E57655182J007500J265335K04544M98962P90291R80949N61753m2000P30896
1457.2E63653412R94644L187523K150955K135315J523285P76939J607552N41992J429711
1465.9E78001328J915702J726113J952057J644210J849099O33583r70459M70962R39789
1474.6E88162384J008225m36936R89494Q10090Q2702j46904q43925J84707l15323n11741
1484.2E88982773p14722o02150n46646j356468R0675j110649o57387m25834m66500
1492.9E83193092p70836o85691p1717l353080K38418m83093j064682L60260j006470
$$ y = [550454369, 549972191, 550311737, 550751152, 550158577, 550136528, 551057167, 551291313, 550679703, 551336746, 552902679, 553840141, 554272461, 554617882, 554660149, 554878540, 554890327, 555512543, 556391220, 557185555, 557655182, 558662682, 559928017, 560132561, 560631523, 561421814, 562402763, 562964516, 562922516, 563653412, 564648056, 567835579, 569986534, 572121849, 573645134, 574422073, 576029625, 576571617, 578001328, 579917030, 581643143, 583595200, 585239410, 587088509, 587722092, 586751633, 587222595, 588162384, 589170609, 588733673, 589723167, 590533257, 590615959, 590469055, 589625130, 589809837, 589494514, 588982773, 588268051, 587665901, 587119255, 585762787, 585853462, 584742813, 584085426, 583659592, 583193092, 582422256, 581736565, 581664848, 578311768, 578550186, 578067093, 577002411, 577362671, 576356201]
1501.6E76356201j008148q83102N5160m18739k893410n753784J097641L355026M13513
1510.2E70320358K99034r54628j35078N03693p5951n46913k627335J295281J512489
1518.9E69590950J384544j489677l199616R32312J467934J382599j906776n0545l78189
1527.6E67733536p77130j85776o32134n28869j220742j618766l564911R15375l40615
1536.3E59779968p26738J184044n647583l882675J293449L00026l163032n63812o12145
1545E47961502l452339O0959j268196n03807k410775k863121j46255j194267q58193
1553.6E35325508n045662o16531M59213J061745q67920r435959J756783j107102J023636
1562.3E22553711r90486p58591j535072j488304q0262r32960K89116m335404J58120
$$ y = [576356201, 575348053, 574464951, 574520111, 574101372, 571207962, 565454178, 566551819, 569906845, 570320358, 570619392, 569664764, 569529686, 570033379, 569957428, 569410515, 566783180, 568078461, 569590950, 570975494, 569485817, 566286201, 567218513, 568686447, 570069046, 568162270, 568111725, 567733536, 566956406, 566770630, 566138496, 565609627, 564388885, 562770119, 559205208, 560120583, 559779968, 559053230, 560237274, 554589691, 550707016, 552000465, 552300491, 549137459, 548573647, 547961502, 544509163, 544570122, 543301926, 542798119, 540387344, 537524223, 537377968, 536183701, 535325508, 530279846, 529663315, 530122528, 531184273, 530316353, 520880394, 522637177, 521530075, 522553711, 521563225, 520804634, 519269562, 517781258, 517700996, 516768036, 517057152, 512721748, 512879868]
1571E12879868k28348j187172o78444j161957K22740n317802J410408j21307o98281
1579.7E05119705j85509j587066n36881j553116p30552j386872p28073o49032j386261
1588.4D96376343l87993j727333m89922j330414q01582j428871j745300m71344j585846
1597D86407738J5526j243821o04782r46045j011047k10419j172409k14157j548920
1605.7D79471664l97987r92622o19393l42140q86841L72353q77838K58293r38568R2506
1615.4D75139427K18506l139114J473579J526P99065M043Q86421M60434N0316J177139
1625D77071342L79029J413803o90346P06215J017113M14810P56988R12819K031365
1633.7D84013138J291122j7280p78885K097511J534004J222115J365700Q75892J685028
$$ y = [512879868, 512651520, 511464348, 510785904, 509623947, 509846687, 504528885, 505939293, 505817986, 505119705, 504934196, 503347130, 502810249, 501257133, 500526581, 499139709, 498411636, 497762604, 496376343, 495988350, 494261017, 493771095, 492440681, 491639099, 490210228, 488464928, 487993584, 486407738, 486423264, 485179443, 484574661, 483628616, 482617569, 482407150, 481234741, 481020584, 479471664, 479073677, 478081055, 477461662, 477119522, 476232681, 476605034, 475727196, 475985489, 475046921, 475139427, 475357933, 472218819, 473692398, 473693924, 474492989, 474497032, 475383453, 475843887, 475894203, 477071342, 477450371, 478864174, 478173828, 478880043, 479897156, 480311966, 481068954, 481981773, 484013138, 485304260, 485286980, 484508095, 486605606, 488139610, 489361725, 490727425, 491603317, 493288345]
1642.4D93288345M50631J164321J029435J28708Q12797n60608J495285J125832J901321
1651E00836067K261963K268677q320122K597542L076897J178131P81440j56250K06871
1659.7E04731216J23978K91481k31781j173248R30672k13242j97678j37634m05655
1668.4E03718109j638870j154862M42696j331978J95885L8452k054329k383156J07651
1677.1D95939598L22075j063499r17054k629165r16748L24363j032905n165291j902123
1685.8D82959251J338997j153335j770325j592026k077102j139603j301270n25322
1693.5D74739265r50622J17302m989472K94686J422844L9291K127266q968124L507042
1702.1D67339478J096038M55208L31421j11351K273636N44128K387772P04727J254273
$$ y = [493288345, 493738976, 494903297, 495932732, 496061440, 496874237, 496313629, 497808914, 498934746, 500836067, 503098030, 505366707, 497046585, 499644127, 502721024, 503899155, 504680595, 504524345, 504731216, 504855194, 505146675, 504914894, 503741646, 504672318, 504459076, 504261398, 504123764, 503718109, 502079239, 500924377, 501367073, 500035095, 500230980, 500269432, 498215103, 495831947, 495939598, 496261673, 495198174, 494281120, 491651955, 490735207, 491059570, 490026665, 484861374, 482959251, 484298248, 483144913, 481374588, 479782562, 477705460, 476565857, 475264587, 474739265, 473788643, 473905945, 468916473, 469211159, 470634003, 470673294, 472800560, 463832436, 467339478, 468435516, 468890724, 469222145, 469110794, 471384430, 471928558, 474316330, 475021057, 476275330]
1710.8D76275330J728210J720238K692642O86951N038833K382508L970031M065056
1718.5D98559799L267517L486557K631417M627342L440056M847793M101143M684029
1726.3E29645653M861564L736573M326248L181305N835075L522225L472251L173638
1734E61754532M695816O164627L408394M411774L738365N299835L473472L305283M034958
1742.7F00287056L423309M439392L118477M622116L243714L719101M440841L767472
1750.4F31061478M705925K773323M740295K978897L310776L842545L648147M079361
1758.1F61140747K886124M258728L090667L012467L366775L262864L552703K917862
1765.8F87488937L522721L129501L779678L474884L834382L119506J952134L487091
$$ y = [476275330, 478003540, 479723778, 482416420, 483103371, 488142204, 490524712, 494494743, 498559799, 501827316, 505313873, 507945290, 512572632, 516012688, 520860481, 524961624, 529645653, 534507217, 538243790, 542570038, 545751343, 551586418, 555108643, 558580894, 561754532, 566450348, 572614975, 576023369, 580435143, 584173508, 589473343, 592946815, 596252098, 600287056, 603710365, 608149757, 611268234, 615890350, 619134064, 622853165, 627294006, 631061478, 635767403, 638540726, 643281021, 646259918, 649570694, 653413239, 657061386, 661140747, 664026871, 668285599, 671376266, 674388733, 677755508, 681018372, 684571075, 687488937, 691011658, 694141159, 697920837, 701395721, 705230103, 708349609, 710301743, 713788834]
1773.5G13788834L299713L978271L192749M144364L468856L413392L653183K470550
1781.2G41409912L762207K606659L030319K507706K509766L398819L093109L555450
1788.9G65873947K472458K215500J531906J745682L045807K817535K226029J533584
1796.7G83462448K660217K601700J995011J018600K031326J774292J691285J935501
1804.4G99170380O02188J100311J042633J270523J141586Q88291P85904R07745J409149
1813H08318710L05329O36749L33252M09317M61426N07126J083602K92283P21359j30005
1822.7H12939148P9803J85013j566391M86679J017838N14068r73892q26874R17435
1831.4H12772827O48041K10800j00098n21011n20325k34680n26352M12522Q8729Q9341
$$ y = [713788834, 717088547, 721066818, 724259567, 728403931, 731872787, 735286179, 738939362, 741409912, 745172119, 747778778, 750809097, 753316803, 755826569, 759225388, 762318497, 765873947, 768346405, 770561905, 772093811, 773839493, 776885300, 779702835, 781928864, 783462448, 786122665, 788724365, 790719376, 791737976, 793769302, 795543594, 797234879, 799170380, 799772568, 800872879, 801915512, 803186035, 804327621, 805215912, 806001816, 806909561, 808318710, 808624039, 809260788, 809594040, 810003357, 810464783, 810971909, 812055511, 812347794, 813069153, 812939148, 813018951, 813203964, 811637573, 812124252, 813142090, 813656158, 812682266, 811855392, 812772827, 813420868, 813631668, 813531570, 813010559, 812490234, 812255554, 811729202, 812141724, 812230453, 812319794]
1841H12319794K70538J6480q16803l745347J263657J210785m14429l18832k1134L67737
1850.7H10132446l39660k07978m26788j57471k28653k32467J0147r40018k93503j89056
1860.3H07126999J7471l46298k99072N3787o42090m70199r80607k35137j066666r40247
1869.9H02217941O18363M32663L58658n33829k04697n66559l50876R5902n11627n93033
1879.6H00962906o47507l0899l80630N874k99148l62778N8136q82187k13013r70916
1889.2G97239838j142807J57776K57263L63769L8986m54025r28955J1292l59192m10309
1898.9G94773636m47540o98319J1292k91596l7918l61481k71682j94474p29675o63147
1908.5G91089096n50766l74298m69894L11050k44522k76489K1209k50396J51748j657867
$$ y = [812319794, 812590332, 812606812, 811790009, 808044662, 809308319, 810519104, 810104675, 809785843, 809764709, 810132446, 809792786, 809584808, 809158020, 809000549, 808771896, 808539429, 808549576, 807609558, 807316055, 807126999, 807144470, 806798172, 806499100, 806552887, 805910797, 805440598, 804459991, 804224854, 803158188, 802217941, 802836304, 803268967, 803627625, 803093796, 802889099, 802322540, 801971664, 802067566, 801555939, 800962906, 800315399, 800284500, 799903870, 799909744, 799610596, 799247818, 799305954, 798423767, 798210754, 797239838, 796097031, 796254807, 796512070, 796875839, 796914825, 796460800, 795531845, 795543137, 795183945, 794773636, 794326096, 793627777, 793639069, 793347473, 793309555, 792948074, 792676392, 792481918, 791752243, 791089096, 790538330, 790164032, 789694138, 790005188, 789760666, 789484177, 789505386, 789254990, 789406738, 787748871]
1918.2G87748871q08792P0724m0130o1722j509552m09851R01642M52194m76532o4469
1927.8G85802383k17666n59845n27878o93893k8382n09872j42670n0430m32053m59060
1937.5G82180634n48401o6147o06766j86768q15277q46786N77316p7896p7133k34070
1947.1G79298706j67465j16806j49994m72336p48749m30679m14734k67334o85043l38135
1956.7G75507431l5171K29949J06736o70853l27911n01862l14789k51846k52380l32947
1966.4G73156357m58679J25961k02484j14441l39432l16543m53034n19028k53601n30166
1976G70094910K79541L0594n96085n97229j17645j91040p51877o9504k52457o0806
1985.7G67768402k3804k17285l91769o44074K17514l79943q93555j03760J98746l30353
$$ y = [787748871, 786940079, 787010803, 786970673, 786908951, 785399399, 784989548, 785891190, 786343384, 785866852, 785802383, 785584717, 785024872, 784496994, 783803101, 783774719, 783264847, 783122177, 783071747, 782639694, 782180634, 781632233, 781566086, 780959320, 780772552, 779957275, 779110489, 779687805, 779609909, 779532776, 779298706, 779131241, 779014435, 778864441, 778392105, 777643356, 777212677, 776797943, 776530609, 775845566, 775507431, 775472260, 775702209, 775808945, 775138092, 774810181, 774308319, 773993530, 773741684, 773489304, 773156357, 772697678, 772823639, 772621155, 772506714, 772167282, 771850739, 771397705, 770878677, 770625076, 770094910, 770374451, 770405045, 769808960, 769211731, 769094086, 768903046, 768151169, 768081665, 767829208, 767768402, 767744598, 767527313, 767135544, 766491470, 766708984, 766329041, 765435486, 765331726, 765530472, 765200119]
1995.3G65200119p69043l14255J08948J4954o52924k62756k45819l0747K289o38428
2005G62412338l24783n38712k1591k08740k11945J06964n73349l01742n72128k93122
2014.6G59473190P4997J8082l60184n62515m3793J1978K68021n11932n42679l46070
2024.2G57479095l48129N4703o61545l19443j29165k83585l54080j10626J19858o09971
2033.9G54837112n40237k44141Q6060l03192l69721N5695k40250m71725m99039p324
2043.5G52303238o8588k04850n67398n9280J89285q58383l49579j85547J98670J61972
2053.2G50559540l41034j67465m98124k64282l11889j64261k40174l77502n14526m89579
2062.8G47190704K76413J75095J10779k79160j67770m36554o80924q4991n19943k73438
$$ y = [765200119, 764431076, 764116821, 764225769, 764240723, 763587799, 763325043, 763079224, 763048477, 763050766, 762412338, 762087555, 761548843, 761527252, 761318512, 761106567, 761213531, 760640182, 760338440, 759766312, 759473190, 759548187, 759566269, 759206085, 758643570, 758599777, 758611755, 758879776, 758367844, 757825165, 757479095, 757130966, 757185669, 756524124, 756204681, 756075516, 755791931, 755437851, 755327225, 755447083, 754837112, 754296875, 754052734, 754138794, 753835602, 753465881, 753521576, 753281326, 752809601, 752310562, 752303238, 752234650, 752029800, 751462402, 751403122, 751592407, 750734024, 750384445, 750198898, 750397568, 750559540, 750218506, 750051041, 749552917, 749288635, 748976746, 748812485, 748572311, 748194809, 747680283, 747190704, 747467117, 747642212, 747752991, 747473831, 747306061, 746869507, 746188583, 746103592, 745583649, 745310211]
2072.5G45310211k08969J27106O5460l82614k69547o74286j15814P096k17057n25512
2082.1G43116074P63N01632k56042k27967o36138l10669o0654l54843l97797l33710
2091.7G41040649K47727j88141l25623r2392J56937m81644r17511j54571j08032K18963
2101.4G39396362L05o7291l97949n02625J10856n23453m64935j42136K1439k92130
2111G37138443k99225J46790j41831n13153p36923L38745J70822l89938j81885n57632
2120.7G34974213k37961j45950j31684l33938k49711j63955Q7814K22778r38720m66995
2130.3G32615891K58712j10702m12522m37011l67737k55585j20239k61154J96380j91192
2140G30914841l56522k89459l17459K23694k43607j9836k51007m11149j00936m52652
$$ y = [745310211, 745101242, 745228348, 745293808, 744911194, 744641647, 743967361, 743851547, 743858643, 743641586, 743116074, 743116837, 743618469, 743362427, 743134460, 742498322, 742187653, 742126999, 741772156, 741374359, 741040649, 741288376, 741100235, 740774612, 740682220, 740839157, 740357513, 739440002, 739285431, 739177399, 739396362, 739396667, 739329376, 738931427, 738428802, 738539658, 738016205, 737551270, 737409134, 737430573, 737138443, 736839218, 736986008, 736844177, 736331024, 735594101, 735932846, 736103668, 735713730, 735531845, 734974213, 734736252, 734590302, 734458618, 734124680, 733874969, 733711014, 733798828, 734021606, 733082886, 732615891, 732874603, 732763901, 732351379, 731914368, 731546631, 731291046, 731170807, 730909653, 731106033, 730914841, 730558319, 730268860, 729951401, 730175095, 729931488, 729911652, 729660645, 729249496, 729148560, 728695908]
2149.6G28695908j93406k40097j68686m95224j53121K82669n04151l76053m5700O638
2159.3G26808777j99433k93579k00348r7579l23487m75082j81275n13763m77448k31475
2168.9G23815308J12609q7127m31519p1869l0059J8386n67245m76685q7127P476J8158
2179.5G22220306n57708m9057r5063m60968k60925j77917j56479l81775l90854m63486
2189.1G19226074j40457N7449K02790k83814r01642k95333l32032l95813r2087j15280
2198.8G16929855m24194j43967J34888j04141J25809l72010o10962n26123l59039l11585
2208.4G14338531n61141p935R5673J56555j00403k09274j71433n63888k80457m66003
2218.1G12230225n35279j41372J19705j96228j27793K61383m05349o30951n28107m14810
$$ y = [728695908, 728502502, 728262405, 728093719, 727598495, 727445374, 727728043, 727223892, 726847839, 726802139, 726808777, 726609344, 726315765, 726115417, 726017838, 725694351, 725219269, 725037994, 724524231, 724046783, 723815308, 723927917, 723840790, 723409271, 723337402, 723307343, 723325729, 722758484, 722281799, 722194672, 722202148, 722220306, 721662598, 721613541, 721518478, 721057510, 720796585, 720618668, 720462189, 720080414, 719689560, 719226074, 719085617, 719143066, 719345856, 719062042, 718160400, 717865067, 717533035, 717137222, 717045135, 716929855, 716505661, 716361694, 716496582, 716392441, 716518250, 716146240, 715535278, 715009155, 714650116, 714338531, 713777390, 713769455, 713865128, 714021683, 713921280, 713712006, 713540573, 712976685, 712696228, 712230225, 711694946, 711553574, 711673279, 711477051, 711349258, 711610641, 711205292, 710574341, 710046234, 709631424]
2227.7G09631424o28357l86581J20620J13602J23215m61808k2201J20926n43366p32422
2237.4G07335052o06155l78342n97381J04370K30179o943r8877l48282r0866m27246
2247G05115509n69534o82297j74561O485j54190P2785l44391j25656k15759k03095
2256.7G02725296n99823p32956J93710n2108m38080n23682R9564j374k51617j3199
2266.3G00405731l79867j56403m80804n21317l73459l9902J73417m41208l55530j83411
2275.9F97647247k38571q79669l47977j34964p61490k45666l58811J16349J38244k670
2285.6F94932022J10245n71137l76815m43421m71802k69317K14309L05481l8909K27508
2295.2F93618164k07138k13852m8523l41034n13077n39856l15094P2709K69088l5171
$$ y = [709631424, 709003067, 708616486, 708737106, 708850708, 708973923, 708512115, 708489914, 708610840, 708067474, 707335052, 706728897, 706350555, 705753174, 705857544, 706087723, 706080780, 705981903, 705633621, 705542755, 705115509, 704545975, 703863678, 703689117, 703695602, 703541412, 703614197, 703269806, 703144150, 702928391, 702725296, 702125473, 701392517, 701586227, 701534119, 701096039, 700572357, 700671921, 700670547, 700418930, 700405731, 700025864, 699869461, 699388657, 698867340, 698493881, 698453979, 698627396, 698186188, 697830658, 697647247, 697408676, 696529007, 696181030, 696046066, 695284576, 695038910, 694680099, 694796448, 694934692, 694932022, 695042267, 694471130, 694094315, 693650894, 693179092, 692909775, 693124084, 693429565, 693390656, 693618164, 693411026, 693197174, 693148651, 692807617, 692294540, 691754684, 691439590, 691512299, 691781387, 691746216]
2304.9F91746216N59540M03823k96096l11280o57959m1809J43891k01187k91214l18757
2314.5F90735168R3079K45895N29099O24390L27835J15509K1744K1820k42539n24902
2324.2F91947098J42975Q06198L60718j93177l10364k31933q43582l48358P51419o03867
2333.8F91477127j168823O01120J041488l69033l11203K39181L28369l36685q03146
2342.5F90698395L4637O0654q45490k237930k223282j621170n4016J962967J002350
2351.2F86777115N1651N93796R71527M11911K01797K569885O3782j094284j00860p03354
2360.8F89742966r82209j242752J34735R614j67618j295243q26034o51627k137985
2369.5F82583847j729126j888351j128922r62906j219558j246644j015243o90689j388474
$$ y = [691746216, 692305756, 692709579, 692413483, 692102203, 691444244, 691402435, 691546326, 691345139, 691053925, 690735168, 690828247, 691074142, 691603241, 692227631, 692555466, 692670975, 692692719, 692714539, 692472000, 691947098, 692090073, 692896271, 693256989, 693063812, 692753448, 692521515, 691677933, 691329575, 692080994, 691477127, 690308304, 690909424, 691950912, 691581879, 691270676, 691509857, 691838226, 691501541, 690698395, 690733032, 690793686, 689948196, 687710266, 685486984, 683865814, 683811798, 685774765, 686777115, 686828766, 687422562, 688394089, 688806000, 689007797, 691577682, 691641464, 690547180, 690446320, 689742966, 688760757, 687518005, 687652740, 687662354, 687494736, 686199493, 685373459, 684721832, 682583847, 680854721, 678966370, 677837448, 676874542, 675654984, 674408340, 673393097, 672702408, 671313934]
2378.2F71313934j071243j333694j109620m45022q61969q51441q75244m79660m37698
2386.8F63848343n41382k15759k77786k21253l81241l90243k53296l30963m60129k99225
2396.5F60477066j00479j98517k93045l29361K441n0659m88357q48618m81338k16751
2406.1F57472382p24335k09427J20163l15323n78766K9679L87420n00793n94406l45993
2415.8F54740601k88926m52728m00696l76358l68347K09961j98440k45667k72140m20838
2425.4F51926422k89230o31638k46811m23279m75769p6446J57623k6398p08618j07803
2435.1F49098053j51672n95780m61273n31082l18222m23584k04163L7766j27640k37122
2444.7F46085281l39584l45306m56467l52936j84479j15203j58005n42908o17905k4871
$$ y = [671313934, 670242691, 668908997, 667799377, 667354355, 666492386, 665640945, 664765701, 664286041, 663848343, 663306961, 663091202, 662813416, 662592163, 662210922, 661820679, 661567383, 661236420, 660776291, 660477066, 660376587, 660178070, 659885025, 659555664, 659558105, 659507446, 659019089, 658170471, 657689133, 657472382, 656748047, 656538620, 656658783, 656343460, 655764694, 655794373, 656181793, 655681000, 655086594, 654740601, 654451675, 653998947, 653598251, 653221893, 652853546, 653063507, 652865067, 652619400, 652347260, 651926422, 651637192, 651005554, 650758743, 650335464, 649859695, 649783249, 649940872, 649914474, 649205856, 649098053, 648946381, 648350601, 647889328, 647358246, 647040024, 646616440, 646412277, 646450043, 646322403, 646085281, 645745697, 645400391, 644943924, 644590988, 644406509, 644291306, 644133301, 643590393, 642972488, 642947617]
2454.3F42947617J16958l34091n88226n08957n0431k24304o78405k35520J01471k43149
2464F40302963l47175j55678k14691o6719j92910p89642p61146k75689j00860L5782
2473.6F37434235J11541l46984n17922m49791l52135j22299k55470k46468r9601j91269
2483.3F34963837k25602j84593m66194l82004j34964k96554m26254o57540j90010n0583
2492.9F31949539j17874R4452l90167l59726m59137k53639k95296p01599o7673k38953
2502.6F29159927k79503j18904k24533j77078j68190n7793o39915l66440q5258m79546
2512.2F26562767r4986o4049l78570j83640K38419k57950p52869m16565k02865k23732
2521.9F24225960m15535j75858r041k68096j53695M8676l70598q56018m67949J42403
$$ y = [642947617, 643064575, 642730484, 642142258, 641633301, 641582870, 641358566, 640680161, 640444641, 640546112, 640302963, 639955788, 639800110, 639585419, 639518700, 639325790, 638536148, 637775002, 637499313, 637398453, 637434235, 637545776, 637198792, 636680870, 636231079, 635878944, 635756645, 635501175, 635254707, 635155106, 634963837, 634738235, 634553642, 634087448, 633705444, 633570480, 633273926, 632847672, 632190132, 632000122, 631949539, 631831665, 631926117, 631535950, 631176224, 630717087, 630463448, 630168152, 629466553, 629398880, 629159927, 628880424, 628761520, 628536987, 628359909, 628191719, 628133926, 627494011, 627127571, 627042313, 626562767, 626467781, 626403732, 626025162, 625841522, 626079941, 625821991, 625069122, 624652557, 624449692, 624225960, 623810425, 623634567, 623625526, 623357430, 623203735, 623252411, 622881813, 622025795, 621557846, 621700249]
2531.5F21700249k0676m79011j44387p7629l73535j51253j12343r7885k92282l42331
2541.1F19608917k64435l63044j16196k8687j0643l26423l94592L0708m83132p10601
2550.8F16941872j29090j05476j19362p0190j78681k92282o10695l07197j28975j80130
2560.4F14819794l205k87819l8681L9o2371j99547p46498j15661J0872m18206l74450
2571F12584267l78952j89362J9684M4708l07770k82287k55547k41890m8103m15726
2580.7F10529022l30772r0714q6097j0224j64413l72277l09410o3820j51557l26119
2590.3F08623619k07901P7133j37367m19807k31247j95504j20048k38762m16184k42385
2600F06491547j10360k08816m03252l33824j28517J2894K66304P1869p30820l63045
$$ y = [621700249, 621679573, 621200562, 621056175, 620978546, 620605011, 620453758, 620341415, 620243530, 619951248, 619608917, 619344482, 618981438, 618865242, 618836555, 618825912, 618499489, 618104897, 618135605, 617652473, 616941872, 616812782, 616707306, 616587944, 616517754, 616339073, 616046791, 615436096, 615128899, 614999924, 614819794, 614816589, 614528770, 614490089, 614490128, 614427757, 614228210, 613481712, 613366051, 613376923, 612958717, 612584267, 612205315, 612015953, 612035637, 612080345, 611772575, 611490288, 611234741, 610992851, 610944748, 610529022, 610198250, 610107536, 610021439, 610011215, 609846802, 609474525, 609165115, 609101295, 608949738, 608623619, 608415718, 608492851, 608355484, 607935677, 607704430, 607508926, 607388878, 607150116, 606733932, 606491547, 606381187, 606172371, 605769119, 605435295, 605306778, 605319672, 605585976, 605657845, 604927025, 604563980]
2609.6F04563980J81770k88276j76201j57395j82838n5351j51749j82533l17459n1804
2619.3F03182144l34892n22194J64986N5198k39906k35176l99666o6109J12381n91392
2628.9F01125374o35681r3079Q431R5901K19650J70517k04887n33638n38254j32255
2638.5E99482079j9227l06320j80168k41470j22032j74141l67699J3466j26000l24707
2648.2E97633781l06625j61781o6414m36173l06053O9161N0544j05590l99170k72827
2657.8E95698853J62124m09164n74227J35041j23139j10817R3727k66418k14043k37007
2667.5E94154930l78036m08669k80037J75591L15017p6866m88586k85645K6322l19634
2677.1E92434387l19290k01607n20439m88357k40441K40898J28518l16201k55470l75633
$$ y = [604563980, 604745750, 604457474, 604281273, 604123878, 603941040, 603885689, 603733940, 603551407, 603233948, 603182144, 602847252, 602325058, 602490044, 602545242, 602305336, 602070160, 601670494, 601604385, 601716766, 601125374, 600489693, 600396614, 600405045, 600500946, 600720596, 600891113, 600686226, 600152588, 599614334, 599482079, 599462852, 599156532, 598976364, 598734894, 598612862, 598438721, 598071022, 598084488, 597958488, 597633781, 597327156, 597165375, 597098961, 596662788, 596356735, 596425896, 596476440, 596370850, 595971680, 595698853, 595860977, 595451813, 594877586, 595012627, 594889488, 594778671, 594872398, 594605980, 594391937, 594154930, 593776894, 593368225, 593088188, 593263779, 593578796, 593501930, 593013344, 592727699, 592754021, 592434387, 592115097, 591913490, 591393051, 590904694, 590664253, 590905151, 591033669, 590717468, 590461998, 590086365]
2686.8E90086365j74217l03193m20265J7548k33460l02200K67830L58696m74396q12302
2696.4E88010406k71492j24092l71551l50113k1820j97601k86255o1264q9302M8866
2706E86285782j2398o22368r80186k82288K56081j48926m26407j62353N0163j08872
2715.7E83848228m13284n58739j40266L2005L1853j87454m39873P1945k06489l18909
2725.3E81719017j34544m77105o21566o26374J39733R3803n13840l18374N8555L21923
2735E79641228o0501n49355q27599l45649J10054q1520j82457k52648k2049j71508
2744.6E77257996l21274k52075k2850p0420o04210j58157j7853k79884p5836M7607
2754.3E75503044k58407m72794k9068k34833n74379n53398k13013j2359k19345P6637
$$ y = [590086365, 589912148, 589608955, 589188690, 589206238, 588972778, 588670578, 588938408, 589297104, 588822708, 588010406, 587738914, 587614822, 587243271, 586893158, 586871338, 586673737, 586387482, 586326218, 586236916, 586285782, 586273384, 585651016, 584670830, 584388542, 584644623, 584495697, 584069290, 583906937, 583957100, 583848228, 583434944, 582876205, 582735939, 582767944, 582799797, 582612343, 582172470, 582244415, 582037926, 581719017, 581584473, 581107368, 580485802, 579859428, 579999161, 580092964, 579579124, 579260750, 579319305, 579641228, 579580727, 579031372, 578203773, 577858124, 577968178, 577886658, 577704201, 577451553, 577429504, 577257996, 576936722, 576684647, 576661797, 576591377, 575987167, 575829010, 575811157, 575531273, 575455437, 575503044, 575244637, 574771843, 574742775, 574507942, 573933563, 573380165, 573167152, 573154793, 572935448, 573012085]
2763.9E73012085k14119m18968l49312n11513k62527j89133n6152m1161j68114j8882
2773.5E70782204L9978l89557p78656o13709k26288L5744l28255n77735k84310K4414
2783.2E67683830k69012l79639J40953j13067k64168n71327q48694l00446k70653k30064
2792.8E64577713j7395Q4915m00467q26683m38995n87807n80597k91748l36418J5335
2802.5E61197853O4659p04384p13424l47824l72239J02997j3771m55742n50689n35317
2812.1E57672119m29115m99535j01013k54517n89065m58145l97873j45416n36042n37796
2821.8E53723602k47268m24157k60925n07507o31867l90434l70445k42539k82249k58141
2831.4E50108070l60908n94940k30904l41797m95758k89078r54818q74138m02375o09436
$$ y = [573012085, 572797966, 572378998, 572029686, 571518173, 571255646, 571066513, 571010361, 570969200, 570801086, 570782204, 570822182, 570432625, 569653969, 569040260, 568813972, 568849716, 568521461, 567943726, 567659416, 567683830, 567414818, 567035179, 567176132, 567063065, 566798897, 566227570, 565378876, 565078430, 564807777, 564577713, 564560318, 564645233, 564244766, 563418083, 562979088, 562391281, 561810684, 561518936, 561182518, 561197853, 561262512, 560558128, 559844704, 559496880, 559124641, 559227638, 559213867, 558758125, 558207436, 557672119, 557243004, 556743469, 556642456, 556387939, 555798874, 555340729, 554942856, 554797440, 554261398, 553723602, 553476334, 553052177, 552791252, 552283745, 551651878, 551261444, 550890999, 550648460, 550366211, 550108070, 549747162, 549152222, 548921318, 548579521, 548083763, 547794685, 546839867, 545965729, 545563354, 544953918]
2841.1E44953918k87284l84140q77495p95555n19142k62795k65770o02608p11898l95394
2850.7E39851837j55487k20718n83344p41577m41742n3406l56140q01353m28849n04264
2860.3E35564957m70848j29853k67410k21024m33540k80914r2621n31616m16451j66168
2870E32554512k23083k11068j77040l80211j80626J11466m59976m92745j18522p0687
2879.6E30352020K84806j20507o35986k58217o7825M12750J32027r77478q18329l26195
2889.3E27977066L43246M59557o83632j067734m32815J49879j83830o34994o83365
2897.9E25243378q35343l77235N1269l46298p18231n88608l41911m43649r16520o41861
2907.6E20084991m4632m39376l59536N7679l75748r52797o64062j10741m41513j35689
$$ y = [544953918, 544666634, 544282494, 543404999, 542609444, 542090302, 541827507, 541561737, 540959129, 540247231, 539851837, 539696350, 539475632, 538892288, 538150711, 537708969, 537655563, 537299423, 536498070, 536069221, 535564957, 535094109, 534964256, 534696846, 534475822, 534042282, 533761368, 533668747, 533137131, 532720680, 532554512, 532331429, 532120361, 531943321, 531563110, 531382484, 531493950, 531033974, 530541229, 530422707, 530352020, 530636826, 530516319, 529880333, 529622116, 529554291, 529967041, 530099068, 529121590, 528303261, 527977066, 528320312, 528779869, 528096237, 527028503, 526595688, 526745567, 526561737, 525926743, 525243378, 524408035, 524030800, 524082069, 523735771, 523017540, 522428932, 522087021, 521643372, 520726852, 520084991, 520040359, 519600983, 519241447, 519299126, 518923378, 517970581, 517306519, 517195778, 516754265, 516618576]
2917.2E16618576L5629p85675q67271l16620L06129j2512l99360j17302k8458K45628
2926.9E14678764K52419L20167K65885o0539N13458N61371M3983M80919M15764N7907
2936.5E17530098N76210O37856M57839N95894M37622M08631P77321O99615J38397M4098
2946.2E22303581o0882l42789R9754L97263J05018L74184J60484n24940m7379K30179
2955.8E22694473O2638r7542l7194K55814k31438j52206K40250K43415J36681k49596
2965.5E22865295o2027q7432j1521M06914J02768k7886M98162P55386K55013J31378
2975.1E24826050L07045L8109J40457N99823L55186R5024P62711N98907r6244K2888
2984.7E27649956K41165J76544k30980J29585P45430L12806l128K72255L32565J6250
$$ y = [516618576, 516654205, 515868530, 515001259, 514684639, 514990768, 514978256, 514578896, 514461594, 514433136, 514678764, 514931183, 515251350, 515517235, 515456696, 515970154, 516531525, 516575508, 517056427, 517472191, 517530098, 518106308, 518744164, 519202003, 519797897, 520235519, 520644150, 521421471, 522121086, 522259483, 522303581, 522242699, 521899910, 521999664, 522396927, 522501945, 522876129, 523036613, 522511673, 522464294, 522694473, 522757111, 522659569, 522622375, 522878189, 522646751, 522494545, 522734795, 522978210, 523114891, 522865295, 522803268, 522715836, 522704315, 523111229, 523213997, 523186111, 523684273, 524439659, 524694672, 524826050, 525133095, 525171204, 525311661, 525911484, 526266670, 526361694, 527124405, 527723312, 527627068, 527649956, 527891121, 528067665, 527836685, 527966270, 528711700, 529024506, 529021378, 529293633, 529626198, 529642448]
2994.4E29642448J8158n2719k75001j24245k51274n0240N33333L24478k91137n30014
3004E28943787k40784j07231k46620k79923l01361o7406P4463K3499j29776k73514
3013.7E27395134j70822m11949m28124k11296j92833k59857m86679k61307j50070k31514
3023.3E24590683k27776m55131p05452p63054l20358M577J08147o1607k95639j88485
3033E21685905j82304p9689m76341p56493o89010m98124j2283l29475k13662J60904
3042.6E18609428k18544l41720m80156o70014l77121m0397k77329l23677k90565m59557
3052.2E15130348n02586m44412o5499k87437m02909q8539k12860l71742n66063l55987
3061.9E11832314n6458r0752l20282q2779J55526k81220k64435l74679l19061k15264
$$ y = [529642448, 529660606, 529607887, 529332886, 529208641, 528957367, 528907127, 529440460, 529764938, 529473801, 528943787, 528703003, 528595772, 528349152, 528069229, 527767868, 527700462, 527774925, 527798424, 527668648, 527395134, 527224312, 526812363, 526384239, 526172943, 525980110, 525720253, 525233574, 524972267, 524822197, 524590683, 524362907, 523907776, 523202324, 522439270, 522118912, 522123489, 522231636, 522170029, 521874390, 521685905, 521503601, 521423912, 520947571, 520191078, 519502068, 519003944, 518991661, 518662186, 518448524, 518609428, 518390884, 518049164, 517569008, 516898994, 516521873, 516481476, 516204147, 515880470, 515589905, 515130348, 514627762, 514183350, 514117851, 513830414, 513427505, 513338966, 513126106, 512754364, 512188301, 511832314, 511775856, 511685104, 511364822, 511282043, 511437569, 511156349, 510891914, 510517235, 510198174, 509982910]
3071.5E09982910m29153k38037j69945K40517p3090p04422m26407n55153k07825N91584
3081.2E08010979K61459n61562m95338k26059n07011m55513o7139K27203P3243p40166
3090.8E05520096j058350k83355J19438k44446m84314k87132j6747J0071o4507n86853
3100.5E02623901m54712L8720k55814l40385k19880J11504k47421o50521j99623k52800
3110.1E00152969j83029j34201N493L16124K0066l06435k96364j93214m35219m64859
3119.8D98481331l33939j60637j91536m30374j28402j59340j51482L090J44234j6518
3129.4D97056427o48460k06833L12805l2311m77027k25296L78608M35028J16196m61121
3139D96248016p25937n95893J21154M02108r1362j29395o75850p08046n9204K594l9978
$$ y = [509982910, 509553757, 509315720, 509145775, 509386292, 509313202, 508608780, 508182373, 507627220, 507419395, 508010979, 508272438, 507710876, 507215538, 506989479, 506482468, 506026955, 505959816, 506187019, 506260262, 505520096, 504461746, 504178391, 504297829, 504053383, 503569069, 503281937, 503265190, 503275261, 503210754, 502623901, 502169189, 502207909, 501952095, 501611710, 501391830, 501503334, 501255913, 500605392, 500405769, 500152969, 499969940, 499835739, 499841232, 500157356, 500177422, 499870987, 499574623, 499381409, 498946190, 498481331, 498147392, 497986755, 497795219, 497364845, 497236443, 497077103, 496925621, 496928711, 497072945, 497056427, 496407967, 496201134, 496513939, 496481628, 496004601, 495779305, 496157913, 496592941, 496709137, 496248016, 495522079, 494926186, 495047340, 495449448, 495358086, 495228691, 494552841, 493844795, 493785591, 493788185, 493748207]
3149.6D93748207j51215j53465l57628l80897j94130j32179O294j60790l45687o40107
3159.3D91238403n44433R6740L08609P0153l28331l31002j82037j29051k03972n46265
3168.9D89448814j33247J91498l32489o36635n77698J37062O1951q35419n16433k52419
3178.6D86554985j77002Q9722Q0261k9411n93033n81627j40648k56157m74968k28081
3188.2D84244041Q8273k41204l61557l0784J36337j41029m06914m17214n09376m75578
3197.9D81884995k54975L67928M67720j66512o49757p12242j60332R232l63617p35207
3207.5D79687233n03731r9029L7956K87437j73759m92554l78685j04790P5684k79465
3217.2D78056297k26326l70826m00048j26610j4419j23482n14870K13929O50520k70843
$$ y = [493748207, 493596992, 493443527, 493085899, 492705002, 492510872, 492378693, 492384987, 492224197, 491878510, 491238403, 490693970, 490790710, 491099319, 491169472, 490841141, 490510139, 490328102, 490199051, 489995079, 489448814, 489315567, 489507065, 489174576, 488537941, 487960243, 488097305, 488159256, 487323837, 486807404, 486554985, 486377983, 486467705, 486547966, 486518555, 485925522, 485343895, 485203247, 484947090, 484472122, 484244041, 484332314, 484091110, 483729553, 483698769, 483835106, 483694077, 483287163, 482869949, 482360573, 481884995, 481630020, 481997948, 482465668, 482299156, 481649399, 480937157, 480776825, 480786057, 480422440, 479687233, 479183502, 479084473, 479122429, 479409866, 479236107, 478743553, 478364868, 478260078, 478335762, 478056297, 477829971, 477459145, 477059097, 476932487, 476918068, 476794586, 476279716, 476493645, 477144165, 476873322]
3226.8D76873322j098366q00858J52359J49727j3657n8250n79605l49464L14140n5618
3236.4D74533730k37847K42272k65694n25551l7956R7580J3199j21651j06392m34799
3246.1D73156891m55361J1406r5977j25161j73530m22325J8043K38495o4468l03269
3255.7D71784744n39512k6780K36741k51275k31514q0375J08032P4234k16942k20833
3265.4D70636520j48697m1084J06316K78358n3863m89159k96554o3172J22109L36074
3275D70386848m9705q64258o38161o3896Q9531M75235M18816P5798l50914m93164O2065
3285.6D69048195j85318n89905j36795J16882K8992l59764m97856j7891n9853P5112
3295.3D67421799M49943J91l01437n51110o32438O10J6136k38762R9030J63460l38822
$$ y = [476873322, 475774956, 474974098, 475126457, 475276184, 475262527, 475204277, 474624672, 474275208, 474589348, 474533730, 474295883, 474538155, 474272461, 473746910, 473708954, 473806534, 473819733, 473698082, 473591690, 473156891, 472701530, 472712936, 472616959, 472491798, 472318268, 471895943, 471913986, 472152481, 472088013, 471784744, 471245232, 471218452, 471455193, 471203918, 470972404, 470892029, 471000061, 471074295, 470857353, 470636520, 470487823, 470446739, 470553055, 470831413, 470777550, 470288391, 469991837, 469928665, 470050774, 470386848, 470337143, 469472885, 468834724, 468770828, 468860359, 469335594, 469754410, 469830208, 469479294, 468986130, 469048195, 468862877, 468272972, 468136177, 468253059, 468282051, 467922287, 467424431, 467406540, 467346687, 467421799, 467871742, 467871933, 467570496, 467019386, 466386948, 466387558, 466403694, 466164932, 466263962, 466427422, 466088600]
3305.9D66088600m93088k28538p13463j212273m74701L38364O9542p45888k64091O21528
3315.5D62985992m68597j002617r9907j77574k46391j82991l14827j58539j20201M1275
3325.2D60255623l55377p18117l24288n21698q86116o72340j94664K1057j53084j6784
3334.8D56434212j37215r84726q81157R957l14637p62787m02412j04065q0337p32308
3344.4D52044525r64775m06303j30043k21482n41839r4910p2060r16290j074219r32579
3354.1D46690025j60789N7983m85916l64647k91443k32696n71823j093102j121216
3362.8D42426376n78651j70174m77905j57547P3967l73726p62329o62079m14619o82488
3372.4D38220825m74396m35066n38444j93634p2441p2709n79452p60841m50592j91994
$$ y = [466088600, 465595512, 465366974, 464653511, 463441238, 462966537, 463304901, 463374443, 462628555, 462364464, 462985992, 462517395, 461514778, 461414871, 461237297, 460990906, 460807915, 460493088, 460334549, 460214348, 460255623, 459900246, 459182129, 458857841, 458336143, 457450027, 456777687, 456583023, 456604080, 456450996, 456434212, 456296997, 455312271, 454431114, 454441071, 454126434, 453363647, 452961235, 452857170, 452776833, 452044525, 451079750, 450673447, 450543404, 450321922, 449780083, 449685173, 449613113, 448696823, 447622604, 446690025, 446529236, 446587219, 446101303, 445736656, 445445213, 445212517, 444640694, 443547592, 442426376, 441847725, 441677551, 441199646, 441042099, 441116066, 440742340, 439980011, 439317932, 438903313, 438220825, 437746429, 437311363, 436772919, 436579285, 436506844, 436434135, 435854683, 435093842, 434643250, 434451256]
3382.1D34451256J3313l49579l66287l16200p58553r5444N86319k59285p88230m41246
3391.7D31676064j62468j07918J15051J72157l52554k62527j53Q2931M8256k21443
3401.3D30987396k14233p37076p68280k90298J21727Q86039O12984j95351m86869k77558
3411D29638481J52092j9951p63588n17425M39644O06422L74031m9591J14479M56085
3420.6D30430679M20l32413m06418j56364L60565R54666L72162m62417L71131M41971
3430.3D31573982n47523k74163K03133L45650O97365L04260O21948P07092l19900r3041
3439.9D33218803K53029N23072J79214J36032O47659M42200J056900M88930L7804K70690
3449.6D37254333k4185N06554O71425P35130K22016R1629O11419Q56285R65882N90095
$$ y = [434451256, 434464569, 434114990, 433748703, 433432503, 432673950, 432578506, 433164825, 432905540, 432117310, 431676064, 431513596, 431405678, 431520729, 431692886, 431340332, 431077805, 431077652, 431160583, 431208839, 430987396, 430773163, 430036087, 429267807, 428977509, 429099236, 429985275, 430598259, 430402908, 429916039, 429638481, 429790573, 429770622, 429007034, 428489609, 428929253, 429535675, 429909706, 429860115, 429974594, 430430679, 430431099, 430098686, 429692268, 429535904, 429896469, 430851135, 431223297, 430760880, 431132011, 431573982, 431026459, 430752296, 430955429, 431301079, 431998444, 432302704, 432924652, 433631744, 433311844, 433218803, 433471832, 433994904, 434174118, 434310150, 434957809, 435400009, 436456909, 436945839, 436983643, 437254333, 437230148, 437736702, 438408127, 439143257, 439365273, 439456902, 440068321, 440924606, 441890488, 442480583]
3459.2D42480583P11365L56979L64380Q64907Q52241N94635K34947P37572N78308L39165
3468.8D48115082M59251L91083L48968M52805Q41370M83131Q22144Q89473M65202R74464
3478.5D54242973Q02880O6871K25640N89180Q545P58514J322823Q04443J059990Q19549
3488.1D60701408L83606K14768K61383O66160J191750O11954L3569J111298R73167
3496.8D66149063N42793O44837L49426K09732P36084J370125M92020K81257P27234
3505.5D71502571O13213Q18977J595573Q40760l98903P10792J021004J095276N96046
3514.2D78395309P43180J152801M41933J097794P24449M07371Q51174J372413J342659
3522.9D86529083j4152N74302N44663N58700J007882J054229Q85887R25599J489830
$$ y = [442480583, 443191948, 443548927, 443913307, 444778214, 445630455, 446225090, 446460037, 447197609, 447775917, 448115082, 448574333, 448965416, 449314384, 449767189, 450608559, 451091690, 451913834, 452803307, 453268509, 454242973, 455045853, 455112724, 455338364, 455927544, 455936089, 456694603, 458017426, 458821869, 459881859, 460701408, 461085014, 461299782, 461561165, 462227325, 463419075, 464031029, 464064598, 465175896, 466149063, 466691856, 467336693, 467686119, 467895851, 468631935, 470002060, 470494080, 470775337, 471502571, 472115784, 472934761, 474530334, 475371094, 474972191, 475682983, 476703987, 477799263, 478395309, 479138489, 480291290, 480733223, 481831017, 482555466, 482962837, 483814011, 485186424, 486529083, 486514931, 487089233, 487633896, 488192596, 489200478, 490254707, 491140594, 492066193, 493556023]
3531.5D93556023R37080Q59146M58603R59015Q05664K060J639595J264610L55187N44128
3541.2E01381111J741944J505508N03006N52025K32124J505699l1128M90647J713104
3549.9E09594040J363563J370545k49062J470642J251374J015281J398239K28882J465950
3558.5E18909454J208802P62481M98696J345787N60989m29001K141457K07748J144982
3567.2E26351395J010742J30386K556648J209221Q71468J231575J404114M13589O06804
3575.9E35785942J222344M74853K014580J088638N12238J366844J722374J465988M79774
3584.6E46133575K463112N72815j402893J029778l60451K121811K379875K118797J344948
3593.2E56401367O41403K044716r74121N45731K501106J250076J784630k17819N57823
$$ y = [493556023, 494493103, 495352249, 495810852, 496769867, 497575531, 497577591, 499217186, 500481796, 500836983, 501381111, 503123055, 504628563, 505131569, 505683594, 505915718, 507421417, 507390289, 507880936, 509594040, 510957603, 512328148, 512079086, 513549728, 514801102, 515816383, 517214622, 517443504, 518909454, 520118256, 520880737, 521379433, 522725220, 523286209, 522857208, 524998665, 525206413, 526351395, 527362137, 527492523, 530049171, 531258392, 532129860, 533361435, 534765549, 535179138, 535785942, 537008286, 537483139, 539497719, 540586357, 541098595, 542465439, 544187813, 545653801, 546133575, 548596687, 549169502, 547766609, 548796387, 548435936, 550557747, 552937622, 555056419, 556401367, 557042770, 559087486, 558113365, 558659096, 561160202, 562410278, 564194908, 563977089, 564534912]
3601.9E64534912K127495P09877J485176K187195J087341j133842Q05092l01438O18210
3610.6E72120018M783669M29878r21135L741340R4796J344604K228012Q13294M96101
3619.3E85130577q67462J458206K311745J308937J200256K227097J292915Q73108L455925
3628E98391304k128143n984574M118195L697319K631569N59196q5945R65805J474343
3636.6F03639069K189216P67861K13928J092300J111565K85759P53898J968880J967087
3645.3F13989563L381996J102715k516938J850968k12860k485314j78604L687706K775154
3654F21394386K148209K546196m893150J565704L337593L06931R86099L11661R92660
3662.7F28696289M01497L08762N75943k29K495422Q47397j040230Q73222l385887R27697
$$ y = [564534912, 566662407, 567372284, 568857460, 571044655, 572131996, 570998154, 571803246, 571501808, 572120018, 576903687, 577333565, 576412430, 580153770, 580248566, 581593170, 583821182, 584634476, 585130577, 584263115, 585721321, 588033066, 589342003, 590542259, 592769356, 594062271, 594935379, 598391304, 596263161, 590278587, 594396782, 598094101, 600725670, 601284866, 601198921, 602164726, 603639069, 605828285, 606596146, 606810074, 607902374, 609013939, 609299698, 610053596, 612022476, 613989563, 617371559, 618474274, 615957336, 617808304, 617595444, 615110130, 614931526, 618619232, 621394386, 623542595, 626088791, 621195641, 622761345, 626098938, 626405869, 627391968, 627703629, 628696289, 629097786, 629406548, 629982491, 629982262, 632477684, 633325081, 632284851, 633158073, 629772186, 630699883]
3672.3F30699883M086112N330506J94321j3706780J481743M875183K600708j813202
3680F33748474n26581P58362n5008L28331K55966j20277J427040J960526o982041p36198
3689.7F30058594N972252l473168j361770K248039q3046M47006q70895j168099M64058
3698.4F32232971L82Q59413k46582m731713k68936K699356J45798r63516n78804J478042
3708F30626411J894112m919815J111221Q86536q803291K302742K891464O03256J3962
3716.7F26606598L74069J42174k599678J25542L258285k814407l990860K406997J395951
3725.4F24904671m52729k125511J5755J022224O0501K565232l671265m499740M102096
3734F21921234k063751n957680J535187J653595r87549J385307K205773k650719J217575
$$ y = [630699883, 634785995, 640116501, 640310822, 626604042, 628085785, 632960968, 635561676, 633748474, 633221893, 633980255, 633925247, 634253578, 634509544, 634389267, 635816307, 637776833, 630794792, 630058594, 636030846, 632557678, 631195908, 633443947, 633360901, 633807907, 632937012, 631768913, 632232971, 632233353, 633092766, 632846184, 628114471, 627845535, 630544891, 630690689, 629727173, 629148369, 630626411, 632520523, 627600708, 628711929, 629598465, 620795174, 623097916, 625989380, 626592636, 626606598, 626980667, 627122841, 624523163, 624648705, 627906990, 625092583, 621101723, 623508720, 624904671, 624451942, 622326431, 622342186, 623364410, 623424911, 625990143, 622318878, 617819138, 621921234, 619857483, 613899803, 615434990, 617088585, 616101036, 617486343, 619692116, 617041397, 618258972]
3742.7F18258972N909119q930245q447761P070541L515053L018341m308853q419075
3750.4F07666092O023559l805542l097610M338303L195457J740646m463653M43077
3758.2F12040329L503151l912888q70590J736374J5831L8605J057968k583542k599602
3766.8F08425636J864510K961807o2027o112137P46384K019844K10037k68707j251526
3775.5F08533821K44789J86310J202660q39463n273666J777191J312485J90887P27845
3784.2F08062859k429276n02891M53987L91807L90320j121559l62282p3357J68000
3792.9F04977608k51999L05404J635895l060798k707024J423759K232628K803765o108666
3801.5F01250572n671348L069000J459808K803612K870445o591148k063866K894974
$$ y = [618258972, 624168091, 615237846, 606790085, 613860626, 617375679, 620394020, 616085167, 607666092, 613689651, 609884109, 606786499, 611124802, 614320259, 616060905, 611597252, 612040329, 615543480, 611630592, 610760002, 612496376, 612512207, 612550812, 613608780, 611025238, 608425636, 610290146, 613251953, 613189926, 607077789, 607824173, 609844017, 610054054, 609785347, 608533821, 608778610, 608964920, 610167580, 609328117, 604054451, 605831642, 607144127, 607335014, 608062859, 605633583, 605130692, 605584679, 605976486, 606366806, 605245247, 604882965, 604809608, 604977608, 604725609, 605031013, 606666908, 603606110, 600899086, 602322845, 604555473, 607359238, 601250572, 595579224, 598648224, 600108032, 602911644, 605782089, 599190941, 597127075, 600022049]
3809.3F00022049P89375o02722p10144o3400J429672L184013l504905q513794M127159
3817.9E96157303K831154K112350R62982j0493621J791076L290482P23343O94008r51310
3826.6E97117767k575035K98310J167068K097855M47502o173668J850357L910751n573082
3835.3E92567825k64282O213265l279496k771759L723755m128685j42441M044037k380180
3844E93582039k525902J412506K53220j77574K45933j062546J719628L593712j358261
3852.7E95682755O53610j4360504K142677O214523j910438m76532J449127J478157
3860.4E90873375K420425l874054r80949L671074l611832l112755J746674K751808
3868.1E89883766L158531p634124n190087M196778M166336J348152n820656J225929
$$ y = [600022049, 600811424, 600208702, 599498558, 599435158, 600864830, 604048843, 600543938, 592030144, 596157303, 598988457, 601100807, 602063789, 591570168, 593361244, 596651726, 597375069, 598069077, 597117767, 594542732, 594841042, 596008110, 598105965, 598553467, 592379799, 594230156, 598140907, 592567825, 592303543, 598516808, 595237312, 592465553, 596189308, 592060623, 591918182, 595962219, 593582039, 591056137, 592468643, 592721863, 592544289, 592790222, 591727676, 593447304, 597041016, 595682755, 596336365, 581975861, 584118538, 590333061, 588422623, 587946091, 589395218, 590873375, 593293800, 589419746, 588438797, 592109871, 588498039, 585385284, 587131958, 589883766, 593042297, 585408173, 580218086, 584414864, 588581200, 589929352, 584108696, 585334625]
3875.8E85334625K025757j029854R31626K409286l853721l921929L860970L73840q6746
3884.5E86043854J562729p016259J131478J780662P19147K773209j748772m874344
3892.2E80371704J921158J585846j621590P75719K82402M93851j69220n564423M415665
3900.9E82491112J063537l428573K303619l060722K16217O12335m6501Q81538m84619
3909.6E80547943K34184l63006k31323k19841q29659Q13446J839905j823692k349816
3918.2E77618141K103119p69119k354241J363984J382751N58548k385674j527824J295662
3926.9E77285347N94940K21024p81212j7204J162567j398583r24759M93660j62239
3935.6E76473541K30255J17722l07350n40123o62155R85565M35066k479553o26412
$$ y = [585334625, 587360382, 586330528, 587262154, 589671440, 585817719, 581895790, 585756760, 586130600, 586043854, 587606583, 580590324, 581721802, 583502464, 584221611, 586994820, 585246048, 580371704, 582292862, 583878708, 582257118, 583032837, 583315239, 583809090, 583639870, 578075447, 582491112, 583554649, 580126076, 582429695, 579368973, 579585190, 580197525, 580151024, 581032562, 580547943, 580782127, 580419121, 580187798, 579967957, 579138298, 579951744, 581791649, 579967957, 577618141, 579721260, 578952141, 576597900, 577961884, 579344635, 579903183, 577517509, 575989685, 577285347, 577880287, 578101311, 577320099, 577302895, 578465462, 577066879, 576142120, 576635780, 576473541, 576703796, 576821518, 576514168, 575974045, 575311890, 576297455, 576732521, 574252968, 573626556]
3944.3E73626556P11289J344681J054458j718445l48167m5738j552696M87175M39758
3953E73998871j488l3646l98979K12250M7073j11427l35884K6779j9150m14772N14527
3963.6E73484154n16205j155624N0048K1439l12691P9842L51906l4256m70696k53486
3973.2E71244431k2736j00823o5383l13836j33056j83373o65664L35121N80864o06156
3982.8E70069389m42276P0725o34461m75311N97191M58031J03836n8518m25033o31523
3992.5E68632050o4164N04074l5858m24957n04532j09749K9373N9281
4000.2E68085518
$$ y = [573626556, 574337845, 575682526, 576736984, 575018539, 574670372, 574624634, 573071938, 573559113, 573998871, 573997383, 573963737, 573564758, 573777008, 573824081, 573712654, 573376770, 573403549, 573384399, 572969627, 573484154, 572967949, 571812325, 571862373, 571883812, 571571121, 571650963, 572002869, 571968613, 571497917, 571244431, 571221695, 571120872, 571055489, 570741653, 570608597, 570425224, 569759560, 570094681, 570675545, 570069389, 569627113, 569697838, 569063377, 568588066, 569185257, 569643288, 569747124, 569688606, 569263573, 568632050, 568567886, 569071960, 569036102, 568611145, 568106613, 567996864, 568026237, 568085518]
##END=$$ End of the data block
